{"text_format":"3","workbook":"xlsx","n_sheets":6,"sheets":["INVENTORY","QA SAMPLE SIZE SHEET","INVENTORY LOG SHEET","TAGS","TAGS-BLANK","Data-PULLDOWNS"],"not_rendered":{"images":1,"external_links":2,"defined_names":22,"comments":2},"read":"whole","date_system":"1900"}

{"sheet":"INVENTORY","index":0,"n_rows":52,"n_cols":17,"rows_kept":52}
["#","MAKE","MODEL","PROC.","SPEED","MEM.","OPTICAL","WEBCAM","BATT.","LAPTOP SERIAL #","SN INPUT","HDD SERIAL #","HDD SIZE","FUNC. CODE","COS. CODE","PRE. SAN.","NON-DATA"]
[1,"DELL","LATITUDE 5330","I7-1265U",{"v":4.8,"d":"4.80"},"16G","NO","YES","YES","16YRMX3","16yrmx3","cs01N8303115Y242X","512G","F3","C5","ENCD","ND"]
[{"$f":"IF(B3=\"\",\"\",A2+1)","v":2},"DELL","LATITUDE 5330","I7-1265U",{"v":4.8,"d":"4.80"},"16G","NO","YES","YES","2CYRMX3","2cyrmx3","20208N457415","512G","F3","C5","ENCD","ND"]
[{"$f":"IF(B4=\"\",\"\",A3+1)","v":3},"DELL","LATITUDE 5330","I7-1265U",{"v":4.8,"d":"4.80"},"16G","NO","YES","YES","33ZRMX3","33zrmx3","sn9AN90181030B52F","512G","F3","C5","ENCD","ND"]
[4,"DELL","LATITUDE 5330","I7-1265U",{"v":4.8,"d":"4.80"},"16G","NO","YES","YES","37ZRMX3","37zrmx3","an9CN49421090C84L","512G","F3","C5","ENCD","ND"]
[5,"DELL","LATITUDE 5330","I7-1265U",{"v":4.8,"d":"4.80"},"16G","NO","YES","YES","4F6JFS3","4f6jfs3","cd03N7051111Y3Q5M","512G","F3","C5","ENCD","ND"]
[6,"DELL","LATITUDE 5330","I7-1265U",{"v":4.8,"d":"4.80"},"16G","NO","YES","YES","5NNRMX3","5nnrmx3","sn9AN86841330B51Q","512G","F3","C5","ENCD","ND"]
[7,"DELL","LATITUDE 5330","I7-1265U",{"v":4.8,"d":"4.80"},"16G","NO","YES","YES","5T9JFS3","5t9jfs3","20168Z453921","512G","F3","C5","ENCD","ND"]
[8,"DELL","LATITUDE 5330","I7-1265U",{"v":4.8,"d":"4.80"},"16G","NO","YES","YES","61PRMX3","61prmx3","s509NF0N212815","512G","F3","C5","ENCD","ND"]
[9,"DELL","LATITUDE 5330","I7-1265U",{"v":4.8,"d":"4.80"},"16G","NO","YES","YES","6GNSMX3","6gnsmx3","sn9AN79241340B44F","512G","F3","C5","ENCD","ND"]
[10,"DELL","LATITUDE 5330","I7-1265U",{"v":4.8,"d":"4.80"},"16G","NO","YES","YES","6PPSMX3","6ppsmx3","991PC3GTPQFN","512G","F3","C5","ENCD","ND"]
[11,"DELL","LATITUDE 5330","I7-1265U",{"v":4.8,"d":"4.80"},"16G","NO","YES","YES","80LSMX3","80lsmx3","cs06N169813906F0Q","512G","F3","C5","ENCD","ND"]
[12,"DELL","LATITUDE 5330","I7-1265U",{"v":4.8,"d":"4.80"},"16G","NO","YES","YES","83QSMX3","83qsmx3","1951AD444020","512G","F3","C5","ENCD","ND"]
[13,"DELL","LATITUDE 5330","I7-1265U",{"v":4.8,"d":"4.80"},"16G","NO","YES","YES","8YMSMX3","8ymsmx3","sn9AN74551100AU38","512G","F3","C5","ENCD","ND"]
[14,"DELL","LATITUDE 5330","I7-1265U",{"v":4.8,"d":"4.80"},"16G","NO","YES","YES","B3QSMX3","b3qsmx3","sn9AN90181030B52P","512G","F3","C5","ENCD","ND"]
[15,"DELL","LATITUDE 5330","I7-1265U",{"v":4.8,"d":"4.80"},"16G","NO","YES","YES","B8ZRMX3","b8zrmx3","s509NF0N320194","512G","F3","C5","ENCD","ND"]
[16,"DELL","LATITUDE 5330","I7-1265U",{"v":4.8,"d":"4.80"},"16G","NO","YES","YES","C1PRMX3","c1prmx3","sn9AN74551100AU2V","512G","F3","C5","ENCD","ND"]
[17,"DELL","LATITUDE 5330","I7-1265U",{"v":4.8,"d":"4.80"},"16G","NO","YES","YES","C1PSMX3","c1psmx3","50BPC6TYQTML","512G","F3","C5","ENCD","ND"]
[18,"DELL","LATITUDE 5330","I7-1265U",{"v":4.8,"d":"4.80"},"16G","NO","YES","YES","C6CJFS3","c6cjfs3","sn9AN82631270B124","512G","F3","C5","ENCD","ND"]
[19,"DELL","LATITUDE 5330","I7-1265U",{"v":4.8,"d":"4.80"},"16G","NO","YES","YES","CKYRMX3","ckyrmx3","pheh4032079X512F","512G","F3","C5","ENCD","ND"]
[20,"DELL","LATITUDE 5330","I7-1265U",{"v":4.8,"d":"4.80"},"16G","NO","YES","YES","CMYRMX3","cmyrmx3","50APC87QQTML","512G","F3","C5","ENCD","ND"]
[21,"DELL","LATITUDE 5330","I7-1265U",{"v":4.8,"d":"4.80"},"16G","NO","YES","YES","CNPSMX3","cnpsmx3","ss9BN53251060BB0O","512G","F3","C5","ENCD","ND"]
[22,"DELL","LATITUDE 5330","I7-1265U",{"v":4.8,"d":"4.80"},"16G","NO","YES","YES","DJ4CLS3","dj4cls3","sn9AN90181030B52Q","512G","F3","C5","ENCD","ND"]
[23,"DELL","LATITUDE 5330","I7-1265U",{"v":4.8,"d":"4.80"},"16G","NO","YES","YES","F4MRMX3","f4mrmx3","sn9AN79241340B453","512G","F3","C5","ENCD","ND"]
[24,"DELL","LATITUDE 5330","I7-1265U",{"v":4.8,"d":"4.80"},"16G","NO","YES","YES","FSWGLS3","fswgls3","sn9AN86841330B511","512G","F3","C5","ENCD","ND"]
[25,"DELL","LATITUDE 5330","I7-1265U",{"v":4.8,"d":"4.80"},"16G","NO","YES","YES","GG9JFS3","GG9JFS3","sn9AN82631210B245","512G","F3","C5","ENCD","ND"]
[26,"DELL","LATITUDE 5330","I7-1265U",{"v":4.8,"d":"4.80"},"16G","NO","YES","YES","HS9JFS3","hs9jfs3","sn9AN82571020AU2X","512G","F3","C5","ENCD","ND"]
[27,"DELL","LATITUDE 5330","I7-1265U",{"v":4.8,"d":"4.80"},"16G","NO","YES","YES","HYYRMX3","hyyrmx3","10PPC9SAPTML","512G","F3","C5","ENCD","ND"]
[28,"DELL","LATITUDE 5330","I7-1265U",{"v":4.8,"d":"4.80"},"16G","NO","YES","YES","J1NSMX3","j1nsmx3","sn9AN86841150B52S","512G","F3","C5","ENCD","ND"]
[29,"DELL","LATITUDE 5330","I7-1265U",{"v":4.8,"d":"4.80"},"16G","NO","YES","YES","J91JFS3","j91jfs3","an9CN49421010C92W","512G","F3","C5","ENCD","ND"]
[30,"DELL","LATITUDE 5330","I7-1265U",{"v":4.8,"d":"4.80"},"16G","NO","YES","YES","JSZCLS3","jszcls3","sn9AN79241260B441","512G","F3","C5","ENCD","ND"]
[31,"DELL","LATITUDE 5330","I7-1265U",{"v":4.8,"d":"4.80"},"16G","NO","YES","YES","JZNRMX3","jznrmx3","sn9AN82631130B449","512G","F3","C5","ENCD","ND"]
[32,"DELL","LATITUDE 5430","I5-1235U",{"v":4.4,"d":"4.40"},"16G","NO","YES","YES","112MHW3","112MHW3","ns03N4658102Y3H2N","512G","F3","C5","ENCD","ND"]
[33,"DELL","LATITUDE 5430","I5-1235U",{"v":4.4,"d":"4.40"},"16G","NO","YES","YES","1TGQQV3","1TGQQV3","s509NF0N211663","512G","F3","C5","ENCD","ND"]
[34,"DELL","LATITUDE 5430","I5-1235U",{"v":4.4,"d":"4.40"},"16G","NO","YES","YES","22YZRV3","22YZRV3","20208N445114","512G","F3","C5","ENCD","ND"]
[35,"DELL","LATITUDE 5430","I5-1235U",{"v":4.4,"d":"4.40"},"16G","NO","YES","YES","36CRQV3","36CRQV3","sn9AN86841150B51J","512G","F3","C5","ENCD","ND"]
[36,"DELL","LATITUDE 5430","I5-1235U",{"v":4.4,"d":"4.40"},"16G","NO","YES","YES","3Z7BHW3","3Z7BHW3","sn9AN82631120B14N","512G","F3","C5","ENCD","ND"]
[37,"DELL","LATITUDE 5430","I5-1235U",{"v":4.4,"d":"4.40"},"16G","NO","YES","YES","5M4TTV3","5M4TTV3","tw07YGY09DH0002J00XA","512G","F3","C5","ENCD","ND"]
[38,"DELL","LATITUDE 5430","I5-1235U",{"v":4.4,"d":"4.40"},"16G","NO","YES","YES","5Z2BHW3","5Z2BHW3","sn9AN82571020AU0O","512G","F3","C5","ENCD","ND"]
[39,"DELL","LATITUDE 5430","I5-1235U",{"v":4.4,"d":"4.40"},"16G","NO","YES","YES","6C1TTV3","6C1TTV3","s509NF0N212001","512G","F3","C5","ENCD","ND"]
[40,"DELL","LATITUDE 5430","I5-1235U",{"v":4.4,"d":"4.40"},"16G","NO","YES","YES","6V4WRV3","6V4WRV3","sn9AN74551100AU5E","512G","F3","C5","ENCD","ND"]
[41,"DELL","LATITUDE 5430","I5-1235U",{"v":4.4,"d":"4.40"},"16G","NO","YES","YES","7Y0PQV3","7Y0PQV3","sn9AN86841150B51O","512G","F3","C5","ENCD","ND"]
[42,"DELL","LATITUDE 5430","I5-1235U",{"v":4.4,"d":"4.40"},"16G","NO","YES","YES","BYBKHW3","bybkhw3",201691440403,"512G","F3","C5","ENCD","ND"]
[43,"DELL","LATITUDE 5430","I5-1235U",{"v":4.4,"d":"4.40"},"16G","NO","YES","YES","G1YZRV3","g1YZRV3","nn05N708911505H3R","512G","F3","C5","ENCD","ND"]
[44,"DELL","LATITUDE 5430","I5-1235U",{"v":4.4,"d":"4.40"},"16G","NO","YES","YES","G8N0SV3","g8N0SV3","2020A7809145","512G","F3","C5","ENCD","ND"]
[45,"HP","ELITEBOOK 630 G9","I5-1245U",{"v":3.9,"d":"3.90"},"16G","NO","YES","YES","2TK3420LCK","2TK3420LCK","s509NF0N320162","512G","F3","C5","ENCD","ND"]
[46,"HP","ELITEBOOK 630 G9","I5-1245U",{"v":3.9,"d":"3.90"},"16G","NO","YES","YES","2TK3330208","2TK3330208","sn9AN86841150B50W","512G","F3","C5","ENCD","ND"]
[47,"HP","ELITEBOOK 630 G9","I5-1245U",{"v":3.9,"d":"3.90"},"16G","NO","YES","YES","2TK333024T","2TK333024T","sn9AN79241360AU14","512G","F3","C5","ENCD","ND"]
[48,"HP","ELITEBOOK 630 G9","I5-1245U",{"v":3.9,"d":"3.90"},"16G","NO","YES","YES","2TK333027J","2TK333027J","sn9AN86841150B52L","512G","F3","C5","ENCD","ND"]
[49,"HP","ELITEBOOK 630 G9","I5-1245U",{"v":3.9,"d":"3.90"},"16G","NO","YES","YES","2TK333027R","2TK333027R","tw07YGY09DH0002J01K5","512G","F3","C5","ENCD","ND"]
[50,"HP","ELITEBOOK 630 G9","I5-1245U",{"v":3.9,"d":"3.90"},"16G","NO","YES","YES","2TK333028W","2TK333028W","20153B801936","512G","F3","C5","ENCD","ND"]
[51,"HP","ELITEBOOK 630 G9","I5-1245U",{"v":3.9,"d":"3.90"},"16G","NO","YES","YES","2TK3330291","2TK3330291","50APC6B9QTML","512G","F3","C5","ENCD","ND"]

{"sheet":"QA SAMPLE SIZE SHEET","index":1,"n_rows":27,"n_cols":7,"rows_kept":27,"merged":[[0,0,0,6],[1,0,1,6],[2,1,2,2],[3,0,3,6],[4,1,4,3],[5,1,5,3],[6,1,6,3],[7,1,7,3],[8,1,8,3],[9,1,9,3],[10,1,10,3],[11,1,11,3],[12,1,12,3],[13,1,13,3],[14,1,14,3],[16,0,16,6],[17,0,21,6],[24,0,24,6],[25,0,25,6],[26,0,30,6]]}
[{"$f":"NOW()","v":"2026-01-06T11:13:00.960"}]
["DEPARTMENT: LAPTOPS"]
["LOT# ","L-44"]
["\nNOTE: A sample size test of any material that is purchased as tested or data wiped will be conducted on\nindividual shipments.  The sample size may vary between 1% and 5% based on results on initial sampling.  \nIf testing Failure Rate of initial sampling is greater than 1%, well will continue to test to 5% of the LOT. If the Failure Rate of initial sampling is greater than 5% the entire Lot will be re-tested. If the test results are 1% or Less, the Lot can be processed for Bid. \n\nThe Quality Assurance Clerk will conduct a Full Function Test along with a Visual Inspection on 5 or more radom items within the LOT. Record the results below."]
["#","DISCRIPTION OF PRODUCT",null,null,"SERIAL NUMBER\nOR SKU","FUNCTION &\n COSMETIC CODE","PASS - FAIL"]
[1,{"$f":"TRANSPOSE(INVENTORY!C2)","v":"LATITUDE 5330"},null,null,{"$f":"TRANSPOSE(INVENTORY!J2)","v":"16YRMX3"},"F3-C5","PASS"]
[2,{"$f":"TRANSPOSE(INVENTORY!C3)","v":"LATITUDE 5330"},null,null,{"$f":"TRANSPOSE(INVENTORY!J3)","v":"2CYRMX3"},"F3-C5","PASS"]
[3,{"$f":"TRANSPOSE(INVENTORY!C4)","v":"LATITUDE 5330"},null,null,{"$f":"TRANSPOSE(INVENTORY!J4)","v":"33ZRMX3"},"F3-C5","PASS"]
[4,{"$f":"TRANSPOSE(INVENTORY!C5)","v":"LATITUDE 5330"},null,null,{"$f":"TRANSPOSE(INVENTORY!J5)","v":"37ZRMX3"},"F3-C5","PASS"]
[5,{"$f":"TRANSPOSE(INVENTORY!C6)","v":"LATITUDE 5330"},null,null,{"$f":"TRANSPOSE(INVENTORY!J6)","v":"4F6JFS3"},"F3-C5","PASS"]
[6]
[7]
[8]
[9]
[10]
[]
["PASS READY FOR BID"]
["_____________________________________________________\nQUALITY ASSURANCE CLERK SIGNATURE"]
{"$rows_empty":7}
["FAIL REWORK ENTIRE LOT"]
["_____________________________________________________\nQUALITY ASSURANCE CLERK SIGNATURE"]

{"sheet":"INVENTORY LOG SHEET","index":2,"n_rows":24,"n_cols":9,"rows_kept":24,"merged":[[0,0,0,10],[1,0,1,10],[2,1,2,10],[3,0,7,0],[3,1,3,5],[3,6,3,10],[4,1,4,5],[4,6,4,10],[5,1,5,5],[5,6,5,10],[6,1,6,5],[6,6,6,10],[7,1,7,10],[8,0,8,10],[9,0,14,0],[9,1,9,10],[10,1,10,5],[10,6,10,10],[11,1,11,5],[11,6,11,10],[12,1,12,5],[12,6,12,10],[13,3,13,5],[13,8,13,10],[14,1,14,10],[15,0,15,10],[16,0,19,0],[16,1,16,10],[17,2,17,10],[18,2,18,10],[19,1,19,10],[20,0,20,10],[21,0,23,0],[21,1,21,10],[22,1,22,10],[23,1,23,10]]}
["INVENTORY \nLOG SHEET "]
[]
[null,"DEPARTMENT CHECK LIST"]
["DEPT","DEPARTMENT:",{"$nulls":4},"LAPTOPS"]
[null,"DESCRIPTION:",{"$nulls":4},"12th GEN"]
[null,"COUNT:",{"$nulls":4},51]
[null,"LOT#",{"$nulls":4},"L-44"]
[null,"DEPARTMENT SIGNATURE:_______________________DATE:______________"]
[]
["FORK-LIFT","FORK-LIFT CHECK LIST"]
[null,"GROSS WEIGHT:"]
[null,"TARE WEIGHT:"]
[null,"NET WEIGHT:"]
[null,null,"o","WEIGHED ON SCALE #1",{"$nulls":3},"X","WEIGHED ON SCALE #2"]
[null,"FORK-LIFT DRIVER SIGNATURE:____________________DATE:______________"]
[]
["QA CLERK","QUALITY ASSURANCE CLERK CHECK LIST"]
[null,"o","Inspect the integrity of the shipment, Sign the Tare Sheet and place in Finished Product."]
[null,"o","Attach 5 Tare Sheets - 1 on each side of the Gaylord/Pallet including the Top of the shipment."]
[null,"QA SEAL_______________________INSPECTION DATE:___________________"]
[]
["CLERK","CLERK INVENTORY CHECK LIST"]
[null,"PRODUCT ENTERED INTO INVENTORY"]
[null,"FRONT OFFICE CLERK SIGNATURE:_________________DATE:______________"]

{"sheet":"TAGS","index":3,"n_rows":2899,"n_cols":11,"rows_kept":2899,"merged":[[15,8,15,10],[44,2,44,4],[44,8,44,10],[73,2,73,4],[73,8,73,10],[102,2,102,4],[102,8,102,10],[131,2,131,4],[131,8,131,10],[160,2,160,4],[160,8,160,10],[189,2,189,4],[189,8,189,10],[218,2,218,4],[218,8,218,10],[247,2,247,4],[247,8,247,10],[270,0,270,1],[276,2,276,4],[276,8,276,10],[284,2,284,4],[284,8,284,10],[288,3,288,4],[288,9,288,10],[290,0,291,4],[290,6,291,10],[298,0,298,1],[298,6,298,7],[302,0,302,1],[302,6,302,7],[305,2,305,4],[305,8,305,10],[307,0,307,4],[307,6,307,10],[311,2,311,4],[311,8,311,10],[334,2,334,4],[334,8,334,10],[363,2,363,4],[363,8,363,10],[392,2,392,4],[392,8,392,10],[421,2,421,4],[421,8,421,10],[450,2,450,4],[450,8,450,10],[479,2,479,4],[479,8,479,10],[2023,2,2023,4],[2023,8,2023,10],[2024,2,2024,4],[2024,8,2024,10],[2043,0,2043,1],[2043,6,2043,7],[2044,0,2044,1],[2044,6,2044,7],[2045,0,2045,1],[2045,2,2045,4],[2045,6,2045,7],[2045,8,2045,10],[2046,0,2046,1],[2046,6,2046,7],[2047,0,2047,4],[2047,6,2047,10],[2051,2,2051,4],[2051,8,2051,10],[2052,2,2052,4],[2052,8,2052,10],[2053,2,2053,4],[2053,8,2053,10],[2057,3,2057,4],[2057,9,2057,10],[2059,0,2060,4],[2059,6,2060,10],[2067,0,2067,1],[2067,6,2067,7],[2068,0,2068,1],[2068,6,2068,7],[2069,0,2069,1],[2069,6,2069,7],[2070,0,2070,1],[2070,6,2070,7],[2071,0,2071,1],[2071,6,2071,7],[2072,0,2072,1],[2072,6,2072,7],[2073,0,2073,1],[2073,6,2073,7],[2074,0,2074,1],[2074,2,2074,4],[2074,6,2074,7],[2074,8,2074,10],[2075,0,2075,1],[2075,6,2075,7],[2076,0,2076,4],[2076,6,2076,10],[2080,2,2080,4],[2080,8,2080,10],[2081,2,2081,4],[2081,8,2081,10],[2082,2,2082,4],[2082,8,2082,10],[2086,3,2086,4],[2086,9,2086,10],[2088,0,2089,4],[2088,6,2089,10],[2096,0,2096,1],[2096,6,2096,7],[2097,0,2097,1],[2097,6,2097,7],[2098,0,2098,1],[2098,6,2098,7],[2099,0,2099,1],[2099,6,2099,7],[2100,0,2100,1],[2100,6,2100,7],[2101,0,2101,1],[2101,6,2101,7],[2102,0,2102,1],[2102,6,2102,7],[2103,0,2103,1],[2103,2,2103,4],[2103,6,2103,7],[2103,8,2103,10],[2104,0,2104,1],[2104,6,2104,7],[2105,0,2105,4],[2105,6,2105,10],[2109,2,2109,4],[2109,8,2109,10],[2110,2,2110,4],[2110,8,2110,10],[2111,2,2111,4],[2111,8,2111,10],[2115,3,2115,4],[2115,9,2115,10],[2117,0,2118,4],[2117,6,2118,10],[2125,0,2125,1],[2125,6,2125,7],[2126,0,2126,1],[2126,6,2126,7],[2127,0,2127,1],[2127,6,2127,7],[2128,0,2128,1],[2128,6,2128,7],[2129,0,2129,1],[2129,6,2129,7],[2130,0,2130,1],[2130,6,2130,7],[2131,0,2131,1],[2131,6,2131,7],[2132,0,2132,1],[2132,2,2132,4],[2132,6,2132,7],[2132,8,2132,10],[2133,0,2133,1],[2133,6,2133,7],[2134,0,2134,4],[2134,6,2134,10],[2138,2,2138,4],[2138,8,2138,10],[2139,2,2139,4],[2139,8,2139,10],[2140,2,2140,4],[2140,8,2140,10],[2144,3,2144,4],[2144,9,2144,10],[2146,0,2147,4],[2146,6,2147,10],[2154,0,2154,1],[2154,6,2154,7],[2155,0,2155,1],[2155,6,2155,7],[2156,0,2156,1],[2156,6,2156,7],[2157,0,2157,1],[2157,6,2157,7],[2158,0,2158,1],[2158,6,2158,7],[2159,0,2159,1],[2159,6,2159,7],[2160,0,2160,1],[2160,6,2160,7],[2161,0,2161,1],[2161,2,2161,4],[2161,6,2161,7],[2161,8,2161,10],[2162,0,2162,1],[2162,6,2162,7],[2163,0,2163,4],[2163,6,2163,10],[2167,2,2167,4],[2167,8,2167,10],[2168,2,2168,4],[2168,8,2168,10],[2169,2,2169,4],[2169,8,2169,10],[2173,3,2173,4],[2173,9,2173,10],[2175,0,2176,4],[2175,6,2176,10],[2183,0,2183,1],[2183,6,2183,7],[2184,0,2184,1],[2184,6,2184,7],[2185,0,2185,1],[2185,6,2185,7],[2186,0,2186,1],[2186,6,2186,7],[2187,0,2187,1],[2187,6,2187,7],[2188,0,2188,1],[2188,6,2188,7],[2189,0,2189,1],[2189,6,2189,7],[2190,0,2190,1],[2190,2,2190,4],[2190,6,2190,7],[2190,8,2190,10],[2191,0,2191,1],[2191,6,2191,7],[2192,0,2192,4],[2192,6,2192,10],[2196,2,2196,4],[2196,8,2196,10],[2197,2,2197,4],[2197,8,2197,10],[2198,2,2198,4],[2198,8,2198,10],[2202,3,2202,4],[2202,9,2202,10],[2204,0,2205,4],[2204,6,2205,10],[2212,0,2212,1],[2212,6,2212,7],[2213,0,2213,1],[2213,6,2213,7],[2214,0,2214,1],[2214,6,2214,7],[2215,0,2215,1],[2215,6,2215,7],[2216,0,2216,1],[2216,6,2216,7],[2217,0,2217,1],[2217,6,2217,7],[2218,0,2218,1],[2218,6,2218,7],[2219,0,2219,1],[2219,2,2219,4],[2219,6,2219,7],[2219,8,2219,10],[2220,0,2220,1],[2220,6,2220,7],[2221,0,2221,4],[2221,6,2221,10],[2225,2,2225,4],[2225,8,2225,10],[2226,2,2226,4],[2226,8,2226,10],[2227,2,2227,4],[2227,8,2227,10],[2231,3,2231,4],[2231,9,2231,10],[2233,0,2234,4],[2233,6,2234,10],[2241,0,2241,1],[2241,6,2241,7],[2242,0,2242,1],[2242,6,2242,7],[2243,0,2243,1],[2243,6,2243,7],[2244,0,2244,1],[2244,6,2244,7],[2245,0,2245,1],[2245,6,2245,7],[2246,0,2246,1],[2246,6,2246,7],[2247,0,2247,1],[2247,6,2247,7],[2248,0,2248,1],[2248,2,2248,4],[2248,6,2248,7],[2248,8,2248,10],[2249,0,2249,1],[2249,6,2249,7],[2250,0,2250,4],[2250,6,2250,10],[2254,2,2254,4],[2254,8,2254,10],[2255,2,2255,4],[2255,8,2255,10],[2256,2,2256,4],[2256,8,2256,10],[2260,3,2260,4],[2260,9,2260,10],[2262,0,2263,4],[2262,6,2263,10],[2270,0,2270,1],[2270,6,2270,7],[2271,0,2271,1],[2271,6,2271,7],[2272,0,2272,1],[2272,6,2272,7],[2273,0,2273,1],[2273,6,2273,7],[2274,0,2274,1],[2274,6,2274,7],[2275,0,2275,1],[2275,6,2275,7],[2276,0,2276,1],[2276,6,2276,7],[2277,0,2277,1],[2277,2,2277,4],[2277,6,2277,7],[2277,8,2277,10],[2278,0,2278,1],[2278,6,2278,7],[2279,0,2279,4],[2279,6,2279,10],[2283,2,2283,4],[2283,8,2283,10],[2284,2,2284,4],[2284,8,2284,10],[2285,2,2285,4],[2285,8,2285,10],[2289,3,2289,4],[2289,9,2289,10],[2291,0,2292,4],[2291,6,2292,10],[2299,0,2299,1],[2299,6,2299,7],[2300,0,2300,1],[2300,6,2300,7],[2301,0,2301,1],[2301,6,2301,7],[2302,0,2302,1],[2302,6,2302,7],[2303,0,2303,1],[2303,6,2303,7],[2304,0,2304,1],[2304,6,2304,7],[2305,0,2305,1],[2305,6,2305,7],[2306,0,2306,1],[2306,2,2306,4],[2306,6,2306,7],[2306,8,2306,10],[2307,0,2307,1],[2307,6,2307,7],[2308,0,2308,4],[2308,6,2308,10],[2312,2,2312,4],[2312,8,2312,10],[2313,2,2313,4],[2313,8,2313,10],[2314,2,2314,4],[2314,8,2314,10],[2318,3,2318,4],[2318,9,2318,10],[2320,0,2321,4],[2320,6,2321,10],[2328,0,2328,1],[2328,6,2328,7],[2329,0,2329,1],[2329,6,2329,7],[2330,0,2330,1],[2330,6,2330,7],[2331,0,2331,1],[2331,6,2331,7],[2332,0,2332,1],[2332,6,2332,7],[2333,0,2333,1],[2333,6,2333,7],[2334,0,2334,1],[2334,6,2334,7],[2335,0,2335,1],[2335,2,2335,4],[2335,6,2335,7],[2335,8,2335,10],[2336,0,2336,1],[2336,6,2336,7],[2337,0,2337,4],[2337,6,2337,10],[2341,2,2341,4],[2341,8,2341,10],[2342,2,2342,4],[2342,8,2342,10],[2343,2,2343,4],[2343,8,2343,10],[2347,3,2347,4],[2347,9,2347,10],[2349,0,2350,4],[2349,6,2350,10],[2357,0,2357,1],[2357,6,2357,7],[2358,0,2358,1],[2358,6,2358,7],[2359,0,2359,1],[2359,6,2359,7],[2360,0,2360,1],[2360,6,2360,7],[2361,0,2361,1],[2361,6,2361,7],[2362,0,2362,1],[2362,6,2362,7],[2363,0,2363,1],[2363,6,2363,7],[2364,0,2364,1],[2364,2,2364,4],[2364,6,2364,7],[2364,8,2364,10],[2365,0,2365,1],[2365,6,2365,7],[2366,0,2366,4],[2366,6,2366,10],[2370,2,2370,4],[2370,8,2370,10],[2371,2,2371,4],[2371,8,2371,10],[2372,2,2372,4],[2372,8,2372,10],[2376,3,2376,4],[2376,9,2376,10],[2378,0,2379,4],[2378,6,2379,10],[2386,0,2386,1],[2386,6,2386,7],[2387,0,2387,1],[2387,6,2387,7],[2388,0,2388,1],[2388,6,2388,7],[2389,0,2389,1],[2389,6,2389,7],[2390,0,2390,1],[2390,6,2390,7],[2391,0,2391,1],[2391,6,2391,7],[2392,0,2392,1],[2392,6,2392,7],[2393,0,2393,1],[2393,2,2393,4],[2393,6,2393,7],[2393,8,2393,10],[2394,0,2394,1],[2394,6,2394,7],[2395,0,2395,4],[2395,6,2395,10],[2399,2,2399,4],[2399,8,2399,10],[2400,2,2400,4],[2400,8,2400,10],[2401,2,2401,4],[2401,8,2401,10],[2405,3,2405,4],[2405,9,2405,10],[2407,0,2408,4],[2407,6,2408,10],[2415,0,2415,1],[2415,6,2415,7],[2416,0,2416,1],[2416,6,2416,7],[2417,0,2417,1],[2417,6,2417,7],[2418,0,2418,1],[2418,6,2418,7],[2419,0,2419,1],[2419,6,2419,7],[2420,0,2420,1],[2420,6,2420,7],[2421,0,2421,1],[2421,6,2421,7],[2422,0,2422,1],[2422,2,2422,4],[2422,6,2422,7],[2422,8,2422,10],[2423,0,2423,1],[2423,6,2423,7],[2424,0,2424,4],[2424,6,2424,10],[2428,2,2428,4],[2428,8,2428,10],[2429,2,2429,4],[2429,8,2429,10],[2430,2,2430,4],[2430,8,2430,10],[2434,3,2434,4],[2434,9,2434,10],[2436,0,2437,4],[2436,6,2437,10],[2444,0,2444,1],[2444,6,2444,7],[2445,0,2445,1],[2445,6,2445,7],[2446,0,2446,1],[2446,6,2446,7],[2447,0,2447,1],[2447,6,2447,7],[2448,0,2448,1],[2448,6,2448,7],[2449,0,2449,1],[2449,6,2449,7],[2450,0,2450,1],[2450,6,2450,7],[2451,0,2451,1],[2451,2,2451,4],[2451,6,2451,7],[2451,8,2451,10],[2452,0,2452,1],[2452,6,2452,7],[2453,0,2453,4],[2453,6,2453,10],[2457,2,2457,4],[2457,8,2457,10],[2458,2,2458,4],[2458,8,2458,10],[2459,2,2459,4],[2459,8,2459,10],[2463,3,2463,4],[2463,9,2463,10],[2465,0,2466,4],[2465,6,2466,10],[2473,0,2473,1],[2473,6,2473,7],[2474,0,2474,1],[2474,6,2474,7],[2475,0,2475,1],[2475,6,2475,7],[2476,0,2476,1],[2476,6,2476,7],[2477,0,2477,1],[2477,6,2477,7],[2478,0,2478,1],[2478,6,2478,7],[2479,0,2479,1],[2479,6,2479,7],[2480,0,2480,1],[2480,2,2480,4],[2480,6,2480,7],[2480,8,2480,10],[2481,0,2481,1],[2481,6,2481,7],[2482,0,2482,4],[2482,6,2482,10],[2486,2,2486,4],[2486,8,2486,10],[2487,2,2487,4],[2487,8,2487,10],[2488,2,2488,4],[2488,8,2488,10],[2492,3,2492,4],[2492,9,2492,10],[2494,0,2495,4],[2494,6,2495,10],[2502,0,2502,1],[2502,6,2502,7],[2503,0,2503,1],[2503,6,2503,7],[2504,0,2504,1],[2504,6,2504,7],[2505,0,2505,1],[2505,6,2505,7],[2506,0,2506,1],[2506,6,2506,7],[2507,0,2507,1],[2507,6,2507,7],[2508,0,2508,1],[2508,6,2508,7],[2509,0,2509,1],[2509,2,2509,4],[2509,6,2509,7],[2509,8,2509,10],[2510,0,2510,1],[2510,6,2510,7],[2511,0,2511,4],[2511,6,2511,10],[2515,2,2515,4],[2515,8,2515,10],[2516,2,2516,4],[2516,8,2516,10],[2517,2,2517,4],[2517,8,2517,10],[2521,3,2521,4],[2521,9,2521,10],[2523,0,2524,4],[2523,6,2524,10],[2531,0,2531,1],[2531,6,2531,7],[2532,0,2532,1],[2532,6,2532,7],[2533,0,2533,1],[2533,6,2533,7],[2534,0,2534,1],[2534,6,2534,7],[2535,0,2535,1],[2535,6,2535,7],[2536,0,2536,1],[2536,6,2536,7],[2537,0,2537,1],[2537,6,2537,7],[2538,0,2538,1],[2538,2,2538,4],[2538,6,2538,7],[2538,8,2538,10],[2539,0,2539,1],[2539,6,2539,7],[2540,0,2540,4],[2540,6,2540,10],[2544,2,2544,4],[2544,8,2544,10],[2545,2,2545,4],[2545,8,2545,10],[2546,2,2546,4],[2546,8,2546,10],[2550,3,2550,4],[2550,9,2550,10],[2552,0,2553,4],[2552,6,2553,10],[2560,0,2560,1],[2560,6,2560,7],[2561,0,2561,1],[2561,6,2561,7],[2562,0,2562,1],[2562,6,2562,7],[2563,0,2563,1],[2563,6,2563,7],[2564,0,2564,1],[2564,6,2564,7],[2565,0,2565,1],[2565,6,2565,7],[2566,0,2566,1],[2566,6,2566,7],[2567,0,2567,1],[2567,2,2567,4],[2567,6,2567,7],[2567,8,2567,10],[2568,0,2568,1],[2568,6,2568,7],[2569,0,2569,4],[2569,6,2569,10],[2573,2,2573,4],[2573,8,2573,10],[2574,2,2574,4],[2574,8,2574,10],[2575,2,2575,4],[2575,8,2575,10],[2579,3,2579,4],[2579,9,2579,10],[2581,0,2582,4],[2581,6,2582,10],[2589,0,2589,1],[2589,6,2589,7],[2590,0,2590,1],[2590,6,2590,7],[2591,0,2591,1],[2591,6,2591,7],[2592,0,2592,1],[2592,6,2592,7],[2593,0,2593,1],[2593,6,2593,7],[2594,0,2594,1],[2594,6,2594,7],[2595,0,2595,1],[2595,6,2595,7],[2596,0,2596,1],[2596,2,2596,4],[2596,6,2596,7],[2596,8,2596,10],[2597,0,2597,1],[2597,6,2597,7],[2598,0,2598,4],[2598,6,2598,10],[2602,2,2602,4],[2602,8,2602,10],[2603,2,2603,4],[2603,8,2603,10],[2604,2,2604,4],[2604,8,2604,10],[2608,3,2608,4],[2608,9,2608,10],[2610,0,2611,4],[2610,6,2611,10],[2618,0,2618,1],[2618,6,2618,7],[2619,0,2619,1],[2619,6,2619,7],[2620,0,2620,1],[2620,6,2620,7],[2621,0,2621,1],[2621,6,2621,7],[2622,0,2622,1],[2622,6,2622,7],[2623,0,2623,1],[2623,6,2623,7],[2624,0,2624,1],[2624,6,2624,7],[2625,0,2625,1],[2625,2,2625,4],[2625,6,2625,7],[2625,8,2625,10],[2626,0,2626,1],[2626,6,2626,7],[2627,0,2627,4],[2627,6,2627,10],[2631,2,2631,4],[2631,8,2631,10],[2632,2,2632,4],[2632,8,2632,10],[2633,2,2633,4],[2633,8,2633,10],[2637,3,2637,4],[2637,9,2637,10],[2639,0,2640,4],[2639,6,2640,10],[2647,0,2647,1],[2647,6,2647,7],[2648,0,2648,1],[2648,6,2648,7],[2649,0,2649,1],[2649,6,2649,7],[2650,0,2650,1],[2650,6,2650,7],[2651,0,2651,1],[2651,6,2651,7],[2652,0,2652,1],[2652,6,2652,7],[2653,0,2653,1],[2653,6,2653,7],[2654,0,2654,1],[2654,2,2654,4],[2654,6,2654,7],[2654,8,2654,10],[2655,0,2655,1],[2655,6,2655,7],[2656,0,2656,4],[2656,6,2656,10],[2660,2,2660,4],[2660,8,2660,10],[2661,2,2661,4],[2661,8,2661,10],[2662,2,2662,4],[2662,8,2662,10],[2666,3,2666,4],[2666,9,2666,10],[2668,0,2669,4],[2668,6,2669,10],[2676,0,2676,1],[2676,6,2676,7],[2677,0,2677,1],[2677,6,2677,7],[2678,0,2678,1],[2678,6,2678,7],[2679,0,2679,1],[2679,6,2679,7],[2680,0,2680,1],[2680,6,2680,7],[2681,0,2681,1],[2681,6,2681,7],[2682,0,2682,1],[2682,6,2682,7],[2683,0,2683,1],[2683,2,2683,4],[2683,6,2683,7],[2683,8,2683,10],[2684,0,2684,1],[2684,6,2684,7],[2685,0,2685,4],[2685,6,2685,10],[2689,2,2689,4],[2689,8,2689,10],[2690,2,2690,4],[2690,8,2690,10],[2691,2,2691,4],[2691,8,2691,10],[2695,3,2695,4],[2695,9,2695,10],[2697,0,2698,4],[2697,6,2698,10],[2705,0,2705,1],[2705,6,2705,7],[2706,0,2706,1],[2706,6,2706,7],[2707,0,2707,1],[2707,6,2707,7],[2708,0,2708,1],[2708,6,2708,7],[2709,0,2709,1],[2709,6,2709,7],[2710,0,2710,1],[2710,6,2710,7],[2711,0,2711,1],[2711,6,2711,7],[2712,0,2712,1],[2712,2,2712,4],[2712,6,2712,7],[2712,8,2712,10],[2713,0,2713,1],[2713,6,2713,7],[2714,0,2714,4],[2714,6,2714,10],[2718,2,2718,4],[2718,8,2718,10],[2719,2,2719,4],[2719,8,2719,10],[2720,2,2720,4],[2720,8,2720,10],[2724,3,2724,4],[2724,9,2724,10],[2726,0,2727,4],[2726,6,2727,10],[2734,0,2734,1],[2734,6,2734,7],[2735,0,2735,1],[2735,6,2735,7],[2736,0,2736,1],[2736,6,2736,7],[2737,0,2737,1],[2737,6,2737,7],[2738,0,2738,1],[2738,6,2738,7],[2739,0,2739,1],[2739,6,2739,7],[2740,0,2740,1],[2740,6,2740,7],[2741,0,2741,1],[2741,2,2741,4],[2741,6,2741,7],[2741,8,2741,10],[2742,0,2742,1],[2742,6,2742,7],[2743,0,2743,4],[2743,6,2743,10],[2747,2,2747,4],[2747,8,2747,10],[2748,2,2748,4],[2748,8,2748,10],[2749,2,2749,4],[2749,8,2749,10],[2753,3,2753,4],[2753,9,2753,10],[2755,0,2756,4],[2755,6,2756,10],[2763,0,2763,1],[2763,6,2763,7],[2764,0,2764,1],[2764,6,2764,7],[2765,0,2765,1],[2765,6,2765,7],[2766,0,2766,1],[2766,6,2766,7],[2767,0,2767,1],[2767,6,2767,7],[2768,0,2768,1],[2768,6,2768,7],[2769,0,2769,1],[2769,6,2769,7],[2770,0,2770,1],[2770,2,2770,4],[2770,6,2770,7],[2770,8,2770,10],[2771,0,2771,1],[2771,6,2771,7],[2772,0,2772,4],[2772,6,2772,10],[2776,2,2776,4],[2776,8,2776,10],[2777,2,2777,4],[2777,8,2777,10],[2778,2,2778,4],[2778,8,2778,10],[2782,3,2782,4],[2782,9,2782,10],[2784,0,2785,4],[2784,6,2785,10],[2792,0,2792,1],[2792,6,2792,7],[2793,0,2793,1],[2793,6,2793,7],[2794,0,2794,1],[2794,6,2794,7],[2795,0,2795,1],[2795,6,2795,7],[2796,0,2796,1],[2796,6,2796,7],[2797,0,2797,1],[2797,6,2797,7],[2798,0,2798,1],[2798,6,2798,7],[2799,0,2799,1],[2799,2,2799,4],[2799,6,2799,7],[2799,8,2799,10],[2800,0,2800,1],[2800,6,2800,7],[2801,0,2801,4],[2801,6,2801,10],[2805,2,2805,4],[2805,8,2805,10],[2806,2,2806,4],[2806,8,2806,10],[2807,2,2807,4],[2807,8,2807,10],[2811,3,2811,4],[2811,9,2811,10],[2813,0,2814,4],[2813,6,2814,10],[2821,0,2821,1],[2821,6,2821,7],[2822,0,2822,1],[2822,6,2822,7],[2823,0,2823,1],[2823,6,2823,7],[2824,0,2824,1],[2824,6,2824,7],[2825,0,2825,1],[2825,6,2825,7],[2826,0,2826,1],[2826,6,2826,7],[2827,0,2827,1],[2827,6,2827,7],[2828,0,2828,1],[2828,2,2828,4],[2828,6,2828,7],[2828,8,2828,10],[2829,0,2829,1],[2829,6,2829,7],[2830,0,2830,4],[2830,6,2830,10],[2834,2,2834,4],[2834,8,2834,10],[2835,2,2835,4],[2835,8,2835,10],[2836,2,2836,4],[2836,8,2836,10],[2840,3,2840,4],[2840,9,2840,10],[2842,0,2843,4],[2842,6,2843,10],[2850,0,2850,1],[2850,6,2850,7],[2851,0,2851,1],[2851,6,2851,7],[2852,0,2852,1],[2852,6,2852,7],[2853,0,2853,1],[2853,6,2853,7],[2854,0,2854,1],[2854,6,2854,7],[2855,0,2855,1],[2855,6,2855,7],[2856,0,2856,1],[2856,6,2856,7],[2857,0,2857,1],[2857,2,2857,4],[2857,6,2857,7],[2857,8,2857,10],[2858,0,2858,1],[2858,6,2858,7],[2859,0,2859,4],[2859,6,2859,10],[2863,2,2863,4],[2863,8,2863,10],[2864,2,2864,4],[2864,8,2864,10],[2865,2,2865,4],[2865,8,2865,10],[2869,3,2869,4],[2869,9,2869,10],[2871,0,2872,4],[2871,6,2872,10],[2879,0,2879,1],[2879,6,2879,7],[2880,0,2880,1],[2880,6,2880,7],[2881,0,2881,1],[2881,6,2881,7],[2882,0,2882,1],[2882,6,2882,7],[2883,0,2883,1],[2883,6,2883,7],[2884,0,2884,1],[2884,6,2884,7],[2885,0,2885,1],[2885,6,2885,7],[2886,0,2886,1],[2886,2,2886,4],[2886,6,2886,7],[2886,8,2886,10],[2887,0,2887,1],[2887,6,2887,7],[2888,0,2888,4],[2888,6,2888,10],[2892,2,2892,4],[2892,8,2892,10],[2893,2,2893,4],[2893,8,2893,10],[2894,2,2894,4],[2894,8,2894,10],[2898,3,2898,4],[2898,9,2898,10]],"merged_total":3200,"flags":["merged_cut"]}
["LAPTOP TESTING RECORD",{"$nulls":5},"LAPTOP TESTING RECORD"]
[]
[{"$nulls":3},"ITEM #",1,{"$nulls":4},"ITEM #",{"$f":"E3+1","v":2}]
["Tester: ","RR","Date:",{"$f":"NOW()","v":"2026-01-06T11:13:00.960"},null,null,"Tester: ","RR","Date:",{"$f":"NOW()","v":"2026-01-06T11:13:00.960"}]
["Type: ","LAPTOP","SN:",{"$f":"VLOOKUP(E3,INVENTORYDATA,10,FALSE)","v":"16YRMX3"},null,null,"Type: ","LAPTOP","SN:",{"$f":"VLOOKUP(K3,INVENTORYDATA,10,FALSE)","v":"2CYRMX3"}]
[{"$f":"\"Make: \"","v":"Make: "},{"$f":"VLOOKUP(E3,INVENTORYDATA,2,FALSE)","v":"DELL"},{"$f":"\"Model: \"","v":"Model: "},{"$f":"VLOOKUP(E3,INVENTORYDATA,3,FALSE)","v":"LATITUDE 5330"},null,null,{"$f":"\"Make: \"","v":"Make: "},{"$f":"VLOOKUP(K3,INVENTORYDATA,2,FALSE)","v":"DELL"},{"$f":"\"Model: \"","v":"Model: "},{"$f":"VLOOKUP(K3,INVENTORYDATA,3,FALSE)","v":"LATITUDE 5330"}]
[{"$f":"\"CPU/Speed: \"","v":"CPU/Speed: "},{"$f":"VLOOKUP(E3,INVENTORYDATA,4,FALSE)&\" / \"&VLOOKUP(E3,INVENTORYDATA,5,FALSE)&\"GHz\"","v":"I7-1265U / 4.8GHz"},null,{"$f":"\"Memory: \"","v":"Memory: "},{"$f":"VLOOKUP(E3,INVENTORYDATA,6,FALSE)","v":"16G"},null,{"$f":"\"CPU/Speed: \"","v":"CPU/Speed: "},{"$f":"VLOOKUP(K3,INVENTORYDATA,4,FALSE)&\" / \"&VLOOKUP(K3,INVENTORYDATA,5,FALSE)&\"GHz\"","v":"I7-1265U / 4.8GHz"},null,{"$f":"\"Memory: \"","v":"Memory: "},{"$f":"VLOOKUP(K3,INVENTORYDATA,6,FALSE)","v":"16G"}]
[]
["Key Function",null,"Pass","Fail ","Comments",null,"Key Function",null,"Pass","Fail ","Comments"]
["Hard Drive Removed",null,{"$f":"IF(ISBLANK(VLOOKUP(E3,INVENTORYDATA,13,FALSE)),\"X\",\"\")","v":""},null,{"$f":"IF(ISBLANK(VLOOKUP(E3,INVENTORYDATA,13,FALSE)),\"\",VLOOKUP(E3,INVENTORYDATA,13,FALSE))","v":"512G"},null,"Hard Drive Removed",null,{"$f":"IF(ISBLANK(VLOOKUP(K3,INVENTORYDATA,13,FALSE)),\"X\",\"\")","v":""},null,{"$f":"IF(ISBLANK(VLOOKUP(K3,INVENTORYDATA,13,FALSE)),\"\",VLOOKUP(K3,INVENTORYDATA,13,FALSE))","v":"512G"}]
["Install Memory",null,"X",{"$nulls":3},"Install Memory",null,"X"]
["Power ON",null,"X",{"$nulls":3},"Power ON",null,"X"]
["Record BIOS info",null,"X",{"$nulls":3},"Record BIOS info",null,"X"]
["Check Optical Drive",null,{"$f":"IF((VLOOKUP(E3,INVENTORYDATA,7,FALSE))=\"YES\",\"X\",\"\")","v":""},{"$f":"IF((VLOOKUP(E3,INVENTORYDATA,7,FALSE))=\"NO\",\"X\",\"\")","v":"X"},null,null,"Check Optical Drive",null,{"$f":"IF((VLOOKUP(K3,INVENTORYDATA,7,FALSE))=\"YES\",\"X\",\"\")","v":""},{"$f":"IF((VLOOKUP(K3,INVENTORYDATA,7,FALSE))=\"NO\",\"X\",\"\")","v":"X"}]
["Power Off",null,"X",{"$nulls":3},"Power Off",null,"X"]
["HDD Serial No.",null,{"$f":"IF(ISBLANK(VLOOKUP(E3,INVENTORYDATA,12,FALSE)),\"\",VLOOKUP(E3,INVENTORYDATA,12,FALSE))","v":"cs01N8303115Y242X"},{"$nulls":3},"HDD Serial No.",null,{"$f":"IF(ISBLANK(VLOOKUP(K3,INVENTORYDATA,12,FALSE)),\"\",VLOOKUP(K3,INVENTORYDATA,12,FALSE))","v":"20208N457415"}]
[]
["Tested for key functions,R2/Ready for Resale",{"$nulls":5},"Tested for key functions,R2/Ready for Resale"]
["BIOS Lock","Caddy","Optical","WebCam","Battery",null,"BIOS Lock","Caddy","Optical","WebCam","Battery"]
[null,null,{"$f":"VLOOKUP(E3,INVENTORYDATA,7,FALSE)","v":"NO"},{"$f":"VLOOKUP(E3,INVENTORYDATA,8,FALSE)","v":"YES"},{"$f":"VLOOKUP(E3,INVENTORYDATA,9,FALSE)","v":"YES"},{"$nulls":3},{"$f":"VLOOKUP(K3,INVENTORY!$A$2:$N$144,7,FALSE)","v":"NO"},{"$f":"VLOOKUP(K3,INVENTORY!$A$2:$N$144,8,FALSE)","v":"YES"},{"$f":"VLOOKUP(K3,INVENTORY!$A$2:$N$144,9,FALSE)","v":"YES"}]
[]
["CPU Cosmetics Defects:",null,{"$f":"\"Function Code: \"&VLOOKUP(E3,INVENTORY!$A$2:$Q$144,14,FALSE)","v":"Function Code: F3"},{"$nulls":3},"CPU Cosmetics Defects:",null,{"$f":"\"Function Code: \"&VLOOKUP(K3,INVENTORY!$A$2:$Q$144,14,FALSE)","v":"Function Code: F3"}]
[]
[null,null,{"$f":"\"Cosmetic Code: \"&VLOOKUP(E3,INVENTORY!$A$2:$Q$144,15,FALSE)","v":"Cosmetic Code: C5"},{"$nulls":5},{"$f":"\"Cosmetic Code: \"&VLOOKUP(K3,INVENTORY!$A$2:$Q$144,15,FALSE)","v":"Cosmetic Code: C5"}]
[]
["Casing","Plugs/Ports",{"$nulls":4},"Casing","Plugs/Ports"]
["Pass","Pass",{"$nulls":4},"Pass","Pass"]
["Fail","Fail",null,"TRRC#:L.T.R.",null,null,"Fail","Fail",null,"TRRC#:L.T.R."]
[]
["LAPTOP TESTING RECORD",{"$nulls":5},"LAPTOP TESTING RECORD"]
[]
[{"$nulls":3},"ITEM #",{"$f":"E3+2","v":3},{"$nulls":4},"ITEM #",{"$f":"K3+2","v":4}]
["Tester: ","RR","Date:",{"$f":"NOW()","v":"2026-01-06T11:13:00.960"},null,null,"Tester: ","RR","Date:",{"$f":"NOW()","v":"2026-01-06T11:13:00.960"}]
["Type: ","LAPTOP","SN:",{"$f":"VLOOKUP(E32,INVENTORYDATA,10,FALSE)","v":"33ZRMX3"},null,null,"Type: ","LAPTOP","SN:",{"$f":"VLOOKUP(K32,INVENTORYDATA,10,FALSE)","v":"37ZRMX3"}]
[{"$f":"\"Make: \"","v":"Make: "},{"$f":"VLOOKUP(E32,INVENTORYDATA,2,FALSE)","v":"DELL"},{"$f":"\"Model: \"","v":"Model: "},{"$f":"VLOOKUP(E32,INVENTORYDATA,3,FALSE)","v":"LATITUDE 5330"},null,null,{"$f":"\"Make: \"","v":"Make: "},{"$f":"VLOOKUP(K32,INVENTORYDATA,2,FALSE)","v":"DELL"},{"$f":"\"Model: \"","v":"Model: "},{"$f":"VLOOKUP(K32,INVENTORYDATA,3,FALSE)","v":"LATITUDE 5330"}]
[{"$f":"\"CPU/Speed: \"","v":"CPU/Speed: "},{"$f":"VLOOKUP(E32,INVENTORYDATA,4,FALSE)&\" / \"&VLOOKUP(E32,INVENTORYDATA,5,FALSE)&\"GHz\"","v":"I7-1265U / 4.8GHz"},null,{"$f":"\"Memory: \"","v":"Memory: "},{"$f":"VLOOKUP(E32,INVENTORYDATA,6,FALSE)","v":"16G"},null,{"$f":"\"CPU/Speed: \"","v":"CPU/Speed: "},{"$f":"VLOOKUP(K32,INVENTORYDATA,4,FALSE)&\" / \"&VLOOKUP(K32,INVENTORYDATA,5,FALSE)&\"GHz\"","v":"I7-1265U / 4.8GHz"},null,{"$f":"\"Memory: \"","v":"Memory: "},{"$f":"VLOOKUP(K32,INVENTORYDATA,6,FALSE)","v":"16G"}]
[]
["Key Function",null,"Pass","Fail ","Comments",null,"Key Function",null,"Pass","Fail ","Comments"]
["Hard Drive Removed",null,{"$f":"IF(ISBLANK(VLOOKUP(E32,INVENTORYDATA,13,FALSE)),\"X\",\"\")","v":""},null,{"$f":"IF(ISBLANK(VLOOKUP(E32,INVENTORYDATA,13,FALSE)),\"\",VLOOKUP(E32,INVENTORYDATA,13,FALSE))","v":"512G"},null,"Hard Drive Removed",null,{"$f":"IF(ISBLANK(VLOOKUP(K32,INVENTORYDATA,13,FALSE)),\"X\",\"\")","v":""},null,{"$f":"IF(ISBLANK(VLOOKUP(K32,INVENTORYDATA,13,FALSE)),\"\",VLOOKUP(K32,INVENTORYDATA,13,FALSE))","v":"512G"}]
["Install Memory",null,"X",{"$nulls":3},"Install Memory",null,"X"]
["Power ON",null,"X",{"$nulls":3},"Power ON",null,"X"]
["Record BIOS info",null,"X",{"$nulls":3},"Record BIOS info",null,"X"]
["Check Optical Drive",null,{"$f":"IF((VLOOKUP(E32,INVENTORYDATA,7,FALSE))=\"YES\",\"X\",\"\")","v":""},{"$f":"IF((VLOOKUP(E32,INVENTORYDATA,7,FALSE))=\"NO\",\"X\",\"\")","v":"X"},null,null,"Check Optical Drive",null,{"$f":"IF((VLOOKUP(K32,INVENTORYDATA,7,FALSE))=\"YES\",\"X\",\"\")","v":""},{"$f":"IF((VLOOKUP(K32,INVENTORYDATA,7,FALSE))=\"NO\",\"X\",\"\")","v":"X"}]
["Power Off",null,"X",{"$nulls":3},"Power Off",null,"X"]
["HDD Serial No.",null,{"$f":"IF(ISBLANK(VLOOKUP(E32,INVENTORYDATA,12,FALSE)),\"\",VLOOKUP(E32,INVENTORYDATA,12,FALSE))","v":"sn9AN90181030B52F"},{"$nulls":3},"HDD Serial No.",null,{"$f":"IF(ISBLANK(VLOOKUP(K32,INVENTORYDATA,12,FALSE)),\"\",VLOOKUP(K32,INVENTORYDATA,12,FALSE))","v":"an9CN49421090C84L"}]
[]
["Tested for key functions,R2/Ready for Resale",{"$nulls":5},"Tested for key functions,R2/Ready for Resale"]
["BIOS Lock","Caddy","Optical","WebCam","Battery",null,"BIOS Lock","Caddy","Optical","WebCam","Battery"]
[null,null,{"$f":"VLOOKUP(E32,INVENTORY!$A$2:$N$144,7,FALSE)","v":"NO"},{"$f":"VLOOKUP(E32,INVENTORY!$A$2:$N$144,8,FALSE)","v":"YES"},{"$f":"VLOOKUP(E32,INVENTORY!$A$2:$N$144,9,FALSE)","v":"YES"},{"$nulls":3},{"$f":"VLOOKUP(K32,INVENTORY!$A$2:$N$144,7,FALSE)","v":"NO"},{"$f":"VLOOKUP(K32,INVENTORY!$A$2:$N$144,8,FALSE)","v":"YES"},{"$f":"VLOOKUP(K32,INVENTORY!$A$2:$N$144,9,FALSE)","v":"YES"}]
[]
["CPU Cosmetics Defects:",null,{"$f":"\"Function Code: \"&VLOOKUP(E32,INVENTORY!$A$2:$Q$144,14,FALSE)","v":"Function Code: F3"},{"$nulls":3},"CPU Cosmetics Defects:",null,{"$f":"\"Function Code: \"&VLOOKUP(K32,INVENTORY!$A$2:$Q$144,14,FALSE)","v":"Function Code: F3"}]
[]
[null,null,{"$f":"\"Cosmetic Code: \"&VLOOKUP(E32,INVENTORY!$A$2:$Q$144,15,FALSE)","v":"Cosmetic Code: C5"},{"$nulls":5},{"$f":"\"Cosmetic Code: \"&VLOOKUP(K32,INVENTORY!$A$2:$Q$144,15,FALSE)","v":"Cosmetic Code: C5"}]
[]
["Casing","Plugs/Ports",{"$nulls":4},"Casing","Plugs/Ports"]
["Pass","Pass",{"$nulls":4},"Pass","Pass"]
["Fail","Fail",null,"TRRC#:L.T.R.",null,null,"Fail","Fail",null,"TRRC#:L.T.R."]
[]
["LAPTOP TESTING RECORD",{"$nulls":5},"LAPTOP TESTING RECORD"]
[]
[{"$nulls":3},"ITEM #",{"$f":"E32+2","v":5},{"$nulls":4},"ITEM #",{"$f":"K32+2","v":6}]
["Tester: ","RR","Date:",{"$f":"NOW()","v":"2026-01-06T11:13:00.960"},null,null,"Tester: ","RR","Date:",{"$f":"NOW()","v":"2026-01-06T11:13:00.960"}]
["Type: ","LAPTOP","SN:",{"$f":"VLOOKUP(E61,INVENTORYDATA,10,FALSE)","v":"4F6JFS3"},null,null,"Type: ","LAPTOP","SN:",{"$f":"VLOOKUP(K61,INVENTORYDATA,10,FALSE)","v":"5NNRMX3"}]
[{"$f":"\"Make: \"","v":"Make: "},{"$f":"VLOOKUP(E61,INVENTORYDATA,2,FALSE)","v":"DELL"},{"$f":"\"Model: \"","v":"Model: "},{"$f":"VLOOKUP(E61,INVENTORYDATA,3,FALSE)","v":"LATITUDE 5330"},null,null,{"$f":"\"Make: \"","v":"Make: "},{"$f":"VLOOKUP(K61,INVENTORYDATA,2,FALSE)","v":"DELL"},{"$f":"\"Model: \"","v":"Model: "},{"$f":"VLOOKUP(K61,INVENTORYDATA,3,FALSE)","v":"LATITUDE 5330"}]
[{"$f":"\"CPU/Speed: \"","v":"CPU/Speed: "},{"$f":"VLOOKUP(E61,INVENTORYDATA,4,FALSE)&\" / \"&VLOOKUP(E61,INVENTORYDATA,5,FALSE)&\"GHz\"","v":"I7-1265U / 4.8GHz"},null,{"$f":"\"Memory: \"","v":"Memory: "},{"$f":"VLOOKUP(E61,INVENTORYDATA,6,FALSE)","v":"16G"},null,{"$f":"\"CPU/Speed: \"","v":"CPU/Speed: "},{"$f":"VLOOKUP(K61,INVENTORYDATA,4,FALSE)&\" / \"&VLOOKUP(K61,INVENTORYDATA,5,FALSE)&\"GHz\"","v":"I7-1265U / 4.8GHz"},null,{"$f":"\"Memory: \"","v":"Memory: "},{"$f":"VLOOKUP(K61,INVENTORYDATA,6,FALSE)","v":"16G"}]
[]
["Key Function",null,"Pass","Fail ","Comments",null,"Key Function",null,"Pass","Fail ","Comments"]
["Hard Drive Removed",null,{"$f":"IF(ISBLANK(VLOOKUP(E61,INVENTORYDATA,13,FALSE)),\"X\",\"\")","v":""},null,{"$f":"IF(ISBLANK(VLOOKUP(E61,INVENTORYDATA,13,FALSE)),\"\",VLOOKUP(E61,INVENTORYDATA,13,FALSE))","v":"512G"},null,"Hard Drive Removed",null,{"$f":"IF(ISBLANK(VLOOKUP(K61,INVENTORYDATA,13,FALSE)),\"X\",\"\")","v":""},null,{"$f":"IF(ISBLANK(VLOOKUP(K61,INVENTORYDATA,13,FALSE)),\"\",VLOOKUP(K61,INVENTORYDATA,13,FALSE))","v":"512G"}]
["Install Memory",null,"X",{"$nulls":3},"Install Memory",null,"X"]
["Power ON",null,"X",{"$nulls":3},"Power ON",null,"X"]
["Record BIOS info",null,"X",{"$nulls":3},"Record BIOS info",null,"X"]
["Check Optical Drive",null,{"$f":"IF((VLOOKUP(E61,INVENTORYDATA,7,FALSE))=\"YES\",\"X\",\"\")","v":""},{"$f":"IF((VLOOKUP(E61,INVENTORYDATA,7,FALSE))=\"NO\",\"X\",\"\")","v":"X"},null,null,"Check Optical Drive",null,{"$f":"IF((VLOOKUP(K61,INVENTORYDATA,7,FALSE))=\"YES\",\"X\",\"\")","v":""},{"$f":"IF((VLOOKUP(K61,INVENTORYDATA,7,FALSE))=\"NO\",\"X\",\"\")","v":"X"}]
["Power Off",null,"X",{"$nulls":3},"Power Off",null,"X"]
["HDD Serial No.",null,{"$f":"IF(ISBLANK(VLOOKUP(E61,INVENTORYDATA,12,FALSE)),\"\",VLOOKUP(E61,INVENTORYDATA,12,FALSE))","v":"cd03N7051111Y3Q5M"},{"$nulls":3},"HDD Serial No.",null,{"$f":"IF(ISBLANK(VLOOKUP(K61,INVENTORYDATA,12,FALSE)),\"\",VLOOKUP(K61,INVENTORYDATA,12,FALSE))","v":"sn9AN86841330B51Q"}]
[]
["Tested for key functions,R2/Ready for Resale",{"$nulls":5},"Tested for key functions,R2/Ready for Resale"]
["BIOS Lock","Caddy","Optical","WebCam","Battery",null,"BIOS Lock","Caddy","Optical","WebCam","Battery"]
[null,null,{"$f":"VLOOKUP(E61,INVENTORY!$A$2:$N$144,7,FALSE)","v":"NO"},{"$f":"VLOOKUP(E61,INVENTORY!$A$2:$N$144,8,FALSE)","v":"YES"},{"$f":"VLOOKUP(E61,INVENTORY!$A$2:$N$144,9,FALSE)","v":"YES"},{"$nulls":3},{"$f":"VLOOKUP(K61,INVENTORY!$A$2:$N$144,7,FALSE)","v":"NO"},{"$f":"VLOOKUP(K61,INVENTORY!$A$2:$N$144,8,FALSE)","v":"YES"},{"$f":"VLOOKUP(K61,INVENTORY!$A$2:$N$144,9,FALSE)","v":"YES"}]
[]
["CPU Cosmetics Defects:",null,{"$f":"\"Function Code: \"&VLOOKUP(E61,INVENTORY!$A$2:$Q$144,14,FALSE)","v":"Function Code: F3"},{"$nulls":3},"CPU Cosmetics Defects:",null,{"$f":"\"Function Code: \"&VLOOKUP(K61,INVENTORY!$A$2:$Q$144,14,FALSE)","v":"Function Code: F3"}]
[]
[null,null,{"$f":"\"Cosmetic Code: \"&VLOOKUP(E61,INVENTORY!$A$2:$Q$144,15,FALSE)","v":"Cosmetic Code: C5"},{"$nulls":5},{"$f":"\"Cosmetic Code: \"&VLOOKUP(K61,INVENTORY!$A$2:$Q$144,15,FALSE)","v":"Cosmetic Code: C5"}]
[]
["Casing","Plugs/Ports",{"$nulls":4},"Casing","Plugs/Ports"]
["Pass","Pass",{"$nulls":4},"Pass","Pass"]
["Fail","Fail",null,"TRRC#:L.T.R.",null,null,"Fail","Fail",null,"TRRC#:L.T.R."]
[]
["LAPTOP TESTING RECORD",{"$nulls":5},"LAPTOP TESTING RECORD"]
[]
[{"$nulls":3},"ITEM #",{"$f":"E61+2","v":7},{"$nulls":4},"ITEM #",{"$f":"K61+2","v":8}]
["Tester: ","RR","Date:",{"$f":"NOW()","v":"2026-01-06T11:13:00.960"},null,null,"Tester: ","RR","Date:",{"$f":"NOW()","v":"2026-01-06T11:13:00.960"}]
["Type: ","LAPTOP","SN:",{"$f":"VLOOKUP(E90,INVENTORYDATA,10,FALSE)","v":"5T9JFS3"},null,null,"Type: ","LAPTOP","SN:",{"$f":"VLOOKUP(K90,INVENTORYDATA,10,FALSE)","v":"61PRMX3"}]
[{"$f":"\"Make: \"","v":"Make: "},{"$f":"VLOOKUP(E90,INVENTORYDATA,2,FALSE)","v":"DELL"},{"$f":"\"Model: \"","v":"Model: "},{"$f":"VLOOKUP(E90,INVENTORYDATA,3,FALSE)","v":"LATITUDE 5330"},null,null,{"$f":"\"Make: \"","v":"Make: "},{"$f":"VLOOKUP(K90,INVENTORYDATA,2,FALSE)","v":"DELL"},{"$f":"\"Model: \"","v":"Model: "},{"$f":"VLOOKUP(K90,INVENTORYDATA,3,FALSE)","v":"LATITUDE 5330"}]
[{"$f":"\"CPU/Speed: \"","v":"CPU/Speed: "},{"$f":"VLOOKUP(E90,INVENTORYDATA,4,FALSE)&\" / \"&VLOOKUP(E90,INVENTORYDATA,5,FALSE)&\"GHz\"","v":"I7-1265U / 4.8GHz"},null,{"$f":"\"Memory: \"","v":"Memory: "},{"$f":"VLOOKUP(E90,INVENTORYDATA,6,FALSE)","v":"16G"},null,{"$f":"\"CPU/Speed: \"","v":"CPU/Speed: "},{"$f":"VLOOKUP(K90,INVENTORYDATA,4,FALSE)&\" / \"&VLOOKUP(K90,INVENTORYDATA,5,FALSE)&\"GHz\"","v":"I7-1265U / 4.8GHz"},null,{"$f":"\"Memory: \"","v":"Memory: "},{"$f":"VLOOKUP(K90,INVENTORYDATA,6,FALSE)","v":"16G"}]
[]
["Key Function",null,"Pass","Fail ","Comments",null,"Key Function",null,"Pass","Fail ","Comments"]
["Hard Drive Removed",null,{"$f":"IF(ISBLANK(VLOOKUP(E90,INVENTORYDATA,13,FALSE)),\"X\",\"\")","v":""},null,{"$f":"IF(ISBLANK(VLOOKUP(E90,INVENTORYDATA,13,FALSE)),\"\",VLOOKUP(E90,INVENTORYDATA,13,FALSE))","v":"512G"},null,"Hard Drive Removed",null,{"$f":"IF(ISBLANK(VLOOKUP(K90,INVENTORYDATA,13,FALSE)),\"X\",\"\")","v":""},null,{"$f":"IF(ISBLANK(VLOOKUP(K90,INVENTORYDATA,13,FALSE)),\"\",VLOOKUP(K90,INVENTORYDATA,13,FALSE))","v":"512G"}]
["Install Memory",null,"X",{"$nulls":3},"Install Memory",null,"X"]
["Power ON",null,"X",{"$nulls":3},"Power ON",null,"X"]
["Record BIOS info",null,"X",{"$nulls":3},"Record BIOS info",null,"X"]
["Check Optical Drive",null,{"$f":"IF((VLOOKUP(E90,INVENTORYDATA,7,FALSE))=\"YES\",\"X\",\"\")","v":""},{"$f":"IF((VLOOKUP(E90,INVENTORYDATA,7,FALSE))=\"NO\",\"X\",\"\")","v":"X"},null,null,"Check Optical Drive",null,{"$f":"IF((VLOOKUP(K90,INVENTORYDATA,7,FALSE))=\"YES\",\"X\",\"\")","v":""},{"$f":"IF((VLOOKUP(K90,INVENTORYDATA,7,FALSE))=\"NO\",\"X\",\"\")","v":"X"}]
["Power Off",null,"X",{"$nulls":3},"Power Off",null,"X"]
["HDD Serial No.",null,{"$f":"IF(ISBLANK(VLOOKUP(E90,INVENTORYDATA,12,FALSE)),\"\",VLOOKUP(E90,INVENTORYDATA,12,FALSE))","v":"20168Z453921"},{"$nulls":3},"HDD Serial No.",null,{"$f":"IF(ISBLANK(VLOOKUP(K90,INVENTORYDATA,12,FALSE)),\"\",VLOOKUP(K90,INVENTORYDATA,12,FALSE))","v":"s509NF0N212815"}]
[]
["Tested for key functions,R2/Ready for Resale",{"$nulls":5},"Tested for key functions,R2/Ready for Resale"]
["BIOS Lock","Caddy","Optical","WebCam","Battery",null,"BIOS Lock","Caddy","Optical","WebCam","Battery"]
[null,null,{"$f":"VLOOKUP(E90,INVENTORY!$A$2:$N$144,7,FALSE)","v":"NO"},{"$f":"VLOOKUP(E90,INVENTORY!$A$2:$N$144,8,FALSE)","v":"YES"},{"$f":"VLOOKUP(E90,INVENTORY!$A$2:$N$144,9,FALSE)","v":"YES"},{"$nulls":3},{"$f":"VLOOKUP(K90,INVENTORY!$A$2:$N$144,7,FALSE)","v":"NO"},{"$f":"VLOOKUP(K90,INVENTORY!$A$2:$N$144,8,FALSE)","v":"YES"},{"$f":"VLOOKUP(K90,INVENTORY!$A$2:$N$144,9,FALSE)","v":"YES"}]
[]
["CPU Cosmetics Defects:",null,{"$f":"\"Function Code: \"&VLOOKUP(E90,INVENTORY!$A$2:$Q$144,14,FALSE)","v":"Function Code: F3"},{"$nulls":3},"CPU Cosmetics Defects:",null,{"$f":"\"Function Code: \"&VLOOKUP(K90,INVENTORY!$A$2:$Q$144,14,FALSE)","v":"Function Code: F3"}]
[]
[null,null,{"$f":"\"Cosmetic Code: \"&VLOOKUP(E90,INVENTORY!$A$2:$Q$144,15,FALSE)","v":"Cosmetic Code: C5"},{"$nulls":5},{"$f":"\"Cosmetic Code: \"&VLOOKUP(K90,INVENTORY!$A$2:$Q$144,15,FALSE)","v":"Cosmetic Code: C5"}]
[]
["Casing","Plugs/Ports",{"$nulls":4},"Casing","Plugs/Ports"]
["Pass","Pass",{"$nulls":4},"Pass","Pass"]
["Fail","Fail",null,"TRRC#:L.T.R.",null,null,"Fail","Fail",null,"TRRC#:L.T.R."]
[]
["LAPTOP TESTING RECORD",{"$nulls":5},"LAPTOP TESTING RECORD"]
[]
[{"$nulls":3},"ITEM #",{"$f":"E90+2","v":9},{"$nulls":4},"ITEM #",{"$f":"K90+2","v":10}]
["Tester: ","RR","Date:",{"$f":"NOW()","v":"2026-01-06T11:13:00.960"},null,null,"Tester: ","RR","Date:",{"$f":"NOW()","v":"2026-01-06T11:13:00.960"}]
["Type: ","LAPTOP","SN:",{"$f":"VLOOKUP(E119,INVENTORYDATA,10,FALSE)","v":"6GNSMX3"},null,null,"Type: ","LAPTOP","SN:",{"$f":"VLOOKUP(K119,INVENTORYDATA,10,FALSE)","v":"6PPSMX3"}]
[{"$f":"\"Make: \"","v":"Make: "},{"$f":"VLOOKUP(E119,INVENTORYDATA,2,FALSE)","v":"DELL"},{"$f":"\"Model: \"","v":"Model: "},{"$f":"VLOOKUP(E119,INVENTORYDATA,3,FALSE)","v":"LATITUDE 5330"},null,null,{"$f":"\"Make: \"","v":"Make: "},{"$f":"VLOOKUP(K119,INVENTORYDATA,2,FALSE)","v":"DELL"},{"$f":"\"Model: \"","v":"Model: "},{"$f":"VLOOKUP(K119,INVENTORYDATA,3,FALSE)","v":"LATITUDE 5330"}]
[{"$f":"\"CPU/Speed: \"","v":"CPU/Speed: "},{"$f":"VLOOKUP(E119,INVENTORYDATA,4,FALSE)&\" / \"&VLOOKUP(E119,INVENTORYDATA,5,FALSE)&\"GHz\"","v":"I7-1265U / 4.8GHz"},null,{"$f":"\"Memory: \"","v":"Memory: "},{"$f":"VLOOKUP(E119,INVENTORYDATA,6,FALSE)","v":"16G"},null,{"$f":"\"CPU/Speed: \"","v":"CPU/Speed: "},{"$f":"VLOOKUP(K119,INVENTORYDATA,4,FALSE)&\" / \"&VLOOKUP(K119,INVENTORYDATA,5,FALSE)&\"GHz\"","v":"I7-1265U / 4.8GHz"},null,{"$f":"\"Memory: \"","v":"Memory: "},{"$f":"VLOOKUP(K119,INVENTORYDATA,6,FALSE)","v":"16G"}]
[]
["Key Function",null,"Pass","Fail ","Comments",null,"Key Function",null,"Pass","Fail ","Comments"]
["Hard Drive Removed",null,{"$f":"IF(ISBLANK(VLOOKUP(E119,INVENTORYDATA,13,FALSE)),\"X\",\"\")","v":""},null,{"$f":"IF(ISBLANK(VLOOKUP(E119,INVENTORYDATA,13,FALSE)),\"\",VLOOKUP(E119,INVENTORYDATA,13,FALSE))","v":"512G"},null,"Hard Drive Removed",null,{"$f":"IF(ISBLANK(VLOOKUP(K119,INVENTORYDATA,13,FALSE)),\"X\",\"\")","v":""},null,{"$f":"IF(ISBLANK(VLOOKUP(K119,INVENTORYDATA,13,FALSE)),\"\",VLOOKUP(K119,INVENTORYDATA,13,FALSE))","v":"512G"}]
["Install Memory",null,"X",{"$nulls":3},"Install Memory",null,"X"]
["Power ON",null,"X",{"$nulls":3},"Power ON",null,"X"]
["Record BIOS info",null,"X",{"$nulls":3},"Record BIOS info",null,"X"]
["Check Optical Drive",null,{"$f":"IF((VLOOKUP(E119,INVENTORYDATA,7,FALSE))=\"YES\",\"X\",\"\")","v":""},{"$f":"IF((VLOOKUP(E119,INVENTORYDATA,7,FALSE))=\"NO\",\"X\",\"\")","v":"X"},null,null,"Check Optical Drive",null,{"$f":"IF((VLOOKUP(K119,INVENTORYDATA,7,FALSE))=\"YES\",\"X\",\"\")","v":""},{"$f":"IF((VLOOKUP(K119,INVENTORYDATA,7,FALSE))=\"NO\",\"X\",\"\")","v":"X"}]
["Power Off",null,"X",{"$nulls":3},"Power Off",null,"X"]
["HDD Serial No.",null,{"$f":"IF(ISBLANK(VLOOKUP(E119,INVENTORYDATA,12,FALSE)),\"\",VLOOKUP(E119,INVENTORYDATA,12,FALSE))","v":"sn9AN79241340B44F"},{"$nulls":3},"HDD Serial No.",null,{"$f":"IF(ISBLANK(VLOOKUP(K119,INVENTORYDATA,12,FALSE)),\"\",VLOOKUP(K119,INVENTORYDATA,12,FALSE))","v":"991PC3GTPQFN"}]
[]
["Tested for key functions,R2/Ready for Resale",{"$nulls":5},"Tested for key functions,R2/Ready for Resale"]
["BIOS Lock","Caddy","Optical","WebCam","Battery",null,"BIOS Lock","Caddy","Optical","WebCam","Battery"]
[null,null,{"$f":"VLOOKUP(E119,INVENTORY!$A$2:$N$144,7,FALSE)","v":"NO"},{"$f":"VLOOKUP(E119,INVENTORY!$A$2:$N$144,8,FALSE)","v":"YES"},{"$f":"VLOOKUP(E119,INVENTORY!$A$2:$N$144,9,FALSE)","v":"YES"},{"$nulls":3},{"$f":"VLOOKUP(K119,INVENTORY!$A$2:$N$144,7,FALSE)","v":"NO"},{"$f":"VLOOKUP(K119,INVENTORY!$A$2:$N$144,8,FALSE)","v":"YES"},{"$f":"VLOOKUP(K119,INVENTORY!$A$2:$N$144,9,FALSE)","v":"YES"}]
[]
["CPU Cosmetics Defects:",null,{"$f":"\"Function Code: \"&VLOOKUP(E119,INVENTORY!$A$2:$Q$144,14,FALSE)","v":"Function Code: F3"},{"$nulls":3},"CPU Cosmetics Defects:",null,{"$f":"\"Function Code: \"&VLOOKUP(K119,INVENTORY!$A$2:$Q$144,14,FALSE)","v":"Function Code: F3"}]
[]
[null,null,{"$f":"\"Cosmetic Code: \"&VLOOKUP(E119,INVENTORY!$A$2:$Q$144,15,FALSE)","v":"Cosmetic Code: C5"},{"$nulls":5},{"$f":"\"Cosmetic Code: \"&VLOOKUP(K119,INVENTORY!$A$2:$Q$144,15,FALSE)","v":"Cosmetic Code: C5"}]
[]
["Casing","Plugs/Ports",{"$nulls":4},"Casing","Plugs/Ports"]
["Pass","Pass",{"$nulls":4},"Pass","Pass"]
["Fail","Fail",null,"TRRC#:L.T.R.",null,null,"Fail","Fail",null,"TRRC#:L.T.R."]
[]
["LAPTOP TESTING RECORD",{"$nulls":5},"LAPTOP TESTING RECORD"]
[]
[{"$nulls":3},"ITEM #",{"$f":"E119+2","v":11},{"$nulls":4},"ITEM #",{"$f":"K119+2","v":12}]
["Tester: ","RR","Date:",{"$f":"NOW()","v":"2026-01-06T11:13:00.960"},null,null,"Tester: ","RR","Date:",{"$f":"NOW()","v":"2026-01-06T11:13:00.960"}]
["Type: ","LAPTOP","SN:",{"$f":"VLOOKUP(E148,INVENTORYDATA,10,FALSE)","v":"80LSMX3"},null,null,"Type: ","LAPTOP","SN:",{"$f":"VLOOKUP(K148,INVENTORYDATA,10,FALSE)","v":"83QSMX3"}]
[{"$f":"\"Make: \"","v":"Make: "},{"$f":"VLOOKUP(E148,INVENTORYDATA,2,FALSE)","v":"DELL"},{"$f":"\"Model: \"","v":"Model: "},{"$f":"VLOOKUP(E148,INVENTORYDATA,3,FALSE)","v":"LATITUDE 5330"},null,null,{"$f":"\"Make: \"","v":"Make: "},{"$f":"VLOOKUP(K148,INVENTORYDATA,2,FALSE)","v":"DELL"},{"$f":"\"Model: \"","v":"Model: "},{"$f":"VLOOKUP(K148,INVENTORYDATA,3,FALSE)","v":"LATITUDE 5330"}]
[{"$f":"\"CPU/Speed: \"","v":"CPU/Speed: "},{"$f":"VLOOKUP(E148,INVENTORYDATA,4,FALSE)&\" / \"&VLOOKUP(E148,INVENTORYDATA,5,FALSE)&\"GHz\"","v":"I7-1265U / 4.8GHz"},null,{"$f":"\"Memory: \"","v":"Memory: "},{"$f":"VLOOKUP(E148,INVENTORYDATA,6,FALSE)","v":"16G"},null,{"$f":"\"CPU/Speed: \"","v":"CPU/Speed: "},{"$f":"VLOOKUP(K148,INVENTORYDATA,4,FALSE)&\" / \"&VLOOKUP(K148,INVENTORYDATA,5,FALSE)&\"GHz\"","v":"I7-1265U / 4.8GHz"},null,{"$f":"\"Memory: \"","v":"Memory: "},{"$f":"VLOOKUP(K148,INVENTORYDATA,6,FALSE)","v":"16G"}]
[]
["Key Function",null,"Pass","Fail ","Comments",null,"Key Function",null,"Pass","Fail ","Comments"]
["Hard Drive Removed",null,{"$f":"IF(ISBLANK(VLOOKUP(E148,INVENTORYDATA,13,FALSE)),\"X\",\"\")","v":""},null,{"$f":"IF(ISBLANK(VLOOKUP(E148,INVENTORYDATA,13,FALSE)),\"\",VLOOKUP(E148,INVENTORYDATA,13,FALSE))","v":"512G"},null,"Hard Drive Removed",null,{"$f":"IF(ISBLANK(VLOOKUP(K148,INVENTORYDATA,13,FALSE)),\"X\",\"\")","v":""},null,{"$f":"IF(ISBLANK(VLOOKUP(K148,INVENTORYDATA,13,FALSE)),\"\",VLOOKUP(K148,INVENTORYDATA,13,FALSE))","v":"512G"}]
["Install Memory",null,"X",{"$nulls":3},"Install Memory",null,"X"]
["Power ON",null,"X",{"$nulls":3},"Power ON",null,"X"]
["Record BIOS info",null,"X",{"$nulls":3},"Record BIOS info",null,"X"]
["Check Optical Drive",null,{"$f":"IF((VLOOKUP(E148,INVENTORYDATA,7,FALSE))=\"YES\",\"X\",\"\")","v":""},{"$f":"IF((VLOOKUP(E148,INVENTORYDATA,7,FALSE))=\"NO\",\"X\",\"\")","v":"X"},null,null,"Check Optical Drive",null,{"$f":"IF((VLOOKUP(K148,INVENTORYDATA,7,FALSE))=\"YES\",\"X\",\"\")","v":""},{"$f":"IF((VLOOKUP(K148,INVENTORYDATA,7,FALSE))=\"NO\",\"X\",\"\")","v":"X"}]
["Power Off",null,"X",{"$nulls":3},"Power Off",null,"X"]
["HDD Serial No.",null,{"$f":"IF(ISBLANK(VLOOKUP(E148,INVENTORYDATA,12,FALSE)),\"\",VLOOKUP(E148,INVENTORYDATA,12,FALSE))","v":"cs06N169813906F0Q"},{"$nulls":3},"HDD Serial No.",null,{"$f":"IF(ISBLANK(VLOOKUP(K148,INVENTORYDATA,12,FALSE)),\"\",VLOOKUP(K148,INVENTORYDATA,12,FALSE))","v":"1951AD444020"}]
[]
["Tested for key functions,R2/Ready for Resale",{"$nulls":5},"Tested for key functions,R2/Ready for Resale"]
["BIOS Lock","Caddy","Optical","WebCam","Battery",null,"BIOS Lock","Caddy","Optical","WebCam","Battery"]
[null,null,{"$f":"VLOOKUP(E148,INVENTORY!$A$2:$N$144,7,FALSE)","v":"NO"},{"$f":"VLOOKUP(E148,INVENTORY!$A$2:$N$144,8,FALSE)","v":"YES"},{"$f":"VLOOKUP(E148,INVENTORY!$A$2:$N$144,9,FALSE)","v":"YES"},{"$nulls":3},{"$f":"VLOOKUP(K148,INVENTORY!$A$2:$N$144,7,FALSE)","v":"NO"},{"$f":"VLOOKUP(K148,INVENTORY!$A$2:$N$144,8,FALSE)","v":"YES"},{"$f":"VLOOKUP(K148,INVENTORY!$A$2:$N$144,9,FALSE)","v":"YES"}]
[]
["CPU Cosmetics Defects:",null,{"$f":"\"Function Code: \"&VLOOKUP(E148,INVENTORY!$A$2:$Q$144,14,FALSE)","v":"Function Code: F3"},{"$nulls":3},"CPU Cosmetics Defects:",null,{"$f":"\"Function Code: \"&VLOOKUP(K148,INVENTORY!$A$2:$Q$144,14,FALSE)","v":"Function Code: F3"}]
[]
[null,null,{"$f":"\"Cosmetic Code: \"&VLOOKUP(E148,INVENTORY!$A$2:$Q$144,15,FALSE)","v":"Cosmetic Code: C5"},{"$nulls":5},{"$f":"\"Cosmetic Code: \"&VLOOKUP(K148,INVENTORY!$A$2:$Q$144,15,FALSE)","v":"Cosmetic Code: C5"}]
[]
["Casing","Plugs/Ports",{"$nulls":4},"Casing","Plugs/Ports"]
["Pass","Pass",{"$nulls":4},"Pass","Pass"]
["Fail","Fail",null,"TRRC#:L.T.R.",null,null,"Fail","Fail",null,"TRRC#:L.T.R."]
[]
["LAPTOP TESTING RECORD",{"$nulls":5},"LAPTOP TESTING RECORD"]
[]
[{"$nulls":3},"ITEM #",{"$f":"E148+2","v":13},{"$nulls":4},"ITEM #",{"$f":"K148+2","v":14}]
["Tester: ","RR","Date:",{"$f":"NOW()","v":"2026-01-06T11:13:00.960"},null,null,"Tester: ","RR","Date:",{"$f":"NOW()","v":"2026-01-06T11:13:00.960"}]
["Type: ","LAPTOP","SN:",{"$f":"VLOOKUP(E177,INVENTORYDATA,10,FALSE)","v":"8YMSMX3"},null,null,"Type: ","LAPTOP","SN:",{"$f":"VLOOKUP(K177,INVENTORYDATA,10,FALSE)","v":"B3QSMX3"}]
[{"$f":"\"Make: \"","v":"Make: "},{"$f":"VLOOKUP(E177,INVENTORYDATA,2,FALSE)","v":"DELL"},{"$f":"\"Model: \"","v":"Model: "},{"$f":"VLOOKUP(E177,INVENTORYDATA,3,FALSE)","v":"LATITUDE 5330"},null,null,{"$f":"\"Make: \"","v":"Make: "},{"$f":"VLOOKUP(K177,INVENTORYDATA,2,FALSE)","v":"DELL"},{"$f":"\"Model: \"","v":"Model: "},{"$f":"VLOOKUP(K177,INVENTORYDATA,3,FALSE)","v":"LATITUDE 5330"}]
[{"$f":"\"CPU/Speed: \"","v":"CPU/Speed: "},{"$f":"VLOOKUP(E177,INVENTORYDATA,4,FALSE)&\" / \"&VLOOKUP(E177,INVENTORYDATA,5,FALSE)&\"GHz\"","v":"I7-1265U / 4.8GHz"},null,{"$f":"\"Memory: \"","v":"Memory: "},{"$f":"VLOOKUP(E177,INVENTORYDATA,6,FALSE)","v":"16G"},null,{"$f":"\"CPU/Speed: \"","v":"CPU/Speed: "},{"$f":"VLOOKUP(K177,INVENTORYDATA,4,FALSE)&\" / \"&VLOOKUP(K177,INVENTORYDATA,5,FALSE)&\"GHz\"","v":"I7-1265U / 4.8GHz"},null,{"$f":"\"Memory: \"","v":"Memory: "},{"$f":"VLOOKUP(K177,INVENTORYDATA,6,FALSE)","v":"16G"}]
[]
["Key Function",null,"Pass","Fail ","Comments",null,"Key Function",null,"Pass","Fail ","Comments"]
["Hard Drive Removed",null,{"$f":"IF(ISBLANK(VLOOKUP(E177,INVENTORYDATA,13,FALSE)),\"X\",\"\")","v":""},null,{"$f":"IF(ISBLANK(VLOOKUP(E177,INVENTORYDATA,13,FALSE)),\"\",VLOOKUP(E177,INVENTORYDATA,13,FALSE))","v":"512G"},null,"Hard Drive Removed",null,{"$f":"IF(ISBLANK(VLOOKUP(K177,INVENTORYDATA,13,FALSE)),\"X\",\"\")","v":""},null,{"$f":"IF(ISBLANK(VLOOKUP(K177,INVENTORYDATA,13,FALSE)),\"\",VLOOKUP(K177,INVENTORYDATA,13,FALSE))","v":"512G"}]
["Install Memory",null,"X",{"$nulls":3},"Install Memory",null,"X"]
["Power ON",null,"X",{"$nulls":3},"Power ON",null,"X"]
["Record BIOS info",null,"X",{"$nulls":3},"Record BIOS info",null,"X"]
["Check Optical Drive",null,{"$f":"IF((VLOOKUP(E177,INVENTORYDATA,7,FALSE))=\"YES\",\"X\",\"\")","v":""},{"$f":"IF((VLOOKUP(E177,INVENTORYDATA,7,FALSE))=\"NO\",\"X\",\"\")","v":"X"},null,null,"Check Optical Drive",null,{"$f":"IF((VLOOKUP(K177,INVENTORYDATA,7,FALSE))=\"YES\",\"X\",\"\")","v":""},{"$f":"IF((VLOOKUP(K177,INVENTORYDATA,7,FALSE))=\"NO\",\"X\",\"\")","v":"X"}]
["Power Off",null,"X",{"$nulls":3},"Power Off",null,"X"]
["HDD Serial No.",null,{"$f":"IF(ISBLANK(VLOOKUP(E177,INVENTORYDATA,12,FALSE)),\"\",VLOOKUP(E177,INVENTORYDATA,12,FALSE))","v":"sn9AN74551100AU38"},{"$nulls":3},"HDD Serial No.",null,{"$f":"IF(ISBLANK(VLOOKUP(K177,INVENTORYDATA,12,FALSE)),\"\",VLOOKUP(K177,INVENTORYDATA,12,FALSE))","v":"sn9AN90181030B52P"}]
[]
["Tested for key functions,R2/Ready for Resale",{"$nulls":5},"Tested for key functions,R2/Ready for Resale"]
["BIOS Lock","Caddy","Optical","WebCam","Battery",null,"BIOS Lock","Caddy","Optical","WebCam","Battery"]
[null,null,{"$f":"VLOOKUP(E177,INVENTORY!$A$2:$N$144,7,FALSE)","v":"NO"},{"$f":"VLOOKUP(E177,INVENTORY!$A$2:$N$144,8,FALSE)","v":"YES"},{"$f":"VLOOKUP(E177,INVENTORY!$A$2:$N$144,9,FALSE)","v":"YES"},{"$nulls":3},{"$f":"VLOOKUP(K177,INVENTORY!$A$2:$N$144,7,FALSE)","v":"NO"},{"$f":"VLOOKUP(K177,INVENTORY!$A$2:$N$144,8,FALSE)","v":"YES"},{"$f":"VLOOKUP(K177,INVENTORY!$A$2:$N$144,9,FALSE)","v":"YES"}]
[]
["CPU Cosmetics Defects:",null,{"$f":"\"Function Code: \"&VLOOKUP(E177,INVENTORY!$A$2:$Q$144,14,FALSE)","v":"Function Code: F3"},{"$nulls":3},"CPU Cosmetics Defects:",null,{"$f":"\"Function Code: \"&VLOOKUP(K177,INVENTORY!$A$2:$Q$144,14,FALSE)","v":"Function Code: F3"}]
[]
[null,null,{"$f":"\"Cosmetic Code: \"&VLOOKUP(E177,INVENTORY!$A$2:$Q$144,15,FALSE)","v":"Cosmetic Code: C5"},{"$nulls":5},{"$f":"\"Cosmetic Code: \"&VLOOKUP(K177,INVENTORY!$A$2:$Q$144,15,FALSE)","v":"Cosmetic Code: C5"}]
[]
["Casing","Plugs/Ports",{"$nulls":4},"Casing","Plugs/Ports"]
["Pass","Pass",{"$nulls":4},"Pass","Pass"]
["Fail","Fail",null,"TRRC#:L.T.R.",null,null,"Fail","Fail",null,"TRRC#:L.T.R."]
[]
["LAPTOP TESTING RECORD",{"$nulls":5},"LAPTOP TESTING RECORD"]
[]
[{"$nulls":3},"ITEM #",{"$f":"E177+2","v":15},{"$nulls":4},"ITEM #",{"$f":"K177+2","v":16}]
["Tester: ","RR","Date:",{"$f":"NOW()","v":"2026-01-06T11:13:00.960"},null,null,"Tester: ","RR","Date:",{"$f":"NOW()","v":"2026-01-06T11:13:00.960"}]
["Type: ","LAPTOP","SN:",{"$f":"VLOOKUP(E206,INVENTORYDATA,10,FALSE)","v":"B8ZRMX3"},null,null,"Type: ","LAPTOP","SN:",{"$f":"VLOOKUP(K206,INVENTORYDATA,10,FALSE)","v":"C1PRMX3"}]
[{"$f":"\"Make: \"","v":"Make: "},{"$f":"VLOOKUP(E206,INVENTORYDATA,2,FALSE)","v":"DELL"},{"$f":"\"Model: \"","v":"Model: "},{"$f":"VLOOKUP(E206,INVENTORYDATA,3,FALSE)","v":"LATITUDE 5330"},null,null,{"$f":"\"Make: \"","v":"Make: "},{"$f":"VLOOKUP(K206,INVENTORYDATA,2,FALSE)","v":"DELL"},{"$f":"\"Model: \"","v":"Model: "},{"$f":"VLOOKUP(K206,INVENTORYDATA,3,FALSE)","v":"LATITUDE 5330"}]
[{"$f":"\"CPU/Speed: \"","v":"CPU/Speed: "},{"$f":"VLOOKUP(E206,INVENTORYDATA,4,FALSE)&\" / \"&VLOOKUP(E206,INVENTORYDATA,5,FALSE)&\"GHz\"","v":"I7-1265U / 4.8GHz"},null,{"$f":"\"Memory: \"","v":"Memory: "},{"$f":"VLOOKUP(E206,INVENTORYDATA,6,FALSE)","v":"16G"},null,{"$f":"\"CPU/Speed: \"","v":"CPU/Speed: "},{"$f":"VLOOKUP(K206,INVENTORYDATA,4,FALSE)&\" / \"&VLOOKUP(K206,INVENTORYDATA,5,FALSE)&\"GHz\"","v":"I7-1265U / 4.8GHz"},null,{"$f":"\"Memory: \"","v":"Memory: "},{"$f":"VLOOKUP(K206,INVENTORYDATA,6,FALSE)","v":"16G"}]
[]
["Key Function",null,"Pass","Fail ","Comments",null,"Key Function",null,"Pass","Fail ","Comments"]
["Hard Drive Removed",null,{"$f":"IF(ISBLANK(VLOOKUP(E206,INVENTORYDATA,13,FALSE)),\"X\",\"\")","v":""},null,{"$f":"IF(ISBLANK(VLOOKUP(E206,INVENTORYDATA,13,FALSE)),\"\",VLOOKUP(E206,INVENTORYDATA,13,FALSE))","v":"512G"},null,"Hard Drive Removed",null,{"$f":"IF(ISBLANK(VLOOKUP(K206,INVENTORYDATA,13,FALSE)),\"X\",\"\")","v":""},null,{"$f":"IF(ISBLANK(VLOOKUP(K206,INVENTORYDATA,13,FALSE)),\"\",VLOOKUP(K206,INVENTORYDATA,13,FALSE))","v":"512G"}]
["Install Memory",null,"X",{"$nulls":3},"Install Memory",null,"X"]
["Power ON",null,"X",{"$nulls":3},"Power ON",null,"X"]
["Record BIOS info",null,"X",{"$nulls":3},"Record BIOS info",null,"X"]
["Check Optical Drive",null,{"$f":"IF((VLOOKUP(E206,INVENTORYDATA,7,FALSE))=\"YES\",\"X\",\"\")","v":""},{"$f":"IF((VLOOKUP(E206,INVENTORYDATA,7,FALSE))=\"NO\",\"X\",\"\")","v":"X"},null,null,"Check Optical Drive",null,{"$f":"IF((VLOOKUP(K206,INVENTORYDATA,7,FALSE))=\"YES\",\"X\",\"\")","v":""},{"$f":"IF((VLOOKUP(K206,INVENTORYDATA,7,FALSE))=\"NO\",\"X\",\"\")","v":"X"}]
["Power Off",null,"X",{"$nulls":3},"Power Off",null,"X"]
["HDD Serial No.",null,{"$f":"IF(ISBLANK(VLOOKUP(E206,INVENTORYDATA,12,FALSE)),\"\",VLOOKUP(E206,INVENTORYDATA,12,FALSE))","v":"s509NF0N320194"},{"$nulls":3},"HDD Serial No.",null,{"$f":"IF(ISBLANK(VLOOKUP(K206,INVENTORYDATA,12,FALSE)),\"\",VLOOKUP(K206,INVENTORYDATA,12,FALSE))","v":"sn9AN74551100AU2V"}]
[]
["Tested for key functions,R2/Ready for Resale",{"$nulls":5},"Tested for key functions,R2/Ready for Resale"]
["BIOS Lock","Caddy","Optical","WebCam","Battery",null,"BIOS Lock","Caddy","Optical","WebCam","Battery"]
[null,null,{"$f":"VLOOKUP(E206,INVENTORY!$A$2:$N$144,7,FALSE)","v":"NO"},{"$f":"VLOOKUP(E206,INVENTORY!$A$2:$N$144,8,FALSE)","v":"YES"},{"$f":"VLOOKUP(E206,INVENTORY!$A$2:$N$144,9,FALSE)","v":"YES"},{"$nulls":3},{"$f":"VLOOKUP(K206,INVENTORY!$A$2:$N$144,7,FALSE)","v":"NO"},{"$f":"VLOOKUP(K206,INVENTORY!$A$2:$N$144,8,FALSE)","v":"YES"},{"$f":"VLOOKUP(K206,INVENTORY!$A$2:$N$144,9,FALSE)","v":"YES"}]
[]
["CPU Cosmetics Defects:",null,{"$f":"\"Function Code: \"&VLOOKUP(E206,INVENTORY!$A$2:$Q$144,14,FALSE)","v":"Function Code: F3"},{"$nulls":3},"CPU Cosmetics Defects:",null,{"$f":"\"Function Code: \"&VLOOKUP(K206,INVENTORY!$A$2:$Q$144,14,FALSE)","v":"Function Code: F3"}]
[]
[null,null,{"$f":"\"Cosmetic Code: \"&VLOOKUP(E206,INVENTORY!$A$2:$Q$144,15,FALSE)","v":"Cosmetic Code: C5"},{"$nulls":5},{"$f":"\"Cosmetic Code: \"&VLOOKUP(K206,INVENTORY!$A$2:$Q$144,15,FALSE)","v":"Cosmetic Code: C5"}]
[]
["Casing","Plugs/Ports",{"$nulls":4},"Casing","Plugs/Ports"]
["Pass","Pass",{"$nulls":4},"Pass","Pass"]
["Fail","Fail",null,"TRRC#:L.T.R.",null,null,"Fail","Fail",null,"TRRC#:L.T.R."]
[]
["LAPTOP TESTING RECORD",{"$nulls":5},"LAPTOP TESTING RECORD"]
[]
[{"$nulls":3},"ITEM #",{"$f":"E206+2","v":17},{"$nulls":4},"ITEM #",{"$f":"K206+2","v":18}]
["Tester: ","RR","Date:",{"$f":"NOW()","v":"2026-01-06T11:13:00.960"},null,null,"Tester: ","RR","Date:",{"$f":"NOW()","v":"2026-01-06T11:13:00.960"}]
["Type: ","LAPTOP","SN:",{"$f":"VLOOKUP(E235,INVENTORYDATA,10,FALSE)","v":"C1PSMX3"},null,null,"Type: ","LAPTOP","SN:",{"$f":"VLOOKUP(K235,INVENTORYDATA,10,FALSE)","v":"C6CJFS3"}]
[{"$f":"\"Make: \"","v":"Make: "},{"$f":"VLOOKUP(E235,INVENTORYDATA,2,FALSE)","v":"DELL"},{"$f":"\"Model: \"","v":"Model: "},{"$f":"VLOOKUP(E235,INVENTORYDATA,3,FALSE)","v":"LATITUDE 5330"},null,null,{"$f":"\"Make: \"","v":"Make: "},{"$f":"VLOOKUP(K235,INVENTORYDATA,2,FALSE)","v":"DELL"},{"$f":"\"Model: \"","v":"Model: "},{"$f":"VLOOKUP(K235,INVENTORYDATA,3,FALSE)","v":"LATITUDE 5330"}]
[{"$f":"\"CPU/Speed: \"","v":"CPU/Speed: "},{"$f":"VLOOKUP(E235,INVENTORYDATA,4,FALSE)&\" / \"&VLOOKUP(E235,INVENTORYDATA,5,FALSE)&\"GHz\"","v":"I7-1265U / 4.8GHz"},null,{"$f":"\"Memory: \"","v":"Memory: "},{"$f":"VLOOKUP(E235,INVENTORYDATA,6,FALSE)","v":"16G"},null,{"$f":"\"CPU/Speed: \"","v":"CPU/Speed: "},{"$f":"VLOOKUP(K235,INVENTORYDATA,4,FALSE)&\" / \"&VLOOKUP(K235,INVENTORYDATA,5,FALSE)&\"GHz\"","v":"I7-1265U / 4.8GHz"},null,{"$f":"\"Memory: \"","v":"Memory: "},{"$f":"VLOOKUP(K235,INVENTORYDATA,6,FALSE)","v":"16G"}]
[]
["Key Function",null,"Pass","Fail ","Comments",null,"Key Function",null,"Pass","Fail ","Comments"]
["Hard Drive Removed",null,{"$f":"IF(ISBLANK(VLOOKUP(E235,INVENTORYDATA,13,FALSE)),\"X\",\"\")","v":""},null,{"$f":"IF(ISBLANK(VLOOKUP(E235,INVENTORYDATA,13,FALSE)),\"\",VLOOKUP(E235,INVENTORYDATA,13,FALSE))","v":"512G"},null,"Hard Drive Removed",null,{"$f":"IF(ISBLANK(VLOOKUP(K235,INVENTORYDATA,13,FALSE)),\"X\",\"\")","v":""},null,{"$f":"IF(ISBLANK(VLOOKUP(K235,INVENTORYDATA,13,FALSE)),\"\",VLOOKUP(K235,INVENTORYDATA,13,FALSE))","v":"512G"}]
["Install Memory",null,"X",{"$nulls":3},"Install Memory",null,"X"]
["Power ON",null,"X",{"$nulls":3},"Power ON",null,"X"]
["Record BIOS info",null,"X",{"$nulls":3},"Record BIOS info",null,"X"]
["Check Optical Drive",null,{"$f":"IF((VLOOKUP(E235,INVENTORYDATA,7,FALSE))=\"YES\",\"X\",\"\")","v":""},{"$f":"IF((VLOOKUP(E235,INVENTORYDATA,7,FALSE))=\"NO\",\"X\",\"\")","v":"X"},null,null,"Check Optical Drive",null,{"$f":"IF((VLOOKUP(K235,INVENTORYDATA,7,FALSE))=\"YES\",\"X\",\"\")","v":""},{"$f":"IF((VLOOKUP(K235,INVENTORYDATA,7,FALSE))=\"NO\",\"X\",\"\")","v":"X"}]
["Power Off",null,"X",{"$nulls":3},"Power Off",null,"X"]
["HDD Serial No.",null,{"$f":"IF(ISBLANK(VLOOKUP(E235,INVENTORYDATA,12,FALSE)),\"\",VLOOKUP(E235,INVENTORYDATA,12,FALSE))","v":"50BPC6TYQTML"},{"$nulls":3},"HDD Serial No.",null,{"$f":"IF(ISBLANK(VLOOKUP(K235,INVENTORYDATA,12,FALSE)),\"\",VLOOKUP(K235,INVENTORYDATA,12,FALSE))","v":"sn9AN82631270B124"}]
[]
["Tested for key functions,R2/Ready for Resale",{"$nulls":5},"Tested for key functions,R2/Ready for Resale"]
["BIOS Lock","Caddy","Optical","WebCam","Battery",null,"BIOS Lock","Caddy","Optical","WebCam","Battery"]
[null,null,{"$f":"VLOOKUP(E235,INVENTORY!$A$2:$N$144,7,FALSE)","v":"NO"},{"$f":"VLOOKUP(E235,INVENTORY!$A$2:$N$144,8,FALSE)","v":"YES"},{"$f":"VLOOKUP(E235,INVENTORY!$A$2:$N$144,9,FALSE)","v":"YES"},{"$nulls":3},{"$f":"VLOOKUP(K235,INVENTORY!$A$2:$N$144,7,FALSE)","v":"NO"},{"$f":"VLOOKUP(K235,INVENTORY!$A$2:$N$144,8,FALSE)","v":"YES"},{"$f":"VLOOKUP(K235,INVENTORY!$A$2:$N$144,9,FALSE)","v":"YES"}]
[]
["CPU Cosmetics Defects:",null,{"$f":"\"Function Code: \"&VLOOKUP(E235,INVENTORY!$A$2:$Q$144,14,FALSE)","v":"Function Code: F3"},{"$nulls":3},"CPU Cosmetics Defects:",null,{"$f":"\"Function Code: \"&VLOOKUP(K235,INVENTORY!$A$2:$Q$144,14,FALSE)","v":"Function Code: F3"}]
[]
[null,null,{"$f":"\"Cosmetic Code: \"&VLOOKUP(E235,INVENTORY!$A$2:$Q$144,15,FALSE)","v":"Cosmetic Code: C5"},{"$nulls":5},{"$f":"\"Cosmetic Code: \"&VLOOKUP(K235,INVENTORY!$A$2:$Q$144,15,FALSE)","v":"Cosmetic Code: C5"}]
[]
["Casing","Plugs/Ports",{"$nulls":4},"Casing","Plugs/Ports"]
["Pass","Pass",{"$nulls":4},"Pass","Pass"]
["Fail","Fail",null,"TRRC#:L.T.R.",null,null,"Fail","Fail",null,"TRRC#:L.T.R."]
[]
["LAPTOP TESTING RECORD",{"$nulls":5},"LAPTOP TESTING RECORD"]
[]
[{"$nulls":3},"ITEM #",{"$f":"E235+2","v":19},{"$nulls":4},"ITEM #",{"$f":"K235+2","v":20}]
["Tester: ","RR","Date:",{"$f":"NOW()","v":"2026-01-06T11:13:00.960"},null,null,"Tester: ","RR","Date:",{"$f":"NOW()","v":"2026-01-06T11:13:00.960"}]
["Type: ","LAPTOP","SN:",{"$f":"VLOOKUP(E264,INVENTORYDATA,10,FALSE)","v":"CKYRMX3"},null,null,"Type: ","LAPTOP","SN:",{"$f":"VLOOKUP(K264,INVENTORYDATA,10,FALSE)","v":"CMYRMX3"}]
[{"$f":"\"Make: \"","v":"Make: "},{"$f":"VLOOKUP(E264,INVENTORYDATA,2,FALSE)","v":"DELL"},{"$f":"\"Model: \"","v":"Model: "},{"$f":"VLOOKUP(E264,INVENTORYDATA,3,FALSE)","v":"LATITUDE 5330"},null,null,{"$f":"\"Make: \"","v":"Make: "},{"$f":"VLOOKUP(K264,INVENTORYDATA,2,FALSE)","v":"DELL"},{"$f":"\"Model: \"","v":"Model: "},{"$f":"VLOOKUP(K264,INVENTORYDATA,3,FALSE)","v":"LATITUDE 5330"}]
[{"$f":"\"CPU/Speed: \"","v":"CPU/Speed: "},{"$f":"VLOOKUP(E264,INVENTORYDATA,4,FALSE)&\" / \"&VLOOKUP(E264,INVENTORYDATA,5,FALSE)&\"GHz\"","v":"I7-1265U / 4.8GHz"},null,{"$f":"\"Memory: \"","v":"Memory: "},{"$f":"VLOOKUP(E264,INVENTORYDATA,6,FALSE)","v":"16G"},null,{"$f":"\"CPU/Speed: \"","v":"CPU/Speed: "},{"$f":"VLOOKUP(K264,INVENTORYDATA,4,FALSE)&\" / \"&VLOOKUP(K264,INVENTORYDATA,5,FALSE)&\"GHz\"","v":"I7-1265U / 4.8GHz"},null,{"$f":"\"Memory: \"","v":"Memory: "},{"$f":"VLOOKUP(K264,INVENTORYDATA,6,FALSE)","v":"16G"}]
[]
["Key Function",null,"Pass","Fail ","Comments",null,"Key Function",null,"Pass","Fail ","Comments"]
["Hard Drive Removed",null,{"$f":"IF(ISBLANK(VLOOKUP(E264,INVENTORYDATA,13,FALSE)),\"X\",\"\")","v":""},null,{"$f":"IF(ISBLANK(VLOOKUP(E264,INVENTORYDATA,13,FALSE)),\"\",VLOOKUP(E264,INVENTORYDATA,13,FALSE))","v":"512G"},null,"Hard Drive Removed",null,{"$f":"IF(ISBLANK(VLOOKUP(K264,INVENTORYDATA,13,FALSE)),\"X\",\"\")","v":""},null,{"$f":"IF(ISBLANK(VLOOKUP(K264,INVENTORYDATA,13,FALSE)),\"\",VLOOKUP(K264,INVENTORYDATA,13,FALSE))","v":"512G"}]
["Install Memory",null,"X",{"$nulls":3},"Install Memory",null,"X"]
["Power ON",null,"X",{"$nulls":3},"Power ON",null,"X"]
["Record BIOS info",null,"X",{"$nulls":3},"Record BIOS info",null,"X"]
["Check Optical Drive",null,{"$f":"IF((VLOOKUP(E264,INVENTORYDATA,7,FALSE))=\"YES\",\"X\",\"\")","v":""},{"$f":"IF((VLOOKUP(E264,INVENTORYDATA,7,FALSE))=\"NO\",\"X\",\"\")","v":"X"},null,null,"Check Optical Drive",null,{"$f":"IF((VLOOKUP(K264,INVENTORYDATA,7,FALSE))=\"YES\",\"X\",\"\")","v":""},{"$f":"IF((VLOOKUP(K264,INVENTORYDATA,7,FALSE))=\"NO\",\"X\",\"\")","v":"X"}]
["Power Off",null,"X",{"$nulls":3},"Power Off",null,"X"]
["HDD Serial No.",null,{"$f":"IF(ISBLANK(VLOOKUP(E264,INVENTORYDATA,12,FALSE)),\"\",VLOOKUP(E264,INVENTORYDATA,12,FALSE))","v":"pheh4032079X512F"},{"$nulls":3},"HDD Serial No.",null,{"$f":"IF(ISBLANK(VLOOKUP(K264,INVENTORYDATA,12,FALSE)),\"\",VLOOKUP(K264,INVENTORYDATA,12,FALSE))","v":"50APC87QQTML"}]
[]
["Tested for key functions,R2/Ready for Resale",{"$nulls":5},"Tested for key functions,R2/Ready for Resale"]
["BIOS Lock","Caddy","Optical","WebCam","Battery",null,"BIOS Lock","Caddy","Optical","WebCam","Battery"]
[null,null,{"$f":"VLOOKUP(E264,INVENTORY!$A$2:$N$144,7,FALSE)","v":"NO"},{"$f":"VLOOKUP(E264,INVENTORY!$A$2:$N$144,8,FALSE)","v":"YES"},{"$f":"VLOOKUP(E264,INVENTORY!$A$2:$N$144,9,FALSE)","v":"YES"},{"$nulls":3},{"$f":"VLOOKUP(K264,INVENTORY!$A$2:$N$144,7,FALSE)","v":"NO"},{"$f":"VLOOKUP(K264,INVENTORY!$A$2:$N$144,8,FALSE)","v":"YES"},{"$f":"VLOOKUP(K264,INVENTORY!$A$2:$N$144,9,FALSE)","v":"YES"}]
[]
["CPU Cosmetics Defects:",null,{"$f":"\"Function Code: \"&VLOOKUP(E264,INVENTORY!$A$2:$Q$144,14,FALSE)","v":"Function Code: F3"},{"$nulls":3},"CPU Cosmetics Defects:",null,{"$f":"\"Function Code: \"&VLOOKUP(K264,INVENTORY!$A$2:$Q$144,14,FALSE)","v":"Function Code: F3"}]
[]
[null,null,{"$f":"\"Cosmetic Code: \"&VLOOKUP(E264,INVENTORY!$A$2:$Q$144,15,FALSE)","v":"Cosmetic Code: C5"},{"$nulls":5},{"$f":"\"Cosmetic Code: \"&VLOOKUP(K264,INVENTORY!$A$2:$Q$144,15,FALSE)","v":"Cosmetic Code: C5"}]
[]
["Casing","Plugs/Ports",{"$nulls":4},"Casing","Plugs/Ports"]
["Pass","Pass",{"$nulls":4},"Pass","Pass"]
["Fail","Fail",null,"TRRC#:L.T.R.",null,null,"Fail","Fail",null,"TRRC#:L.T.R."]
[]
["LAPTOP TESTING RECORD",{"$nulls":5},"LAPTOP TESTING RECORD"]
[]
[{"$nulls":3},"ITEM #",{"$f":"E264+2","v":21},{"$nulls":4},"ITEM #",{"$f":"K264+2","v":22}]
["Tester: ","RR","Date:",{"$f":"NOW()","v":"2026-01-06T11:13:00.960"},null,null,"Tester: ","RR","Date:",{"$f":"NOW()","v":"2026-01-06T11:13:00.960"}]
["Type: ","LAPTOP","SN:",{"$f":"VLOOKUP(E293,INVENTORYDATA,10,FALSE)","v":"CNPSMX3"},null,null,"Type: ","LAPTOP","SN:",{"$f":"VLOOKUP(K293,INVENTORYDATA,10,FALSE)","v":"DJ4CLS3"}]
[{"$f":"\"Make: \"","v":"Make: "},{"$f":"VLOOKUP(E293,INVENTORYDATA,2,FALSE)","v":"DELL"},{"$f":"\"Model: \"","v":"Model: "},{"$f":"VLOOKUP(E293,INVENTORYDATA,3,FALSE)","v":"LATITUDE 5330"},null,null,{"$f":"\"Make: \"","v":"Make: "},{"$f":"VLOOKUP(K293,INVENTORYDATA,2,FALSE)","v":"DELL"},{"$f":"\"Model: \"","v":"Model: "},{"$f":"VLOOKUP(K293,INVENTORYDATA,3,FALSE)","v":"LATITUDE 5330"}]
[{"$f":"\"CPU/Speed: \"","v":"CPU/Speed: "},{"$f":"VLOOKUP(E293,INVENTORYDATA,4,FALSE)&\" / \"&VLOOKUP(E293,INVENTORYDATA,5,FALSE)&\"GHz\"","v":"I7-1265U / 4.8GHz"},null,{"$f":"\"Memory: \"","v":"Memory: "},{"$f":"VLOOKUP(E293,INVENTORYDATA,6,FALSE)","v":"16G"},null,{"$f":"\"CPU/Speed: \"","v":"CPU/Speed: "},{"$f":"VLOOKUP(K293,INVENTORYDATA,4,FALSE)&\" / \"&VLOOKUP(K293,INVENTORYDATA,5,FALSE)&\"GHz\"","v":"I7-1265U / 4.8GHz"},null,{"$f":"\"Memory: \"","v":"Memory: "},{"$f":"VLOOKUP(K293,INVENTORYDATA,6,FALSE)","v":"16G"}]
[]
["Key Function",null,"Pass","Fail ","Comments",null,"Key Function",null,"Pass","Fail ","Comments"]
["Hard Drive Removed",null,{"$f":"IF(ISBLANK(VLOOKUP(E293,INVENTORYDATA,13,FALSE)),\"X\",\"\")","v":""},null,{"$f":"IF(ISBLANK(VLOOKUP(E293,INVENTORYDATA,13,FALSE)),\"\",VLOOKUP(E293,INVENTORYDATA,13,FALSE))","v":"512G"},null,"Hard Drive Removed",null,{"$f":"IF(ISBLANK(VLOOKUP(K293,INVENTORYDATA,13,FALSE)),\"X\",\"\")","v":""},null,{"$f":"IF(ISBLANK(VLOOKUP(K293,INVENTORYDATA,13,FALSE)),\"\",VLOOKUP(K293,INVENTORYDATA,13,FALSE))","v":"512G"}]
["Install Memory",null,"X",{"$nulls":3},"Install Memory",null,"X"]
["Power ON",null,"X",{"$nulls":3},"Power ON",null,"X"]
["Record BIOS info",null,"X",{"$nulls":3},"Record BIOS info",null,"X"]
["Check Optical Drive",null,{"$f":"IF((VLOOKUP(E293,INVENTORYDATA,7,FALSE))=\"YES\",\"X\",\"\")","v":""},{"$f":"IF((VLOOKUP(E293,INVENTORYDATA,7,FALSE))=\"NO\",\"X\",\"\")","v":"X"},null,null,"Check Optical Drive",null,{"$f":"IF((VLOOKUP(K293,INVENTORYDATA,7,FALSE))=\"YES\",\"X\",\"\")","v":""},{"$f":"IF((VLOOKUP(K293,INVENTORYDATA,7,FALSE))=\"NO\",\"X\",\"\")","v":"X"}]
["Power Off",null,"X",{"$nulls":3},"Power Off",null,"X"]
["HDD Serial No.",null,{"$f":"IF(ISBLANK(VLOOKUP(E293,INVENTORYDATA,12,FALSE)),\"\",VLOOKUP(E293,INVENTORYDATA,12,FALSE))","v":"ss9BN53251060BB0O"},{"$nulls":3},"HDD Serial No.",null,{"$f":"IF(ISBLANK(VLOOKUP(K293,INVENTORYDATA,12,FALSE)),\"\",VLOOKUP(K293,INVENTORYDATA,12,FALSE))","v":"sn9AN90181030B52Q"}]
[]
["Tested for key functions,R2/Ready for Resale",{"$nulls":5},"Tested for key functions,R2/Ready for Resale"]
["BIOS Lock","Caddy","Optical","WebCam","Battery",null,"BIOS Lock","Caddy","Optical","WebCam","Battery"]
[null,null,{"$f":"VLOOKUP(E293,INVENTORY!$A$2:$N$144,7,FALSE)","v":"NO"},{"$f":"VLOOKUP(E293,INVENTORY!$A$2:$N$144,8,FALSE)","v":"YES"},{"$f":"VLOOKUP(E293,INVENTORY!$A$2:$N$144,9,FALSE)","v":"YES"},{"$nulls":3},{"$f":"VLOOKUP(K293,INVENTORY!$A$2:$N$144,7,FALSE)","v":"NO"},{"$f":"VLOOKUP(K293,INVENTORY!$A$2:$N$144,8,FALSE)","v":"YES"},{"$f":"VLOOKUP(K293,INVENTORY!$A$2:$N$144,9,FALSE)","v":"YES"}]
[]
["CPU Cosmetics Defects:",null,{"$f":"\"Function Code: \"&VLOOKUP(E293,INVENTORY!$A$2:$Q$144,14,FALSE)","v":"Function Code: F3"},{"$nulls":3},"CPU Cosmetics Defects:",null,{"$f":"\"Function Code: \"&VLOOKUP(K293,INVENTORY!$A$2:$Q$144,14,FALSE)","v":"Function Code: F3"}]
[]
[null,null,{"$f":"\"Cosmetic Code: \"&VLOOKUP(E293,INVENTORY!$A$2:$Q$144,15,FALSE)","v":"Cosmetic Code: C5"},{"$nulls":5},{"$f":"\"Cosmetic Code: \"&VLOOKUP(K293,INVENTORY!$A$2:$Q$144,15,FALSE)","v":"Cosmetic Code: C5"}]
[]
["Casing","Plugs/Ports",{"$nulls":4},"Casing","Plugs/Ports"]
["Pass","Pass",{"$nulls":4},"Pass","Pass"]
["Fail","Fail",null,"TRRC#:L.T.R.",null,null,"Fail","Fail",null,"TRRC#:L.T.R."]
[]
["LAPTOP TESTING RECORD",{"$nulls":5},"LAPTOP TESTING RECORD"]
[]
[{"$nulls":3},"ITEM #",{"$f":"E293+2","v":23},{"$nulls":4},"ITEM #",{"$f":"K293+2","v":24}]
["Tester: ","RR","Date:",{"$f":"NOW()","v":"2026-01-06T11:13:00.960"},null,null,"Tester: ","RR","Date:",{"$f":"NOW()","v":"2026-01-06T11:13:00.960"}]
["Type: ","LAPTOP","SN:",{"$f":"VLOOKUP(E322,INVENTORYDATA,10,FALSE)","v":"F4MRMX3"},null,null,"Type: ","LAPTOP","SN:",{"$f":"VLOOKUP(K322,INVENTORYDATA,10,FALSE)","v":"FSWGLS3"}]
[{"$f":"\"Make: \"","v":"Make: "},{"$f":"VLOOKUP(E322,INVENTORYDATA,2,FALSE)","v":"DELL"},{"$f":"\"Model: \"","v":"Model: "},{"$f":"VLOOKUP(E322,INVENTORYDATA,3,FALSE)","v":"LATITUDE 5330"},null,null,{"$f":"\"Make: \"","v":"Make: "},{"$f":"VLOOKUP(K322,INVENTORYDATA,2,FALSE)","v":"DELL"},{"$f":"\"Model: \"","v":"Model: "},{"$f":"VLOOKUP(K322,INVENTORYDATA,3,FALSE)","v":"LATITUDE 5330"}]
[{"$f":"\"CPU/Speed: \"","v":"CPU/Speed: "},{"$f":"VLOOKUP(E322,INVENTORYDATA,4,FALSE)&\" / \"&VLOOKUP(E322,INVENTORYDATA,5,FALSE)&\"GHz\"","v":"I7-1265U / 4.8GHz"},null,{"$f":"\"Memory: \"","v":"Memory: "},{"$f":"VLOOKUP(E322,INVENTORYDATA,6,FALSE)","v":"16G"},null,{"$f":"\"CPU/Speed: \"","v":"CPU/Speed: "},{"$f":"VLOOKUP(K322,INVENTORYDATA,4,FALSE)&\" / \"&VLOOKUP(K322,INVENTORYDATA,5,FALSE)&\"GHz\"","v":"I7-1265U / 4.8GHz"},null,{"$f":"\"Memory: \"","v":"Memory: "},{"$f":"VLOOKUP(K322,INVENTORYDATA,6,FALSE)","v":"16G"}]
[]
["Key Function",null,"Pass","Fail ","Comments",null,"Key Function",null,"Pass","Fail ","Comments"]
["Hard Drive Removed",null,{"$f":"IF(ISBLANK(VLOOKUP(E322,INVENTORYDATA,13,FALSE)),\"X\",\"\")","v":""},null,{"$f":"IF(ISBLANK(VLOOKUP(E322,INVENTORYDATA,13,FALSE)),\"\",VLOOKUP(E322,INVENTORYDATA,13,FALSE))","v":"512G"},null,"Hard Drive Removed",null,{"$f":"IF(ISBLANK(VLOOKUP(K322,INVENTORYDATA,13,FALSE)),\"X\",\"\")","v":""},null,{"$f":"IF(ISBLANK(VLOOKUP(K322,INVENTORYDATA,13,FALSE)),\"\",VLOOKUP(K322,INVENTORYDATA,13,FALSE))","v":"512G"}]
["Install Memory",null,"X",{"$nulls":3},"Install Memory",null,"X"]
["Power ON",null,"X",{"$nulls":3},"Power ON",null,"X"]
["Record BIOS info",null,"X",{"$nulls":3},"Record BIOS info",null,"X"]
["Check Optical Drive",null,{"$f":"IF((VLOOKUP(E322,INVENTORYDATA,7,FALSE))=\"YES\",\"X\",\"\")","v":""},{"$f":"IF((VLOOKUP(E322,INVENTORYDATA,7,FALSE))=\"NO\",\"X\",\"\")","v":"X"},null,null,"Check Optical Drive",null,{"$f":"IF((VLOOKUP(K322,INVENTORYDATA,7,FALSE))=\"YES\",\"X\",\"\")","v":""},{"$f":"IF((VLOOKUP(K322,INVENTORYDATA,7,FALSE))=\"NO\",\"X\",\"\")","v":"X"}]
["Power Off",null,"X",{"$nulls":3},"Power Off",null,"X"]
["HDD Serial No.",null,{"$f":"IF(ISBLANK(VLOOKUP(E322,INVENTORYDATA,12,FALSE)),\"\",VLOOKUP(E322,INVENTORYDATA,12,FALSE))","v":"sn9AN79241340B453"},{"$nulls":3},"HDD Serial No.",null,{"$f":"IF(ISBLANK(VLOOKUP(K322,INVENTORYDATA,12,FALSE)),\"\",VLOOKUP(K322,INVENTORYDATA,12,FALSE))","v":"sn9AN86841330B511"}]
[]
["Tested for key functions,R2/Ready for Resale",{"$nulls":5},"Tested for key functions,R2/Ready for Resale"]
["BIOS Lock","Caddy","Optical","WebCam","Battery",null,"BIOS Lock","Caddy","Optical","WebCam","Battery"]
[null,null,{"$f":"VLOOKUP(E322,INVENTORY!$A$2:$N$144,7,FALSE)","v":"NO"},{"$f":"VLOOKUP(E322,INVENTORY!$A$2:$N$144,8,FALSE)","v":"YES"},{"$f":"VLOOKUP(E322,INVENTORY!$A$2:$N$144,9,FALSE)","v":"YES"},{"$nulls":3},{"$f":"VLOOKUP(K322,INVENTORY!$A$2:$N$144,7,FALSE)","v":"NO"},{"$f":"VLOOKUP(K322,INVENTORY!$A$2:$N$144,8,FALSE)","v":"YES"},{"$f":"VLOOKUP(K322,INVENTORY!$A$2:$N$144,9,FALSE)","v":"YES"}]
[]
["CPU Cosmetics Defects:",null,{"$f":"\"Function Code: \"&VLOOKUP(E322,INVENTORY!$A$2:$Q$144,14,FALSE)","v":"Function Code: F3"},{"$nulls":3},"CPU Cosmetics Defects:",null,{"$f":"\"Function Code: \"&VLOOKUP(K322,INVENTORY!$A$2:$Q$144,14,FALSE)","v":"Function Code: F3"}]
[]
[null,null,{"$f":"\"Cosmetic Code: \"&VLOOKUP(E322,INVENTORY!$A$2:$Q$144,15,FALSE)","v":"Cosmetic Code: C5"},{"$nulls":5},{"$f":"\"Cosmetic Code: \"&VLOOKUP(K322,INVENTORY!$A$2:$Q$144,15,FALSE)","v":"Cosmetic Code: C5"}]
[]
["Casing","Plugs/Ports",{"$nulls":4},"Casing","Plugs/Ports"]
["Pass","Pass",{"$nulls":4},"Pass","Pass"]
["Fail","Fail",null,"TRRC#:L.T.R.",null,null,"Fail","Fail",null,"TRRC#:L.T.R."]
[]
["LAPTOP TESTING RECORD",{"$nulls":5},"LAPTOP TESTING RECORD"]
[]
[{"$nulls":3},"ITEM #",{"$f":"E322+2","v":25},{"$nulls":4},"ITEM #",{"$f":"K322+2","v":26}]
["Tester: ","RR","Date:",{"$f":"NOW()","v":"2026-01-06T11:13:00.960"},null,null,"Tester: ","RR","Date:",{"$f":"NOW()","v":"2026-01-06T11:13:00.960"}]
["Type: ","LAPTOP","SN:",{"$f":"VLOOKUP(E351,INVENTORYDATA,10,FALSE)","v":"GG9JFS3"},null,null,"Type: ","LAPTOP","SN:",{"$f":"VLOOKUP(K351,INVENTORYDATA,10,FALSE)","v":"HS9JFS3"}]
[{"$f":"\"Make: \"","v":"Make: "},{"$f":"VLOOKUP(E351,INVENTORYDATA,2,FALSE)","v":"DELL"},{"$f":"\"Model: \"","v":"Model: "},{"$f":"VLOOKUP(E351,INVENTORYDATA,3,FALSE)","v":"LATITUDE 5330"},null,null,{"$f":"\"Make: \"","v":"Make: "},{"$f":"VLOOKUP(K351,INVENTORYDATA,2,FALSE)","v":"DELL"},{"$f":"\"Model: \"","v":"Model: "},{"$f":"VLOOKUP(K351,INVENTORYDATA,3,FALSE)","v":"LATITUDE 5330"}]
[{"$f":"\"CPU/Speed: \"","v":"CPU/Speed: "},{"$f":"VLOOKUP(E351,INVENTORYDATA,4,FALSE)&\" / \"&VLOOKUP(E351,INVENTORYDATA,5,FALSE)&\"GHz\"","v":"I7-1265U / 4.8GHz"},null,{"$f":"\"Memory: \"","v":"Memory: "},{"$f":"VLOOKUP(E351,INVENTORYDATA,6,FALSE)","v":"16G"},null,{"$f":"\"CPU/Speed: \"","v":"CPU/Speed: "},{"$f":"VLOOKUP(K351,INVENTORYDATA,4,FALSE)&\" / \"&VLOOKUP(K351,INVENTORYDATA,5,FALSE)&\"GHz\"","v":"I7-1265U / 4.8GHz"},null,{"$f":"\"Memory: \"","v":"Memory: "},{"$f":"VLOOKUP(K351,INVENTORYDATA,6,FALSE)","v":"16G"}]
[]
["Key Function",null,"Pass","Fail ","Comments",null,"Key Function",null,"Pass","Fail ","Comments"]
["Hard Drive Removed",null,{"$f":"IF(ISBLANK(VLOOKUP(E351,INVENTORYDATA,13,FALSE)),\"X\",\"\")","v":""},null,{"$f":"IF(ISBLANK(VLOOKUP(E351,INVENTORYDATA,13,FALSE)),\"\",VLOOKUP(E351,INVENTORYDATA,13,FALSE))","v":"512G"},null,"Hard Drive Removed",null,{"$f":"IF(ISBLANK(VLOOKUP(K351,INVENTORYDATA,13,FALSE)),\"X\",\"\")","v":""},null,{"$f":"IF(ISBLANK(VLOOKUP(K351,INVENTORYDATA,13,FALSE)),\"\",VLOOKUP(K351,INVENTORYDATA,13,FALSE))","v":"512G"}]
["Install Memory",null,"X",{"$nulls":3},"Install Memory",null,"X"]
["Power ON",null,"X",{"$nulls":3},"Power ON",null,"X"]
["Record BIOS info",null,"X",{"$nulls":3},"Record BIOS info",null,"X"]
["Check Optical Drive",null,{"$f":"IF((VLOOKUP(E351,INVENTORYDATA,7,FALSE))=\"YES\",\"X\",\"\")","v":""},{"$f":"IF((VLOOKUP(E351,INVENTORYDATA,7,FALSE))=\"NO\",\"X\",\"\")","v":"X"},null,null,"Check Optical Drive",null,{"$f":"IF((VLOOKUP(K351,INVENTORYDATA,7,FALSE))=\"YES\",\"X\",\"\")","v":""},{"$f":"IF((VLOOKUP(K351,INVENTORYDATA,7,FALSE))=\"NO\",\"X\",\"\")","v":"X"}]
["Power Off",null,"X",{"$nulls":3},"Power Off",null,"X"]
["HDD Serial No.",null,{"$f":"IF(ISBLANK(VLOOKUP(E351,INVENTORYDATA,12,FALSE)),\"\",VLOOKUP(E351,INVENTORYDATA,12,FALSE))","v":"sn9AN82631210B245"},{"$nulls":3},"HDD Serial No.",null,{"$f":"IF(ISBLANK(VLOOKUP(K351,INVENTORYDATA,12,FALSE)),\"\",VLOOKUP(K351,INVENTORYDATA,12,FALSE))","v":"sn9AN82571020AU2X"}]
[]
["Tested for key functions,R2/Ready for Resale",{"$nulls":5},"Tested for key functions,R2/Ready for Resale"]
["BIOS Lock","Caddy","Optical","WebCam","Battery",null,"BIOS Lock","Caddy","Optical","WebCam","Battery"]
[null,null,{"$f":"VLOOKUP(E351,INVENTORY!$A$2:$N$144,7,FALSE)","v":"NO"},{"$f":"VLOOKUP(E351,INVENTORY!$A$2:$N$144,8,FALSE)","v":"YES"},{"$f":"VLOOKUP(E351,INVENTORY!$A$2:$N$144,9,FALSE)","v":"YES"},{"$nulls":3},{"$f":"VLOOKUP(K351,INVENTORY!$A$2:$N$144,7,FALSE)","v":"NO"},{"$f":"VLOOKUP(K351,INVENTORY!$A$2:$N$144,8,FALSE)","v":"YES"},{"$f":"VLOOKUP(K351,INVENTORY!$A$2:$N$144,9,FALSE)","v":"YES"}]
[]
["CPU Cosmetics Defects:",null,{"$f":"\"Function Code: \"&VLOOKUP(E351,INVENTORY!$A$2:$Q$144,14,FALSE)","v":"Function Code: F3"},{"$nulls":3},"CPU Cosmetics Defects:",null,{"$f":"\"Function Code: \"&VLOOKUP(K351,INVENTORY!$A$2:$Q$144,14,FALSE)","v":"Function Code: F3"}]
[]
[null,null,{"$f":"\"Cosmetic Code: \"&VLOOKUP(E351,INVENTORY!$A$2:$Q$144,15,FALSE)","v":"Cosmetic Code: C5"},{"$nulls":5},{"$f":"\"Cosmetic Code: \"&VLOOKUP(K351,INVENTORY!$A$2:$Q$144,15,FALSE)","v":"Cosmetic Code: C5"}]
[]
["Casing","Plugs/Ports",{"$nulls":4},"Casing","Plugs/Ports"]
["Pass","Pass",{"$nulls":4},"Pass","Pass"]
["Fail","Fail",null,"TRRC#:L.T.R.",null,null,"Fail","Fail",null,"TRRC#:L.T.R."]
[]
["LAPTOP TESTING RECORD",{"$nulls":5},"LAPTOP TESTING RECORD"]
[]
[{"$nulls":3},"ITEM #",{"$f":"E351+2","v":27},{"$nulls":4},"ITEM #",{"$f":"K351+2","v":28}]
["Tester: ","RR","Date:",{"$f":"NOW()","v":"2026-01-06T11:13:00.960"},null,null,"Tester: ","RR","Date:",{"$f":"NOW()","v":"2026-01-06T11:13:00.960"}]
["Type: ","LAPTOP","SN:",{"$f":"VLOOKUP(E380,INVENTORYDATA,10,FALSE)","v":"HYYRMX3"},null,null,"Type: ","LAPTOP","SN:",{"$f":"VLOOKUP(K380,INVENTORYDATA,10,FALSE)","v":"J1NSMX3"}]
[{"$f":"\"Make: \"","v":"Make: "},{"$f":"VLOOKUP(E380,INVENTORYDATA,2,FALSE)","v":"DELL"},{"$f":"\"Model: \"","v":"Model: "},{"$f":"VLOOKUP(E380,INVENTORYDATA,3,FALSE)","v":"LATITUDE 5330"},null,null,{"$f":"\"Make: \"","v":"Make: "},{"$f":"VLOOKUP(K380,INVENTORYDATA,2,FALSE)","v":"DELL"},{"$f":"\"Model: \"","v":"Model: "},{"$f":"VLOOKUP(K380,INVENTORYDATA,3,FALSE)","v":"LATITUDE 5330"}]
[{"$f":"\"CPU/Speed: \"","v":"CPU/Speed: "},{"$f":"VLOOKUP(E380,INVENTORYDATA,4,FALSE)&\" / \"&VLOOKUP(E380,INVENTORYDATA,5,FALSE)&\"GHz\"","v":"I7-1265U / 4.8GHz"},null,{"$f":"\"Memory: \"","v":"Memory: "},{"$f":"VLOOKUP(E380,INVENTORYDATA,6,FALSE)","v":"16G"},null,{"$f":"\"CPU/Speed: \"","v":"CPU/Speed: "},{"$f":"VLOOKUP(K380,INVENTORYDATA,4,FALSE)&\" / \"&VLOOKUP(K380,INVENTORYDATA,5,FALSE)&\"GHz\"","v":"I7-1265U / 4.8GHz"},null,{"$f":"\"Memory: \"","v":"Memory: "},{"$f":"VLOOKUP(K380,INVENTORYDATA,6,FALSE)","v":"16G"}]
[]
["Key Function",null,"Pass","Fail ","Comments",null,"Key Function",null,"Pass","Fail ","Comments"]
["Hard Drive Removed",null,{"$f":"IF(ISBLANK(VLOOKUP(E380,INVENTORYDATA,13,FALSE)),\"X\",\"\")","v":""},null,{"$f":"IF(ISBLANK(VLOOKUP(E380,INVENTORYDATA,13,FALSE)),\"\",VLOOKUP(E380,INVENTORYDATA,13,FALSE))","v":"512G"},null,"Hard Drive Removed",null,{"$f":"IF(ISBLANK(VLOOKUP(K380,INVENTORYDATA,13,FALSE)),\"X\",\"\")","v":""},null,{"$f":"IF(ISBLANK(VLOOKUP(K380,INVENTORYDATA,13,FALSE)),\"\",VLOOKUP(K380,INVENTORYDATA,13,FALSE))","v":"512G"}]
["Install Memory",null,"X",{"$nulls":3},"Install Memory",null,"X"]
["Power ON",null,"X",{"$nulls":3},"Power ON",null,"X"]
["Record BIOS info",null,"X",{"$nulls":3},"Record BIOS info",null,"X"]
["Check Optical Drive",null,{"$f":"IF((VLOOKUP(E380,INVENTORYDATA,7,FALSE))=\"YES\",\"X\",\"\")","v":""},{"$f":"IF((VLOOKUP(E380,INVENTORYDATA,7,FALSE))=\"NO\",\"X\",\"\")","v":"X"},null,null,"Check Optical Drive",null,{"$f":"IF((VLOOKUP(K380,INVENTORYDATA,7,FALSE))=\"YES\",\"X\",\"\")","v":""},{"$f":"IF((VLOOKUP(K380,INVENTORYDATA,7,FALSE))=\"NO\",\"X\",\"\")","v":"X"}]
["Power Off",null,"X",{"$nulls":3},"Power Off",null,"X"]
["HDD Serial No.",null,{"$f":"IF(ISBLANK(VLOOKUP(E380,INVENTORYDATA,12,FALSE)),\"\",VLOOKUP(E380,INVENTORYDATA,12,FALSE))","v":"10PPC9SAPTML"},{"$nulls":3},"HDD Serial No.",null,{"$f":"IF(ISBLANK(VLOOKUP(K380,INVENTORYDATA,12,FALSE)),\"\",VLOOKUP(K380,INVENTORYDATA,12,FALSE))","v":"sn9AN86841150B52S"}]
[]
["Tested for key functions,R2/Ready for Resale",{"$nulls":5},"Tested for key functions,R2/Ready for Resale"]
["BIOS Lock","Caddy","Optical","WebCam","Battery",null,"BIOS Lock","Caddy","Optical","WebCam","Battery"]
[null,null,{"$f":"VLOOKUP(E380,INVENTORY!$A$2:$N$144,7,FALSE)","v":"NO"},{"$f":"VLOOKUP(E380,INVENTORY!$A$2:$N$144,8,FALSE)","v":"YES"},{"$f":"VLOOKUP(E380,INVENTORY!$A$2:$N$144,9,FALSE)","v":"YES"},{"$nulls":3},{"$f":"VLOOKUP(K380,INVENTORY!$A$2:$N$144,7,FALSE)","v":"NO"},{"$f":"VLOOKUP(K380,INVENTORY!$A$2:$N$144,8,FALSE)","v":"YES"},{"$f":"VLOOKUP(K380,INVENTORY!$A$2:$N$144,9,FALSE)","v":"YES"}]
[]
["CPU Cosmetics Defects:",null,{"$f":"\"Function Code: \"&VLOOKUP(E380,INVENTORY!$A$2:$Q$144,14,FALSE)","v":"Function Code: F3"},{"$nulls":3},"CPU Cosmetics Defects:",null,{"$f":"\"Function Code: \"&VLOOKUP(K380,INVENTORY!$A$2:$Q$144,14,FALSE)","v":"Function Code: F3"}]
[]
[null,null,{"$f":"\"Cosmetic Code: \"&VLOOKUP(E380,INVENTORY!$A$2:$Q$144,15,FALSE)","v":"Cosmetic Code: C5"},{"$nulls":5},{"$f":"\"Cosmetic Code: \"&VLOOKUP(K380,INVENTORY!$A$2:$Q$144,15,FALSE)","v":"Cosmetic Code: C5"}]
[]
["Casing","Plugs/Ports",{"$nulls":4},"Casing","Plugs/Ports"]
["Pass","Pass",{"$nulls":4},"Pass","Pass"]
["Fail","Fail",null,"TRRC#:L.T.R.",null,null,"Fail","Fail",null,"TRRC#:L.T.R."]
[]
["LAPTOP TESTING RECORD",{"$nulls":5},"LAPTOP TESTING RECORD"]
[]
[{"$nulls":3},"ITEM #",{"$f":"E380+2","v":29},{"$nulls":4},"ITEM #",{"$f":"K380+2","v":30}]
["Tester: ","RR","Date:",{"$f":"NOW()","v":"2026-01-06T11:13:00.960"},null,null,"Tester: ","RR","Date:",{"$f":"NOW()","v":"2026-01-06T11:13:00.960"}]
["Type: ","LAPTOP","SN:",{"$f":"VLOOKUP(E409,INVENTORYDATA,10,FALSE)","v":"J91JFS3"},null,null,"Type: ","LAPTOP","SN:",{"$f":"VLOOKUP(K409,INVENTORYDATA,10,FALSE)","v":"JSZCLS3"}]
[{"$f":"\"Make: \"","v":"Make: "},{"$f":"VLOOKUP(E409,INVENTORYDATA,2,FALSE)","v":"DELL"},{"$f":"\"Model: \"","v":"Model: "},{"$f":"VLOOKUP(E409,INVENTORYDATA,3,FALSE)","v":"LATITUDE 5330"},null,null,{"$f":"\"Make: \"","v":"Make: "},{"$f":"VLOOKUP(K409,INVENTORYDATA,2,FALSE)","v":"DELL"},{"$f":"\"Model: \"","v":"Model: "},{"$f":"VLOOKUP(K409,INVENTORYDATA,3,FALSE)","v":"LATITUDE 5330"}]
[{"$f":"\"CPU/Speed: \"","v":"CPU/Speed: "},{"$f":"VLOOKUP(E409,INVENTORYDATA,4,FALSE)&\" / \"&VLOOKUP(E409,INVENTORYDATA,5,FALSE)&\"GHz\"","v":"I7-1265U / 4.8GHz"},null,{"$f":"\"Memory: \"","v":"Memory: "},{"$f":"VLOOKUP(E409,INVENTORYDATA,6,FALSE)","v":"16G"},null,{"$f":"\"CPU/Speed: \"","v":"CPU/Speed: "},{"$f":"VLOOKUP(K409,INVENTORYDATA,4,FALSE)&\" / \"&VLOOKUP(K409,INVENTORYDATA,5,FALSE)&\"GHz\"","v":"I7-1265U / 4.8GHz"},null,{"$f":"\"Memory: \"","v":"Memory: "},{"$f":"VLOOKUP(K409,INVENTORYDATA,6,FALSE)","v":"16G"}]
[]
["Key Function",null,"Pass","Fail ","Comments",null,"Key Function",null,"Pass","Fail ","Comments"]
["Hard Drive Removed",null,{"$f":"IF(ISBLANK(VLOOKUP(E409,INVENTORYDATA,13,FALSE)),\"X\",\"\")","v":""},null,{"$f":"IF(ISBLANK(VLOOKUP(E409,INVENTORYDATA,13,FALSE)),\"\",VLOOKUP(E409,INVENTORYDATA,13,FALSE))","v":"512G"},null,"Hard Drive Removed",null,{"$f":"IF(ISBLANK(VLOOKUP(K409,INVENTORYDATA,13,FALSE)),\"X\",\"\")","v":""},null,{"$f":"IF(ISBLANK(VLOOKUP(K409,INVENTORYDATA,13,FALSE)),\"\",VLOOKUP(K409,INVENTORYDATA,13,FALSE))","v":"512G"}]
["Install Memory",null,"X",{"$nulls":3},"Install Memory",null,"X"]
["Power ON",null,"X",{"$nulls":3},"Power ON",null,"X"]
["Record BIOS info",null,"X",{"$nulls":3},"Record BIOS info",null,"X"]
["Check Optical Drive",null,{"$f":"IF((VLOOKUP(E409,INVENTORYDATA,7,FALSE))=\"YES\",\"X\",\"\")","v":""},{"$f":"IF((VLOOKUP(E409,INVENTORYDATA,7,FALSE))=\"NO\",\"X\",\"\")","v":"X"},null,null,"Check Optical Drive",null,{"$f":"IF((VLOOKUP(K409,INVENTORYDATA,7,FALSE))=\"YES\",\"X\",\"\")","v":""},{"$f":"IF((VLOOKUP(K409,INVENTORYDATA,7,FALSE))=\"NO\",\"X\",\"\")","v":"X"}]
["Power Off",null,"X",{"$nulls":3},"Power Off",null,"X"]
["HDD Serial No.",null,{"$f":"IF(ISBLANK(VLOOKUP(E409,INVENTORYDATA,12,FALSE)),\"\",VLOOKUP(E409,INVENTORYDATA,12,FALSE))","v":"an9CN49421010C92W"},{"$nulls":3},"HDD Serial No.",null,{"$f":"IF(ISBLANK(VLOOKUP(K409,INVENTORYDATA,12,FALSE)),\"\",VLOOKUP(K409,INVENTORYDATA,12,FALSE))","v":"sn9AN79241260B441"}]
[]
["Tested for key functions,R2/Ready for Resale",{"$nulls":5},"Tested for key functions,R2/Ready for Resale"]
["BIOS Lock","Caddy","Optical","WebCam","Battery",null,"BIOS Lock","Caddy","Optical","WebCam","Battery"]
[null,null,{"$f":"VLOOKUP(E409,INVENTORY!$A$2:$N$144,7,FALSE)","v":"NO"},{"$f":"VLOOKUP(E409,INVENTORY!$A$2:$N$144,8,FALSE)","v":"YES"},{"$f":"VLOOKUP(E409,INVENTORY!$A$2:$N$144,9,FALSE)","v":"YES"},{"$nulls":3},{"$f":"VLOOKUP(K409,INVENTORY!$A$2:$N$144,7,FALSE)","v":"NO"},{"$f":"VLOOKUP(K409,INVENTORY!$A$2:$N$144,8,FALSE)","v":"YES"},{"$f":"VLOOKUP(K409,INVENTORY!$A$2:$N$144,9,FALSE)","v":"YES"}]
[]
["CPU Cosmetics Defects:",null,{"$f":"\"Function Code: \"&VLOOKUP(E409,INVENTORY!$A$2:$Q$144,14,FALSE)","v":"Function Code: F3"},{"$nulls":3},"CPU Cosmetics Defects:",null,{"$f":"\"Function Code: \"&VLOOKUP(K409,INVENTORY!$A$2:$Q$144,14,FALSE)","v":"Function Code: F3"}]
[]
[null,null,{"$f":"\"Cosmetic Code: \"&VLOOKUP(E409,INVENTORY!$A$2:$Q$144,15,FALSE)","v":"Cosmetic Code: C5"},{"$nulls":5},{"$f":"\"Cosmetic Code: \"&VLOOKUP(K409,INVENTORY!$A$2:$Q$144,15,FALSE)","v":"Cosmetic Code: C5"}]
[]
["Casing","Plugs/Ports",{"$nulls":4},"Casing","Plugs/Ports"]
["Pass","Pass",{"$nulls":4},"Pass","Pass"]
["Fail","Fail",null,"TRRC#:L.T.R.",null,null,"Fail","Fail",null,"TRRC#:L.T.R."]
[]
["LAPTOP TESTING RECORD",{"$nulls":5},"LAPTOP TESTING RECORD"]
[]
[{"$nulls":3},"ITEM #",{"$f":"E409+2","v":31},{"$nulls":4},"ITEM #",{"$f":"K409+2","v":32}]
["Tester: ","RR","Date:",{"$f":"NOW()","v":"2026-01-06T11:13:00.960"},null,null,"Tester: ","RR","Date:",{"$f":"NOW()","v":"2026-01-06T11:13:00.960"}]
["Type: ","LAPTOP","SN:",{"$f":"VLOOKUP(E438,INVENTORYDATA,10,FALSE)","v":"JZNRMX3"},null,null,"Type: ","LAPTOP","SN:",{"$f":"VLOOKUP(K438,INVENTORYDATA,10,FALSE)","v":"112MHW3"}]
[{"$f":"\"Make: \"","v":"Make: "},{"$f":"VLOOKUP(E438,INVENTORYDATA,2,FALSE)","v":"DELL"},{"$f":"\"Model: \"","v":"Model: "},{"$f":"VLOOKUP(E438,INVENTORYDATA,3,FALSE)","v":"LATITUDE 5330"},null,null,{"$f":"\"Make: \"","v":"Make: "},{"$f":"VLOOKUP(K438,INVENTORYDATA,2,FALSE)","v":"DELL"},{"$f":"\"Model: \"","v":"Model: "},{"$f":"VLOOKUP(K438,INVENTORYDATA,3,FALSE)","v":"LATITUDE 5430"}]
[{"$f":"\"CPU/Speed: \"","v":"CPU/Speed: "},{"$f":"VLOOKUP(E438,INVENTORYDATA,4,FALSE)&\" / \"&VLOOKUP(E438,INVENTORYDATA,5,FALSE)&\"GHz\"","v":"I7-1265U / 4.8GHz"},null,{"$f":"\"Memory: \"","v":"Memory: "},{"$f":"VLOOKUP(E438,INVENTORYDATA,6,FALSE)","v":"16G"},null,{"$f":"\"CPU/Speed: \"","v":"CPU/Speed: "},{"$f":"VLOOKUP(K438,INVENTORYDATA,4,FALSE)&\" / \"&VLOOKUP(K438,INVENTORYDATA,5,FALSE)&\"GHz\"","v":"I5-1235U / 4.4GHz"},null,{"$f":"\"Memory: \"","v":"Memory: "},{"$f":"VLOOKUP(K438,INVENTORYDATA,6,FALSE)","v":"16G"}]
[]
["Key Function",null,"Pass","Fail ","Comments",null,"Key Function",null,"Pass","Fail ","Comments"]
["Hard Drive Removed",null,{"$f":"IF(ISBLANK(VLOOKUP(E438,INVENTORYDATA,13,FALSE)),\"X\",\"\")","v":""},null,{"$f":"IF(ISBLANK(VLOOKUP(E438,INVENTORYDATA,13,FALSE)),\"\",VLOOKUP(E438,INVENTORYDATA,13,FALSE))","v":"512G"},null,"Hard Drive Removed",null,{"$f":"IF(ISBLANK(VLOOKUP(K438,INVENTORYDATA,13,FALSE)),\"X\",\"\")","v":""},null,{"$f":"IF(ISBLANK(VLOOKUP(K438,INVENTORYDATA,13,FALSE)),\"\",VLOOKUP(K438,INVENTORYDATA,13,FALSE))","v":"512G"}]
["Install Memory",null,"X",{"$nulls":3},"Install Memory",null,"X"]
["Power ON",null,"X",{"$nulls":3},"Power ON",null,"X"]
["Record BIOS info",null,"X",{"$nulls":3},"Record BIOS info",null,"X"]
["Check Optical Drive",null,{"$f":"IF((VLOOKUP(E438,INVENTORYDATA,7,FALSE))=\"YES\",\"X\",\"\")","v":""},{"$f":"IF((VLOOKUP(E438,INVENTORYDATA,7,FALSE))=\"NO\",\"X\",\"\")","v":"X"},null,null,"Check Optical Drive",null,{"$f":"IF((VLOOKUP(K438,INVENTORYDATA,7,FALSE))=\"YES\",\"X\",\"\")","v":""},{"$f":"IF((VLOOKUP(K438,INVENTORYDATA,7,FALSE))=\"NO\",\"X\",\"\")","v":"X"}]
["Power Off",null,"X",{"$nulls":3},"Power Off",null,"X"]
["HDD Serial No.",null,{"$f":"IF(ISBLANK(VLOOKUP(E438,INVENTORYDATA,12,FALSE)),\"\",VLOOKUP(E438,INVENTORYDATA,12,FALSE))","v":"sn9AN82631130B449"},{"$nulls":3},"HDD Serial No.",null,{"$f":"IF(ISBLANK(VLOOKUP(K438,INVENTORYDATA,12,FALSE)),\"\",VLOOKUP(K438,INVENTORYDATA,12,FALSE))","v":"ns03N4658102Y3H2N"}]
[]
["Tested for key functions,R2/Ready for Resale",{"$nulls":5},"Tested for key functions,R2/Ready for Resale"]
["BIOS Lock","Caddy","Optical","WebCam","Battery",null,"BIOS Lock","Caddy","Optical","WebCam","Battery"]
[null,null,{"$f":"VLOOKUP(E438,INVENTORY!$A$2:$N$144,7,FALSE)","v":"NO"},{"$f":"VLOOKUP(E438,INVENTORY!$A$2:$N$144,8,FALSE)","v":"YES"},{"$f":"VLOOKUP(E438,INVENTORY!$A$2:$N$144,9,FALSE)","v":"YES"},{"$nulls":3},{"$f":"VLOOKUP(K438,INVENTORY!$A$2:$N$144,7,FALSE)","v":"NO"},{"$f":"VLOOKUP(K438,INVENTORY!$A$2:$N$144,8,FALSE)","v":"YES"},{"$f":"VLOOKUP(K438,INVENTORY!$A$2:$N$144,9,FALSE)","v":"YES"}]
[]
["CPU Cosmetics Defects:",null,{"$f":"\"Function Code: \"&VLOOKUP(E438,INVENTORY!$A$2:$Q$144,14,FALSE)","v":"Function Code: F3"},{"$nulls":3},"CPU Cosmetics Defects:",null,{"$f":"\"Function Code: \"&VLOOKUP(K438,INVENTORY!$A$2:$Q$144,14,FALSE)","v":"Function Code: F3"}]
[]
[null,null,{"$f":"\"Cosmetic Code: \"&VLOOKUP(E438,INVENTORY!$A$2:$Q$144,15,FALSE)","v":"Cosmetic Code: C5"},{"$nulls":5},{"$f":"\"Cosmetic Code: \"&VLOOKUP(K438,INVENTORY!$A$2:$Q$144,15,FALSE)","v":"Cosmetic Code: C5"}]
[]
["Casing","Plugs/Ports",{"$nulls":4},"Casing","Plugs/Ports"]
["Pass","Pass",{"$nulls":4},"Pass","Pass"]
["Fail","Fail",null,"TRRC#:L.T.R.",null,null,"Fail","Fail",null,"TRRC#:L.T.R."]
[]
["LAPTOP TESTING RECORD",{"$nulls":5},"LAPTOP TESTING RECORD"]
[]
[{"$nulls":3},"ITEM #",{"$f":"E438+2","v":33},{"$nulls":4},"ITEM #",{"$f":"K438+2","v":34}]
["Tester: ","RR","Date:",{"$f":"NOW()","v":"2026-01-06T11:13:00.960"},null,null,"Tester: ","RR","Date:",{"$f":"NOW()","v":"2026-01-06T11:13:00.960"}]
["Type: ","LAPTOP","SN:",{"$f":"VLOOKUP(E467,INVENTORYDATA,10,FALSE)","v":"1TGQQV3"},null,null,"Type: ","LAPTOP","SN:",{"$f":"VLOOKUP(K467,INVENTORYDATA,10,FALSE)","v":"22YZRV3"}]
[{"$f":"\"Make: \"","v":"Make: "},{"$f":"VLOOKUP(E467,INVENTORYDATA,2,FALSE)","v":"DELL"},{"$f":"\"Model: \"","v":"Model: "},{"$f":"VLOOKUP(E467,INVENTORYDATA,3,FALSE)","v":"LATITUDE 5430"},null,null,{"$f":"\"Make: \"","v":"Make: "},{"$f":"VLOOKUP(K467,INVENTORYDATA,2,FALSE)","v":"DELL"},{"$f":"\"Model: \"","v":"Model: "},{"$f":"VLOOKUP(K467,INVENTORYDATA,3,FALSE)","v":"LATITUDE 5430"}]
[{"$f":"\"CPU/Speed: \"","v":"CPU/Speed: "},{"$f":"VLOOKUP(E467,INVENTORYDATA,4,FALSE)&\" / \"&VLOOKUP(E467,INVENTORYDATA,5,FALSE)&\"GHz\"","v":"I5-1235U / 4.4GHz"},null,{"$f":"\"Memory: \"","v":"Memory: "},{"$f":"VLOOKUP(E467,INVENTORYDATA,6,FALSE)","v":"16G"},null,{"$f":"\"CPU/Speed: \"","v":"CPU/Speed: "},{"$f":"VLOOKUP(K467,INVENTORYDATA,4,FALSE)&\" / \"&VLOOKUP(K467,INVENTORYDATA,5,FALSE)&\"GHz\"","v":"I5-1235U / 4.4GHz"},null,{"$f":"\"Memory: \"","v":"Memory: "},{"$f":"VLOOKUP(K467,INVENTORYDATA,6,FALSE)","v":"16G"}]
[]
["Key Function",null,"Pass","Fail ","Comments",null,"Key Function",null,"Pass","Fail ","Comments"]
["Hard Drive Removed",null,{"$f":"IF(ISBLANK(VLOOKUP(E467,INVENTORYDATA,13,FALSE)),\"X\",\"\")","v":""},null,{"$f":"IF(ISBLANK(VLOOKUP(E467,INVENTORYDATA,13,FALSE)),\"\",VLOOKUP(E467,INVENTORYDATA,13,FALSE))","v":"512G"},null,"Hard Drive Removed",null,{"$f":"IF(ISBLANK(VLOOKUP(K467,INVENTORYDATA,13,FALSE)),\"X\",\"\")","v":""},null,{"$f":"IF(ISBLANK(VLOOKUP(K467,INVENTORYDATA,13,FALSE)),\"\",VLOOKUP(K467,INVENTORYDATA,13,FALSE))","v":"512G"}]
["Install Memory",null,"X",{"$nulls":3},"Install Memory",null,"X"]
["Power ON",null,"X",{"$nulls":3},"Power ON",null,"X"]
["Record BIOS info",null,"X",{"$nulls":3},"Record BIOS info",null,"X"]
["Check Optical Drive",null,{"$f":"IF((VLOOKUP(E467,INVENTORYDATA,7,FALSE))=\"YES\",\"X\",\"\")","v":""},{"$f":"IF((VLOOKUP(E467,INVENTORYDATA,7,FALSE))=\"NO\",\"X\",\"\")","v":"X"},null,null,"Check Optical Drive",null,{"$f":"IF((VLOOKUP(K467,INVENTORYDATA,7,FALSE))=\"YES\",\"X\",\"\")","v":""},{"$f":"IF((VLOOKUP(K467,INVENTORYDATA,7,FALSE))=\"NO\",\"X\",\"\")","v":"X"}]
["Power Off",null,"X",{"$nulls":3},"Power Off",null,"X"]
["HDD Serial No.",null,{"$f":"IF(ISBLANK(VLOOKUP(E467,INVENTORYDATA,12,FALSE)),\"\",VLOOKUP(E467,INVENTORYDATA,12,FALSE))","v":"s509NF0N211663"},{"$nulls":3},"HDD Serial No.",null,{"$f":"IF(ISBLANK(VLOOKUP(K467,INVENTORYDATA,12,FALSE)),\"\",VLOOKUP(K467,INVENTORYDATA,12,FALSE))","v":"20208N445114"}]
[]
["Tested for key functions,R2/Ready for Resale",{"$nulls":5},"Tested for key functions,R2/Ready for Resale"]
["BIOS Lock","Caddy","Optical","WebCam","Battery",null,"BIOS Lock","Caddy","Optical","WebCam","Battery"]
[null,null,{"$f":"VLOOKUP(E467,INVENTORY!$A$2:$N$144,7,FALSE)","v":"NO"},{"$f":"VLOOKUP(E467,INVENTORY!$A$2:$N$144,8,FALSE)","v":"YES"},{"$f":"VLOOKUP(E467,INVENTORY!$A$2:$N$144,9,FALSE)","v":"YES"},{"$nulls":3},{"$f":"VLOOKUP(K467,INVENTORY!$A$2:$N$144,7,FALSE)","v":"NO"},{"$f":"VLOOKUP(K467,INVENTORY!$A$2:$N$144,8,FALSE)","v":"YES"},{"$f":"VLOOKUP(K467,INVENTORY!$A$2:$N$144,9,FALSE)","v":"YES"}]
[]
["CPU Cosmetics Defects:",null,{"$f":"\"Function Code: \"&VLOOKUP(E467,INVENTORY!$A$2:$Q$144,14,FALSE)","v":"Function Code: F3"},{"$nulls":3},"CPU Cosmetics Defects:",null,{"$f":"\"Function Code: \"&VLOOKUP(K467,INVENTORY!$A$2:$Q$144,14,FALSE)","v":"Function Code: F3"}]
[]
[null,null,{"$f":"\"Cosmetic Code: \"&VLOOKUP(E467,INVENTORY!$A$2:$Q$144,15,FALSE)","v":"Cosmetic Code: C5"},{"$nulls":5},{"$f":"\"Cosmetic Code: \"&VLOOKUP(K467,INVENTORY!$A$2:$Q$144,15,FALSE)","v":"Cosmetic Code: C5"}]
[]
["Casing","Plugs/Ports",{"$nulls":4},"Casing","Plugs/Ports"]
["Pass","Pass",{"$nulls":4},"Pass","Pass"]
["Fail","Fail",null,"TRRC#:L.T.R.",null,null,"Fail","Fail",null,"TRRC#:L.T.R."]
[]
["LAPTOP TESTING RECORD",{"$nulls":5},"LAPTOP TESTING RECORD"]
[]
[{"$nulls":3},"ITEM #",{"$f":"E467+2","v":35},{"$nulls":4},"ITEM #",{"$f":"K467+2","v":36}]
["Tester: ","RR","Date:",{"$f":"NOW()","v":"2026-01-06T11:13:00.960"},null,null,"Tester: ","RR","Date:",{"$f":"NOW()","v":"2026-01-06T11:13:00.960"}]
["Type: ","LAPTOP","SN:",{"$f":"VLOOKUP(E496,INVENTORYDATA,10,FALSE)","v":"36CRQV3"},null,null,"Type: ","LAPTOP","SN:",{"$f":"VLOOKUP(K496,INVENTORYDATA,10,FALSE)","v":"3Z7BHW3"}]
[{"$f":"\"Make: \"","v":"Make: "},{"$f":"VLOOKUP(E496,INVENTORYDATA,2,FALSE)","v":"DELL"},{"$f":"\"Model: \"","v":"Model: "},{"$f":"VLOOKUP(E496,INVENTORYDATA,3,FALSE)","v":"LATITUDE 5430"},null,null,{"$f":"\"Make: \"","v":"Make: "},{"$f":"VLOOKUP(K496,INVENTORYDATA,2,FALSE)","v":"DELL"},{"$f":"\"Model: \"","v":"Model: "},{"$f":"VLOOKUP(K496,INVENTORYDATA,3,FALSE)","v":"LATITUDE 5430"}]
[{"$f":"\"CPU/Speed: \"","v":"CPU/Speed: "},{"$f":"VLOOKUP(E496,INVENTORYDATA,4,FALSE)&\" / \"&VLOOKUP(E496,INVENTORYDATA,5,FALSE)&\"GHz\"","v":"I5-1235U / 4.4GHz"},null,{"$f":"\"Memory: \"","v":"Memory: "},{"$f":"VLOOKUP(E496,INVENTORYDATA,6,FALSE)","v":"16G"},null,{"$f":"\"CPU/Speed: \"","v":"CPU/Speed: "},{"$f":"VLOOKUP(K496,INVENTORYDATA,4,FALSE)&\" / \"&VLOOKUP(K496,INVENTORYDATA,5,FALSE)&\"GHz\"","v":"I5-1235U / 4.4GHz"},null,{"$f":"\"Memory: \"","v":"Memory: "},{"$f":"VLOOKUP(K496,INVENTORYDATA,6,FALSE)","v":"16G"}]
[]
["Key Function",null,"Pass","Fail ","Comments",null,"Key Function",null,"Pass","Fail ","Comments"]
["Hard Drive Removed",null,{"$f":"IF(ISBLANK(VLOOKUP(E496,INVENTORYDATA,13,FALSE)),\"X\",\"\")","v":""},null,{"$f":"IF(ISBLANK(VLOOKUP(E496,INVENTORYDATA,13,FALSE)),\"\",VLOOKUP(E496,INVENTORYDATA,13,FALSE))","v":"512G"},null,"Hard Drive Removed",null,{"$f":"IF(ISBLANK(VLOOKUP(K496,INVENTORYDATA,13,FALSE)),\"X\",\"\")","v":""},null,{"$f":"IF(ISBLANK(VLOOKUP(K496,INVENTORYDATA,13,FALSE)),\"\",VLOOKUP(K496,INVENTORYDATA,13,FALSE))","v":"512G"}]
["Install Memory",null,"X",{"$nulls":3},"Install Memory",null,"X"]
["Power ON",null,"X",{"$nulls":3},"Power ON",null,"X"]
["Record BIOS info",null,"X",{"$nulls":3},"Record BIOS info",null,"X"]
["Check Optical Drive",null,{"$f":"IF((VLOOKUP(E496,INVENTORYDATA,7,FALSE))=\"YES\",\"X\",\"\")","v":""},{"$f":"IF((VLOOKUP(E496,INVENTORYDATA,7,FALSE))=\"NO\",\"X\",\"\")","v":"X"},null,null,"Check Optical Drive",null,{"$f":"IF((VLOOKUP(K496,INVENTORYDATA,7,FALSE))=\"YES\",\"X\",\"\")","v":""},{"$f":"IF((VLOOKUP(K496,INVENTORYDATA,7,FALSE))=\"NO\",\"X\",\"\")","v":"X"}]
["Power Off",null,"X",{"$nulls":3},"Power Off",null,"X"]
["HDD Serial No.",null,{"$f":"IF(ISBLANK(VLOOKUP(E496,INVENTORYDATA,12,FALSE)),\"\",VLOOKUP(E496,INVENTORYDATA,12,FALSE))","v":"sn9AN86841150B51J"},{"$nulls":3},"HDD Serial No.",null,{"$f":"IF(ISBLANK(VLOOKUP(K496,INVENTORYDATA,12,FALSE)),\"\",VLOOKUP(K496,INVENTORYDATA,12,FALSE))","v":"sn9AN82631120B14N"}]
[]
["Tested for key functions,R2/Ready for Resale",{"$nulls":5},"Tested for key functions,R2/Ready for Resale"]
["BIOS Lock","Caddy","Optical","WebCam","Battery",null,"BIOS Lock","Caddy","Optical","WebCam","Battery"]
[null,null,{"$f":"VLOOKUP(E496,INVENTORY!$A$2:$N$144,7,FALSE)","v":"NO"},{"$f":"VLOOKUP(E496,INVENTORY!$A$2:$N$144,8,FALSE)","v":"YES"},{"$f":"VLOOKUP(E496,INVENTORY!$A$2:$N$144,9,FALSE)","v":"YES"},{"$nulls":3},{"$f":"VLOOKUP(K496,INVENTORY!$A$2:$N$144,7,FALSE)","v":"NO"},{"$f":"VLOOKUP(K496,INVENTORY!$A$2:$N$144,8,FALSE)","v":"YES"},{"$f":"VLOOKUP(K496,INVENTORY!$A$2:$N$144,9,FALSE)","v":"YES"}]
[]
["CPU Cosmetics Defects:",null,{"$f":"\"Function Code: \"&VLOOKUP(E496,INVENTORY!$A$2:$Q$144,14,FALSE)","v":"Function Code: F3"},{"$nulls":3},"CPU Cosmetics Defects:",null,{"$f":"\"Function Code: \"&VLOOKUP(K496,INVENTORY!$A$2:$Q$144,14,FALSE)","v":"Function Code: F3"}]
[]
[null,null,{"$f":"\"Cosmetic Code: \"&VLOOKUP(E496,INVENTORY!$A$2:$Q$144,15,FALSE)","v":"Cosmetic Code: C5"},{"$nulls":5},{"$f":"\"Cosmetic Code: \"&VLOOKUP(K496,INVENTORY!$A$2:$Q$144,15,FALSE)","v":"Cosmetic Code: C5"}]
[]
["Casing","Plugs/Ports",{"$nulls":4},"Casing","Plugs/Ports"]
["Pass","Pass",{"$nulls":4},"Pass","Pass"]
["Fail","Fail",null,"TRRC#:L.T.R.",null,null,"Fail","Fail",null,"TRRC#:L.T.R."]
[]
["LAPTOP TESTING RECORD",{"$nulls":5},"LAPTOP TESTING RECORD"]
[]
[{"$nulls":3},"ITEM #",{"$f":"E496+2","v":37},{"$nulls":4},"ITEM #",{"$f":"K496+2","v":38}]
["Tester: ","RR","Date:",{"$f":"NOW()","v":"2026-01-06T11:13:00.960"},null,null,"Tester: ","RR","Date:",{"$f":"NOW()","v":"2026-01-06T11:13:00.960"}]
["Type: ","LAPTOP","SN:",{"$f":"VLOOKUP(E525,INVENTORYDATA,10,FALSE)","v":"5M4TTV3"},null,null,"Type: ","LAPTOP","SN:",{"$f":"VLOOKUP(K525,INVENTORYDATA,10,FALSE)","v":"5Z2BHW3"}]
[{"$f":"\"Make: \"","v":"Make: "},{"$f":"VLOOKUP(E525,INVENTORYDATA,2,FALSE)","v":"DELL"},{"$f":"\"Model: \"","v":"Model: "},{"$f":"VLOOKUP(E525,INVENTORYDATA,3,FALSE)","v":"LATITUDE 5430"},null,null,{"$f":"\"Make: \"","v":"Make: "},{"$f":"VLOOKUP(K525,INVENTORYDATA,2,FALSE)","v":"DELL"},{"$f":"\"Model: \"","v":"Model: "},{"$f":"VLOOKUP(K525,INVENTORYDATA,3,FALSE)","v":"LATITUDE 5430"}]
[{"$f":"\"CPU/Speed: \"","v":"CPU/Speed: "},{"$f":"VLOOKUP(E525,INVENTORYDATA,4,FALSE)&\" / \"&VLOOKUP(E525,INVENTORYDATA,5,FALSE)&\"GHz\"","v":"I5-1235U / 4.4GHz"},null,{"$f":"\"Memory: \"","v":"Memory: "},{"$f":"VLOOKUP(E525,INVENTORYDATA,6,FALSE)","v":"16G"},null,{"$f":"\"CPU/Speed: \"","v":"CPU/Speed: "},{"$f":"VLOOKUP(K525,INVENTORYDATA,4,FALSE)&\" / \"&VLOOKUP(K525,INVENTORYDATA,5,FALSE)&\"GHz\"","v":"I5-1235U / 4.4GHz"},null,{"$f":"\"Memory: \"","v":"Memory: "},{"$f":"VLOOKUP(K525,INVENTORYDATA,6,FALSE)","v":"16G"}]
[]
["Key Function",null,"Pass","Fail ","Comments",null,"Key Function",null,"Pass","Fail ","Comments"]
["Hard Drive Removed",null,{"$f":"IF(ISBLANK(VLOOKUP(E525,INVENTORYDATA,13,FALSE)),\"X\",\"\")","v":""},null,{"$f":"IF(ISBLANK(VLOOKUP(E525,INVENTORYDATA,13,FALSE)),\"\",VLOOKUP(E525,INVENTORYDATA,13,FALSE))","v":"512G"},null,"Hard Drive Removed",null,{"$f":"IF(ISBLANK(VLOOKUP(K525,INVENTORYDATA,13,FALSE)),\"X\",\"\")","v":""},null,{"$f":"IF(ISBLANK(VLOOKUP(K525,INVENTORYDATA,13,FALSE)),\"\",VLOOKUP(K525,INVENTORYDATA,13,FALSE))","v":"512G"}]
["Install Memory",null,"X",{"$nulls":3},"Install Memory",null,"X"]
["Power ON",null,"X",{"$nulls":3},"Power ON",null,"X"]
["Record BIOS info",null,"X",{"$nulls":3},"Record BIOS info",null,"X"]
["Check Optical Drive",null,{"$f":"IF((VLOOKUP(E525,INVENTORYDATA,7,FALSE))=\"YES\",\"X\",\"\")","v":""},{"$f":"IF((VLOOKUP(E525,INVENTORYDATA,7,FALSE))=\"NO\",\"X\",\"\")","v":"X"},null,null,"Check Optical Drive",null,{"$f":"IF((VLOOKUP(K525,INVENTORYDATA,7,FALSE))=\"YES\",\"X\",\"\")","v":""},{"$f":"IF((VLOOKUP(K525,INVENTORYDATA,7,FALSE))=\"NO\",\"X\",\"\")","v":"X"}]
["Power Off",null,"X",{"$nulls":3},"Power Off",null,"X"]
["HDD Serial No.",null,{"$f":"IF(ISBLANK(VLOOKUP(E525,INVENTORYDATA,12,FALSE)),\"\",VLOOKUP(E525,INVENTORYDATA,12,FALSE))","v":"tw07YGY09DH0002J00XA"},{"$nulls":3},"HDD Serial No.",null,{"$f":"IF(ISBLANK(VLOOKUP(K525,INVENTORYDATA,12,FALSE)),\"\",VLOOKUP(K525,INVENTORYDATA,12,FALSE))","v":"sn9AN82571020AU0O"}]
[]
["Tested for key functions,R2/Ready for Resale",{"$nulls":5},"Tested for key functions,R2/Ready for Resale"]
["BIOS Lock","Caddy","Optical","WebCam","Battery",null,"BIOS Lock","Caddy","Optical","WebCam","Battery"]
[null,null,{"$f":"VLOOKUP(E525,INVENTORY!$A$2:$N$144,7,FALSE)","v":"NO"},{"$f":"VLOOKUP(E525,INVENTORY!$A$2:$N$144,8,FALSE)","v":"YES"},{"$f":"VLOOKUP(E525,INVENTORY!$A$2:$N$144,9,FALSE)","v":"YES"},{"$nulls":3},{"$f":"VLOOKUP(K525,INVENTORY!$A$2:$N$144,7,FALSE)","v":"NO"},{"$f":"VLOOKUP(K525,INVENTORY!$A$2:$N$144,8,FALSE)","v":"YES"},{"$f":"VLOOKUP(K525,INVENTORY!$A$2:$N$144,9,FALSE)","v":"YES"}]
[]
["CPU Cosmetics Defects:",null,{"$f":"\"Function Code: \"&VLOOKUP(E525,INVENTORY!$A$2:$Q$144,14,FALSE)","v":"Function Code: F3"},{"$nulls":3},"CPU Cosmetics Defects:",null,{"$f":"\"Function Code: \"&VLOOKUP(K525,INVENTORY!$A$2:$Q$144,14,FALSE)","v":"Function Code: F3"}]
[]
[null,null,{"$f":"\"Cosmetic Code: \"&VLOOKUP(E525,INVENTORY!$A$2:$Q$144,15,FALSE)","v":"Cosmetic Code: C5"},{"$nulls":5},{"$f":"\"Cosmetic Code: \"&VLOOKUP(K525,INVENTORY!$A$2:$Q$144,15,FALSE)","v":"Cosmetic Code: C5"}]
[]
["Casing","Plugs/Ports",{"$nulls":4},"Casing","Plugs/Ports"]
["Pass","Pass",{"$nulls":4},"Pass","Pass"]
["Fail","Fail",null,"TRRC#:L.T.R.",null,null,"Fail","Fail",null,"TRRC#:L.T.R."]
[]
["LAPTOP TESTING RECORD",{"$nulls":5},"LAPTOP TESTING RECORD"]
[]
[{"$nulls":3},"ITEM #",{"$f":"E525+2","v":39},{"$nulls":4},"ITEM #",{"$f":"K525+2","v":40}]
["Tester: ","RR","Date:",{"$f":"NOW()","v":"2026-01-06T11:13:00.960"},null,null,"Tester: ","RR","Date:",{"$f":"NOW()","v":"2026-01-06T11:13:00.960"}]
["Type: ","LAPTOP","SN:",{"$f":"VLOOKUP(E554,INVENTORYDATA,10,FALSE)","v":"6C1TTV3"},null,null,"Type: ","LAPTOP","SN:",{"$f":"VLOOKUP(K554,INVENTORYDATA,10,FALSE)","v":"6V4WRV3"}]
[{"$f":"\"Make: \"","v":"Make: "},{"$f":"VLOOKUP(E554,INVENTORYDATA,2,FALSE)","v":"DELL"},{"$f":"\"Model: \"","v":"Model: "},{"$f":"VLOOKUP(E554,INVENTORYDATA,3,FALSE)","v":"LATITUDE 5430"},null,null,{"$f":"\"Make: \"","v":"Make: "},{"$f":"VLOOKUP(K554,INVENTORYDATA,2,FALSE)","v":"DELL"},{"$f":"\"Model: \"","v":"Model: "},{"$f":"VLOOKUP(K554,INVENTORYDATA,3,FALSE)","v":"LATITUDE 5430"}]
[{"$f":"\"CPU/Speed: \"","v":"CPU/Speed: "},{"$f":"VLOOKUP(E554,INVENTORYDATA,4,FALSE)&\" / \"&VLOOKUP(E554,INVENTORYDATA,5,FALSE)&\"GHz\"","v":"I5-1235U / 4.4GHz"},null,{"$f":"\"Memory: \"","v":"Memory: "},{"$f":"VLOOKUP(E554,INVENTORYDATA,6,FALSE)","v":"16G"},null,{"$f":"\"CPU/Speed: \"","v":"CPU/Speed: "},{"$f":"VLOOKUP(K554,INVENTORYDATA,4,FALSE)&\" / \"&VLOOKUP(K554,INVENTORYDATA,5,FALSE)&\"GHz\"","v":"I5-1235U / 4.4GHz"},null,{"$f":"\"Memory: \"","v":"Memory: "},{"$f":"VLOOKUP(K554,INVENTORYDATA,6,FALSE)","v":"16G"}]
[]
["Key Function",null,"Pass","Fail ","Comments",null,"Key Function",null,"Pass","Fail ","Comments"]
["Hard Drive Removed",null,{"$f":"IF(ISBLANK(VLOOKUP(E554,INVENTORYDATA,13,FALSE)),\"X\",\"\")","v":""},null,{"$f":"IF(ISBLANK(VLOOKUP(E554,INVENTORYDATA,13,FALSE)),\"\",VLOOKUP(E554,INVENTORYDATA,13,FALSE))","v":"512G"},null,"Hard Drive Removed",null,{"$f":"IF(ISBLANK(VLOOKUP(K554,INVENTORYDATA,13,FALSE)),\"X\",\"\")","v":""},null,{"$f":"IF(ISBLANK(VLOOKUP(K554,INVENTORYDATA,13,FALSE)),\"\",VLOOKUP(K554,INVENTORYDATA,13,FALSE))","v":"512G"}]
["Install Memory",null,"X",{"$nulls":3},"Install Memory",null,"X"]
["Power ON",null,"X",{"$nulls":3},"Power ON",null,"X"]
["Record BIOS info",null,"X",{"$nulls":3},"Record BIOS info",null,"X"]
["Check Optical Drive",null,{"$f":"IF((VLOOKUP(E554,INVENTORYDATA,7,FALSE))=\"YES\",\"X\",\"\")","v":""},{"$f":"IF((VLOOKUP(E554,INVENTORYDATA,7,FALSE))=\"NO\",\"X\",\"\")","v":"X"},null,null,"Check Optical Drive",null,{"$f":"IF((VLOOKUP(K554,INVENTORYDATA,7,FALSE))=\"YES\",\"X\",\"\")","v":""},{"$f":"IF((VLOOKUP(K554,INVENTORYDATA,7,FALSE))=\"NO\",\"X\",\"\")","v":"X"}]
["Power Off",null,"X",{"$nulls":3},"Power Off",null,"X"]
["HDD Serial No.",null,{"$f":"IF(ISBLANK(VLOOKUP(E554,INVENTORYDATA,12,FALSE)),\"\",VLOOKUP(E554,INVENTORYDATA,12,FALSE))","v":"s509NF0N212001"},{"$nulls":3},"HDD Serial No.",null,{"$f":"IF(ISBLANK(VLOOKUP(K554,INVENTORYDATA,12,FALSE)),\"\",VLOOKUP(K554,INVENTORYDATA,12,FALSE))","v":"sn9AN74551100AU5E"}]
[]
["Tested for key functions,R2/Ready for Resale",{"$nulls":5},"Tested for key functions,R2/Ready for Resale"]
["BIOS Lock","Caddy","Optical","WebCam","Battery",null,"BIOS Lock","Caddy","Optical","WebCam","Battery"]
[null,null,{"$f":"VLOOKUP(E554,INVENTORY!$A$2:$N$144,7,FALSE)","v":"NO"},{"$f":"VLOOKUP(E554,INVENTORY!$A$2:$N$144,8,FALSE)","v":"YES"},{"$f":"VLOOKUP(E554,INVENTORY!$A$2:$N$144,9,FALSE)","v":"YES"},{"$nulls":3},{"$f":"VLOOKUP(K554,INVENTORY!$A$2:$N$144,7,FALSE)","v":"NO"},{"$f":"VLOOKUP(K554,INVENTORY!$A$2:$N$144,8,FALSE)","v":"YES"},{"$f":"VLOOKUP(K554,INVENTORY!$A$2:$N$144,9,FALSE)","v":"YES"}]
[]
["CPU Cosmetics Defects:",null,{"$f":"\"Function Code: \"&VLOOKUP(E554,INVENTORY!$A$2:$Q$144,14,FALSE)","v":"Function Code: F3"},{"$nulls":3},"CPU Cosmetics Defects:",null,{"$f":"\"Function Code: \"&VLOOKUP(K554,INVENTORY!$A$2:$Q$144,14,FALSE)","v":"Function Code: F3"}]
[]
[null,null,{"$f":"\"Cosmetic Code: \"&VLOOKUP(E554,INVENTORY!$A$2:$Q$144,15,FALSE)","v":"Cosmetic Code: C5"},{"$nulls":5},{"$f":"\"Cosmetic Code: \"&VLOOKUP(K554,INVENTORY!$A$2:$Q$144,15,FALSE)","v":"Cosmetic Code: C5"}]
[]
["Casing","Plugs/Ports",{"$nulls":4},"Casing","Plugs/Ports"]
["Pass","Pass",{"$nulls":4},"Pass","Pass"]
["Fail","Fail",null,"TRRC#:L.T.R.",null,null,"Fail","Fail",null,"TRRC#:L.T.R."]
[]
["LAPTOP TESTING RECORD",{"$nulls":5},"LAPTOP TESTING RECORD"]
[]
[{"$nulls":3},"ITEM #",{"$f":"E554+2","v":41},{"$nulls":4},"ITEM #",{"$f":"K554+2","v":42}]
["Tester: ","RR","Date:",{"$f":"NOW()","v":"2026-01-06T11:13:00.960"},null,null,"Tester: ","RR","Date:",{"$f":"NOW()","v":"2026-01-06T11:13:00.960"}]
["Type: ","LAPTOP","SN:",{"$f":"VLOOKUP(E583,INVENTORYDATA,10,FALSE)","v":"7Y0PQV3"},null,null,"Type: ","LAPTOP","SN:",{"$f":"VLOOKUP(K583,INVENTORYDATA,10,FALSE)","v":"BYBKHW3"}]
[{"$f":"\"Make: \"","v":"Make: "},{"$f":"VLOOKUP(E583,INVENTORYDATA,2,FALSE)","v":"DELL"},{"$f":"\"Model: \"","v":"Model: "},{"$f":"VLOOKUP(E583,INVENTORYDATA,3,FALSE)","v":"LATITUDE 5430"},null,null,{"$f":"\"Make: \"","v":"Make: "},{"$f":"VLOOKUP(K583,INVENTORYDATA,2,FALSE)","v":"DELL"},{"$f":"\"Model: \"","v":"Model: "},{"$f":"VLOOKUP(K583,INVENTORYDATA,3,FALSE)","v":"LATITUDE 5430"}]
[{"$f":"\"CPU/Speed: \"","v":"CPU/Speed: "},{"$f":"VLOOKUP(E583,INVENTORYDATA,4,FALSE)&\" / \"&VLOOKUP(E583,INVENTORYDATA,5,FALSE)&\"GHz\"","v":"I5-1235U / 4.4GHz"},null,{"$f":"\"Memory: \"","v":"Memory: "},{"$f":"VLOOKUP(E583,INVENTORYDATA,6,FALSE)","v":"16G"},null,{"$f":"\"CPU/Speed: \"","v":"CPU/Speed: "},{"$f":"VLOOKUP(K583,INVENTORYDATA,4,FALSE)&\" / \"&VLOOKUP(K583,INVENTORYDATA,5,FALSE)&\"GHz\"","v":"I5-1235U / 4.4GHz"},null,{"$f":"\"Memory: \"","v":"Memory: "},{"$f":"VLOOKUP(K583,INVENTORYDATA,6,FALSE)","v":"16G"}]
[]
["Key Function",null,"Pass","Fail ","Comments",null,"Key Function",null,"Pass","Fail ","Comments"]
["Hard Drive Removed",null,{"$f":"IF(ISBLANK(VLOOKUP(E583,INVENTORYDATA,13,FALSE)),\"X\",\"\")","v":""},null,{"$f":"IF(ISBLANK(VLOOKUP(E583,INVENTORYDATA,13,FALSE)),\"\",VLOOKUP(E583,INVENTORYDATA,13,FALSE))","v":"512G"},null,"Hard Drive Removed",null,{"$f":"IF(ISBLANK(VLOOKUP(K583,INVENTORYDATA,13,FALSE)),\"X\",\"\")","v":""},null,{"$f":"IF(ISBLANK(VLOOKUP(K583,INVENTORYDATA,13,FALSE)),\"\",VLOOKUP(K583,INVENTORYDATA,13,FALSE))","v":"512G"}]
["Install Memory",null,"X",{"$nulls":3},"Install Memory",null,"X"]
["Power ON",null,"X",{"$nulls":3},"Power ON",null,"X"]
["Record BIOS info",null,"X",{"$nulls":3},"Record BIOS info",null,"X"]
["Check Optical Drive",null,{"$f":"IF((VLOOKUP(E583,INVENTORYDATA,7,FALSE))=\"YES\",\"X\",\"\")","v":""},{"$f":"IF((VLOOKUP(E583,INVENTORYDATA,7,FALSE))=\"NO\",\"X\",\"\")","v":"X"},null,null,"Check Optical Drive",null,{"$f":"IF((VLOOKUP(K583,INVENTORYDATA,7,FALSE))=\"YES\",\"X\",\"\")","v":""},{"$f":"IF((VLOOKUP(K583,INVENTORYDATA,7,FALSE))=\"NO\",\"X\",\"\")","v":"X"}]
["Power Off",null,"X",{"$nulls":3},"Power Off",null,"X"]
["HDD Serial No.",null,{"$f":"IF(ISBLANK(VLOOKUP(E583,INVENTORYDATA,12,FALSE)),\"\",VLOOKUP(E583,INVENTORYDATA,12,FALSE))","v":"sn9AN86841150B51O"},{"$nulls":3},"HDD Serial No.",null,{"$f":"IF(ISBLANK(VLOOKUP(K583,INVENTORYDATA,12,FALSE)),\"\",VLOOKUP(K583,INVENTORYDATA,12,FALSE))","v":201691440403}]
[]
["Tested for key functions,R2/Ready for Resale",{"$nulls":5},"Tested for key functions,R2/Ready for Resale"]
["BIOS Lock","Caddy","Optical","WebCam","Battery",null,"BIOS Lock","Caddy","Optical","WebCam","Battery"]
[null,null,{"$f":"VLOOKUP(E583,INVENTORY!$A$2:$N$144,7,FALSE)","v":"NO"},{"$f":"VLOOKUP(E583,INVENTORY!$A$2:$N$144,8,FALSE)","v":"YES"},{"$f":"VLOOKUP(E583,INVENTORY!$A$2:$N$144,9,FALSE)","v":"YES"},{"$nulls":3},{"$f":"VLOOKUP(K583,INVENTORY!$A$2:$N$144,7,FALSE)","v":"NO"},{"$f":"VLOOKUP(K583,INVENTORY!$A$2:$N$144,8,FALSE)","v":"YES"},{"$f":"VLOOKUP(K583,INVENTORY!$A$2:$N$144,9,FALSE)","v":"YES"}]
[]
["CPU Cosmetics Defects:",null,{"$f":"\"Function Code: \"&VLOOKUP(E583,INVENTORY!$A$2:$Q$144,14,FALSE)","v":"Function Code: F3"},{"$nulls":3},"CPU Cosmetics Defects:",null,{"$f":"\"Function Code: \"&VLOOKUP(K583,INVENTORY!$A$2:$Q$144,14,FALSE)","v":"Function Code: F3"}]
[]
[null,null,{"$f":"\"Cosmetic Code: \"&VLOOKUP(E583,INVENTORY!$A$2:$Q$144,15,FALSE)","v":"Cosmetic Code: C5"},{"$nulls":5},{"$f":"\"Cosmetic Code: \"&VLOOKUP(K583,INVENTORY!$A$2:$Q$144,15,FALSE)","v":"Cosmetic Code: C5"}]
[]
["Casing","Plugs/Ports",{"$nulls":4},"Casing","Plugs/Ports"]
["Pass","Pass",{"$nulls":4},"Pass","Pass"]
["Fail","Fail",null,"TRRC#:L.T.R.",null,null,"Fail","Fail",null,"TRRC#:L.T.R."]
[]
["LAPTOP TESTING RECORD",{"$nulls":5},"LAPTOP TESTING RECORD"]
[]
[{"$nulls":3},"ITEM #",{"$f":"E583+2","v":43},{"$nulls":4},"ITEM #",{"$f":"K583+2","v":44}]
["Tester: ","RR","Date:",{"$f":"NOW()","v":"2026-01-06T11:13:00.960"},null,null,"Tester: ","RR","Date:",{"$f":"NOW()","v":"2026-01-06T11:13:00.960"}]
["Type: ","LAPTOP","SN:",{"$f":"VLOOKUP(E612,INVENTORYDATA,10,FALSE)","v":"G1YZRV3"},null,null,"Type: ","LAPTOP","SN:",{"$f":"VLOOKUP(K612,INVENTORYDATA,10,FALSE)","v":"G8N0SV3"}]
[{"$f":"\"Make: \"","v":"Make: "},{"$f":"VLOOKUP(E612,INVENTORYDATA,2,FALSE)","v":"DELL"},{"$f":"\"Model: \"","v":"Model: "},{"$f":"VLOOKUP(E612,INVENTORYDATA,3,FALSE)","v":"LATITUDE 5430"},null,null,{"$f":"\"Make: \"","v":"Make: "},{"$f":"VLOOKUP(K612,INVENTORYDATA,2,FALSE)","v":"DELL"},{"$f":"\"Model: \"","v":"Model: "},{"$f":"VLOOKUP(K612,INVENTORYDATA,3,FALSE)","v":"LATITUDE 5430"}]
[{"$f":"\"CPU/Speed: \"","v":"CPU/Speed: "},{"$f":"VLOOKUP(E612,INVENTORYDATA,4,FALSE)&\" / \"&VLOOKUP(E612,INVENTORYDATA,5,FALSE)&\"GHz\"","v":"I5-1235U / 4.4GHz"},null,{"$f":"\"Memory: \"","v":"Memory: "},{"$f":"VLOOKUP(E612,INVENTORYDATA,6,FALSE)","v":"16G"},null,{"$f":"\"CPU/Speed: \"","v":"CPU/Speed: "},{"$f":"VLOOKUP(K612,INVENTORYDATA,4,FALSE)&\" / \"&VLOOKUP(K612,INVENTORYDATA,5,FALSE)&\"GHz\"","v":"I5-1235U / 4.4GHz"},null,{"$f":"\"Memory: \"","v":"Memory: "},{"$f":"VLOOKUP(K612,INVENTORYDATA,6,FALSE)","v":"16G"}]
[]
["Key Function",null,"Pass","Fail ","Comments",null,"Key Function",null,"Pass","Fail ","Comments"]
["Hard Drive Removed",null,{"$f":"IF(ISBLANK(VLOOKUP(E612,INVENTORYDATA,13,FALSE)),\"X\",\"\")","v":""},null,{"$f":"IF(ISBLANK(VLOOKUP(E612,INVENTORYDATA,13,FALSE)),\"\",VLOOKUP(E612,INVENTORYDATA,13,FALSE))","v":"512G"},null,"Hard Drive Removed",null,{"$f":"IF(ISBLANK(VLOOKUP(K612,INVENTORYDATA,13,FALSE)),\"X\",\"\")","v":""},null,{"$f":"IF(ISBLANK(VLOOKUP(K612,INVENTORYDATA,13,FALSE)),\"\",VLOOKUP(K612,INVENTORYDATA,13,FALSE))","v":"512G"}]
["Install Memory",null,"X",{"$nulls":3},"Install Memory",null,"X"]
["Power ON",null,"X",{"$nulls":3},"Power ON",null,"X"]
["Record BIOS info",null,"X",{"$nulls":3},"Record BIOS info",null,"X"]
["Check Optical Drive",null,{"$f":"IF((VLOOKUP(E612,INVENTORYDATA,7,FALSE))=\"YES\",\"X\",\"\")","v":""},{"$f":"IF((VLOOKUP(E612,INVENTORYDATA,7,FALSE))=\"NO\",\"X\",\"\")","v":"X"},null,null,"Check Optical Drive",null,{"$f":"IF((VLOOKUP(K612,INVENTORYDATA,7,FALSE))=\"YES\",\"X\",\"\")","v":""},{"$f":"IF((VLOOKUP(K612,INVENTORYDATA,7,FALSE))=\"NO\",\"X\",\"\")","v":"X"}]
["Power Off",null,"X",{"$nulls":3},"Power Off",null,"X"]
["HDD Serial No.",null,{"$f":"IF(ISBLANK(VLOOKUP(E612,INVENTORYDATA,12,FALSE)),\"\",VLOOKUP(E612,INVENTORYDATA,12,FALSE))","v":"nn05N708911505H3R"},{"$nulls":3},"HDD Serial No.",null,{"$f":"IF(ISBLANK(VLOOKUP(K612,INVENTORYDATA,12,FALSE)),\"\",VLOOKUP(K612,INVENTORYDATA,12,FALSE))","v":"2020A7809145"}]
[]
["Tested for key functions,R2/Ready for Resale",{"$nulls":5},"Tested for key functions,R2/Ready for Resale"]
["BIOS Lock","Caddy","Optical","WebCam","Battery",null,"BIOS Lock","Caddy","Optical","WebCam","Battery"]
[null,null,{"$f":"VLOOKUP(E612,INVENTORY!$A$2:$N$144,7,FALSE)","v":"NO"},{"$f":"VLOOKUP(E612,INVENTORY!$A$2:$N$144,8,FALSE)","v":"YES"},{"$f":"VLOOKUP(E612,INVENTORY!$A$2:$N$144,9,FALSE)","v":"YES"},{"$nulls":3},{"$f":"VLOOKUP(K612,INVENTORY!$A$2:$N$144,7,FALSE)","v":"NO"},{"$f":"VLOOKUP(K612,INVENTORY!$A$2:$N$144,8,FALSE)","v":"YES"},{"$f":"VLOOKUP(K612,INVENTORY!$A$2:$N$144,9,FALSE)","v":"YES"}]
[]
["CPU Cosmetics Defects:",null,{"$f":"\"Function Code: \"&VLOOKUP(E612,INVENTORY!$A$2:$Q$144,14,FALSE)","v":"Function Code: F3"},{"$nulls":3},"CPU Cosmetics Defects:",null,{"$f":"\"Function Code: \"&VLOOKUP(K612,INVENTORY!$A$2:$Q$144,14,FALSE)","v":"Function Code: F3"}]
[]
[null,null,{"$f":"\"Cosmetic Code: \"&VLOOKUP(E612,INVENTORY!$A$2:$Q$144,15,FALSE)","v":"Cosmetic Code: C5"},{"$nulls":5},{"$f":"\"Cosmetic Code: \"&VLOOKUP(K612,INVENTORY!$A$2:$Q$144,15,FALSE)","v":"Cosmetic Code: C5"}]
[]
["Casing","Plugs/Ports",{"$nulls":4},"Casing","Plugs/Ports"]
["Pass","Pass",{"$nulls":4},"Pass","Pass"]
["Fail","Fail",null,"TRRC#:L.T.R.",null,null,"Fail","Fail",null,"TRRC#:L.T.R."]
[]
["LAPTOP TESTING RECORD",{"$nulls":5},"LAPTOP TESTING RECORD"]
[]
[{"$nulls":3},"ITEM #",{"$f":"E612+2","v":45},{"$nulls":4},"ITEM #",{"$f":"K612+2","v":46}]
["Tester: ","RR","Date:",{"$f":"NOW()","v":"2026-01-06T11:13:00.960"},null,null,"Tester: ","RR","Date:",{"$f":"NOW()","v":"2026-01-06T11:13:00.960"}]
["Type: ","LAPTOP","SN:",{"$f":"VLOOKUP(E641,INVENTORYDATA,10,FALSE)","v":"2TK3420LCK"},null,null,"Type: ","LAPTOP","SN:",{"$f":"VLOOKUP(K641,INVENTORYDATA,10,FALSE)","v":"2TK3330208"}]
[{"$f":"\"Make: \"","v":"Make: "},{"$f":"VLOOKUP(E641,INVENTORYDATA,2,FALSE)","v":"HP"},{"$f":"\"Model: \"","v":"Model: "},{"$f":"VLOOKUP(E641,INVENTORYDATA,3,FALSE)","v":"ELITEBOOK 630 G9"},null,null,{"$f":"\"Make: \"","v":"Make: "},{"$f":"VLOOKUP(K641,INVENTORYDATA,2,FALSE)","v":"HP"},{"$f":"\"Model: \"","v":"Model: "},{"$f":"VLOOKUP(K641,INVENTORYDATA,3,FALSE)","v":"ELITEBOOK 630 G9"}]
[{"$f":"\"CPU/Speed: \"","v":"CPU/Speed: "},{"$f":"VLOOKUP(E641,INVENTORYDATA,4,FALSE)&\" / \"&VLOOKUP(E641,INVENTORYDATA,5,FALSE)&\"GHz\"","v":"I5-1245U / 3.9GHz"},null,{"$f":"\"Memory: \"","v":"Memory: "},{"$f":"VLOOKUP(E641,INVENTORYDATA,6,FALSE)","v":"16G"},null,{"$f":"\"CPU/Speed: \"","v":"CPU/Speed: "},{"$f":"VLOOKUP(K641,INVENTORYDATA,4,FALSE)&\" / \"&VLOOKUP(K641,INVENTORYDATA,5,FALSE)&\"GHz\"","v":"I5-1245U / 3.9GHz"},null,{"$f":"\"Memory: \"","v":"Memory: "},{"$f":"VLOOKUP(K641,INVENTORYDATA,6,FALSE)","v":"16G"}]
[]
["Key Function",null,"Pass","Fail ","Comments",null,"Key Function",null,"Pass","Fail ","Comments"]
["Hard Drive Removed",null,{"$f":"IF(ISBLANK(VLOOKUP(E641,INVENTORYDATA,13,FALSE)),\"X\",\"\")","v":""},null,{"$f":"IF(ISBLANK(VLOOKUP(E641,INVENTORYDATA,13,FALSE)),\"\",VLOOKUP(E641,INVENTORYDATA,13,FALSE))","v":"512G"},null,"Hard Drive Removed",null,{"$f":"IF(ISBLANK(VLOOKUP(K641,INVENTORYDATA,13,FALSE)),\"X\",\"\")","v":""},null,{"$f":"IF(ISBLANK(VLOOKUP(K641,INVENTORYDATA,13,FALSE)),\"\",VLOOKUP(K641,INVENTORYDATA,13,FALSE))","v":"512G"}]
["Install Memory",null,"X",{"$nulls":3},"Install Memory",null,"X"]
["Power ON",null,"X",{"$nulls":3},"Power ON",null,"X"]
["Record BIOS info",null,"X",{"$nulls":3},"Record BIOS info",null,"X"]
["Check Optical Drive",null,{"$f":"IF((VLOOKUP(E641,INVENTORYDATA,7,FALSE))=\"YES\",\"X\",\"\")","v":""},{"$f":"IF((VLOOKUP(E641,INVENTORYDATA,7,FALSE))=\"NO\",\"X\",\"\")","v":"X"},null,null,"Check Optical Drive",null,{"$f":"IF((VLOOKUP(K641,INVENTORYDATA,7,FALSE))=\"YES\",\"X\",\"\")","v":""},{"$f":"IF((VLOOKUP(K641,INVENTORYDATA,7,FALSE))=\"NO\",\"X\",\"\")","v":"X"}]
["Power Off",null,"X",{"$nulls":3},"Power Off",null,"X"]
["HDD Serial No.",null,{"$f":"IF(ISBLANK(VLOOKUP(E641,INVENTORYDATA,12,FALSE)),\"\",VLOOKUP(E641,INVENTORYDATA,12,FALSE))","v":"s509NF0N320162"},{"$nulls":3},"HDD Serial No.",null,{"$f":"IF(ISBLANK(VLOOKUP(K641,INVENTORYDATA,12,FALSE)),\"\",VLOOKUP(K641,INVENTORYDATA,12,FALSE))","v":"sn9AN86841150B50W"}]
[]
["Tested for key functions,R2/Ready for Resale",{"$nulls":5},"Tested for key functions,R2/Ready for Resale"]
["BIOS Lock","Caddy","Optical","WebCam","Battery",null,"BIOS Lock","Caddy","Optical","WebCam","Battery"]
[null,null,{"$f":"VLOOKUP(E641,INVENTORY!$A$2:$N$144,7,FALSE)","v":"NO"},{"$f":"VLOOKUP(E641,INVENTORY!$A$2:$N$144,8,FALSE)","v":"YES"},{"$f":"VLOOKUP(E641,INVENTORY!$A$2:$N$144,9,FALSE)","v":"YES"},{"$nulls":3},{"$f":"VLOOKUP(K641,INVENTORY!$A$2:$N$144,7,FALSE)","v":"NO"},{"$f":"VLOOKUP(K641,INVENTORY!$A$2:$N$144,8,FALSE)","v":"YES"},{"$f":"VLOOKUP(K641,INVENTORY!$A$2:$N$144,9,FALSE)","v":"YES"}]
[]
["CPU Cosmetics Defects:",null,{"$f":"\"Function Code: \"&VLOOKUP(E641,INVENTORY!$A$2:$Q$144,14,FALSE)","v":"Function Code: F3"},{"$nulls":3},"CPU Cosmetics Defects:",null,{"$f":"\"Function Code: \"&VLOOKUP(K641,INVENTORY!$A$2:$Q$144,14,FALSE)","v":"Function Code: F3"}]
[]
[null,null,{"$f":"\"Cosmetic Code: \"&VLOOKUP(E641,INVENTORY!$A$2:$Q$144,15,FALSE)","v":"Cosmetic Code: C5"},{"$nulls":5},{"$f":"\"Cosmetic Code: \"&VLOOKUP(K641,INVENTORY!$A$2:$Q$144,15,FALSE)","v":"Cosmetic Code: C5"}]
[]
["Casing","Plugs/Ports",{"$nulls":4},"Casing","Plugs/Ports"]
["Pass","Pass",{"$nulls":4},"Pass","Pass"]
["Fail","Fail",null,"TRRC#:L.T.R.",null,null,"Fail","Fail",null,"TRRC#:L.T.R."]
[]
["LAPTOP TESTING RECORD",{"$nulls":5},"LAPTOP TESTING RECORD"]
[]
[{"$nulls":3},"ITEM #",{"$f":"E641+2","v":47},{"$nulls":4},"ITEM #",{"$f":"K641+2","v":48}]
["Tester: ","RR","Date:",{"$f":"NOW()","v":"2026-01-06T11:13:00.960"},null,null,"Tester: ","RR","Date:",{"$f":"NOW()","v":"2026-01-06T11:13:00.960"}]
["Type: ","LAPTOP","SN:",{"$f":"VLOOKUP(E670,INVENTORYDATA,10,FALSE)","v":"2TK333024T"},null,null,"Type: ","LAPTOP","SN:",{"$f":"VLOOKUP(K670,INVENTORYDATA,10,FALSE)","v":"2TK333027J"}]
[{"$f":"\"Make: \"","v":"Make: "},{"$f":"VLOOKUP(E670,INVENTORYDATA,2,FALSE)","v":"HP"},{"$f":"\"Model: \"","v":"Model: "},{"$f":"VLOOKUP(E670,INVENTORYDATA,3,FALSE)","v":"ELITEBOOK 630 G9"},null,null,{"$f":"\"Make: \"","v":"Make: "},{"$f":"VLOOKUP(K670,INVENTORYDATA,2,FALSE)","v":"HP"},{"$f":"\"Model: \"","v":"Model: "},{"$f":"VLOOKUP(K670,INVENTORYDATA,3,FALSE)","v":"ELITEBOOK 630 G9"}]
[{"$f":"\"CPU/Speed: \"","v":"CPU/Speed: "},{"$f":"VLOOKUP(E670,INVENTORYDATA,4,FALSE)&\" / \"&VLOOKUP(E670,INVENTORYDATA,5,FALSE)&\"GHz\"","v":"I5-1245U / 3.9GHz"},null,{"$f":"\"Memory: \"","v":"Memory: "},{"$f":"VLOOKUP(E670,INVENTORYDATA,6,FALSE)","v":"16G"},null,{"$f":"\"CPU/Speed: \"","v":"CPU/Speed: "},{"$f":"VLOOKUP(K670,INVENTORYDATA,4,FALSE)&\" / \"&VLOOKUP(K670,INVENTORYDATA,5,FALSE)&\"GHz\"","v":"I5-1245U / 3.9GHz"},null,{"$f":"\"Memory: \"","v":"Memory: "},{"$f":"VLOOKUP(K670,INVENTORYDATA,6,FALSE)","v":"16G"}]
[]
["Key Function",null,"Pass","Fail ","Comments",null,"Key Function",null,"Pass","Fail ","Comments"]
["Hard Drive Removed",null,{"$f":"IF(ISBLANK(VLOOKUP(E670,INVENTORYDATA,13,FALSE)),\"X\",\"\")","v":""},null,{"$f":"IF(ISBLANK(VLOOKUP(E670,INVENTORYDATA,13,FALSE)),\"\",VLOOKUP(E670,INVENTORYDATA,13,FALSE))","v":"512G"},null,"Hard Drive Removed",null,{"$f":"IF(ISBLANK(VLOOKUP(K670,INVENTORYDATA,13,FALSE)),\"X\",\"\")","v":""},null,{"$f":"IF(ISBLANK(VLOOKUP(K670,INVENTORYDATA,13,FALSE)),\"\",VLOOKUP(K670,INVENTORYDATA,13,FALSE))","v":"512G"}]
["Install Memory",null,"X",{"$nulls":3},"Install Memory",null,"X"]
["Power ON",null,"X",{"$nulls":3},"Power ON",null,"X"]
["Record BIOS info",null,"X",{"$nulls":3},"Record BIOS info",null,"X"]
["Check Optical Drive",null,{"$f":"IF((VLOOKUP(E670,INVENTORYDATA,7,FALSE))=\"YES\",\"X\",\"\")","v":""},{"$f":"IF((VLOOKUP(E670,INVENTORYDATA,7,FALSE))=\"NO\",\"X\",\"\")","v":"X"},null,null,"Check Optical Drive",null,{"$f":"IF((VLOOKUP(K670,INVENTORYDATA,7,FALSE))=\"YES\",\"X\",\"\")","v":""},{"$f":"IF((VLOOKUP(K670,INVENTORYDATA,7,FALSE))=\"NO\",\"X\",\"\")","v":"X"}]
["Power Off",null,"X",{"$nulls":3},"Power Off",null,"X"]
["HDD Serial No.",null,{"$f":"IF(ISBLANK(VLOOKUP(E670,INVENTORYDATA,12,FALSE)),\"\",VLOOKUP(E670,INVENTORYDATA,12,FALSE))","v":"sn9AN79241360AU14"},{"$nulls":3},"HDD Serial No.",null,{"$f":"IF(ISBLANK(VLOOKUP(K670,INVENTORYDATA,12,FALSE)),\"\",VLOOKUP(K670,INVENTORYDATA,12,FALSE))","v":"sn9AN86841150B52L"}]
[]
["Tested for key functions,R2/Ready for Resale",{"$nulls":5},"Tested for key functions,R2/Ready for Resale"]
["BIOS Lock","Caddy","Optical","WebCam","Battery",null,"BIOS Lock","Caddy","Optical","WebCam","Battery"]
[null,null,{"$f":"VLOOKUP(E670,INVENTORY!$A$2:$N$144,7,FALSE)","v":"NO"},{"$f":"VLOOKUP(E670,INVENTORY!$A$2:$N$144,8,FALSE)","v":"YES"},{"$f":"VLOOKUP(E670,INVENTORY!$A$2:$N$144,9,FALSE)","v":"YES"},{"$nulls":3},{"$f":"VLOOKUP(K670,INVENTORY!$A$2:$N$144,7,FALSE)","v":"NO"},{"$f":"VLOOKUP(K670,INVENTORY!$A$2:$N$144,8,FALSE)","v":"YES"},{"$f":"VLOOKUP(K670,INVENTORY!$A$2:$N$144,9,FALSE)","v":"YES"}]
[]
["CPU Cosmetics Defects:",null,{"$f":"\"Function Code: \"&VLOOKUP(E670,INVENTORY!$A$2:$Q$144,14,FALSE)","v":"Function Code: F3"},{"$nulls":3},"CPU Cosmetics Defects:",null,{"$f":"\"Function Code: \"&VLOOKUP(K670,INVENTORY!$A$2:$Q$144,14,FALSE)","v":"Function Code: F3"}]
[]
[null,null,{"$f":"\"Cosmetic Code: \"&VLOOKUP(E670,INVENTORY!$A$2:$Q$144,15,FALSE)","v":"Cosmetic Code: C5"},{"$nulls":5},{"$f":"\"Cosmetic Code: \"&VLOOKUP(K670,INVENTORY!$A$2:$Q$144,15,FALSE)","v":"Cosmetic Code: C5"}]
[]
["Casing","Plugs/Ports",{"$nulls":4},"Casing","Plugs/Ports"]
["Pass","Pass",{"$nulls":4},"Pass","Pass"]
["Fail","Fail",null,"TRRC#:L.T.R.",null,null,"Fail","Fail",null,"TRRC#:L.T.R."]
[]
["LAPTOP TESTING RECORD",{"$nulls":5},"LAPTOP TESTING RECORD"]
[]
[{"$nulls":3},"ITEM #",{"$f":"E670+2","v":49},{"$nulls":4},"ITEM #",{"$f":"K670+2","v":50}]
["Tester: ","RR","Date:",{"$f":"NOW()","v":"2026-01-06T11:13:00.960"},null,null,"Tester: ","RR","Date:",{"$f":"NOW()","v":"2026-01-06T11:13:00.960"}]
["Type: ","LAPTOP","SN:",{"$f":"VLOOKUP(E699,INVENTORYDATA,10,FALSE)","v":"2TK333027R"},null,null,"Type: ","LAPTOP","SN:",{"$f":"VLOOKUP(K699,INVENTORYDATA,10,FALSE)","v":"2TK333028W"}]
[{"$f":"\"Make: \"","v":"Make: "},{"$f":"VLOOKUP(E699,INVENTORYDATA,2,FALSE)","v":"HP"},{"$f":"\"Model: \"","v":"Model: "},{"$f":"VLOOKUP(E699,INVENTORYDATA,3,FALSE)","v":"ELITEBOOK 630 G9"},null,null,{"$f":"\"Make: \"","v":"Make: "},{"$f":"VLOOKUP(K699,INVENTORYDATA,2,FALSE)","v":"HP"},{"$f":"\"Model: \"","v":"Model: "},{"$f":"VLOOKUP(K699,INVENTORYDATA,3,FALSE)","v":"ELITEBOOK 630 G9"}]
[{"$f":"\"CPU/Speed: \"","v":"CPU/Speed: "},{"$f":"VLOOKUP(E699,INVENTORYDATA,4,FALSE)&\" / \"&VLOOKUP(E699,INVENTORYDATA,5,FALSE)&\"GHz\"","v":"I5-1245U / 3.9GHz"},null,{"$f":"\"Memory: \"","v":"Memory: "},{"$f":"VLOOKUP(E699,INVENTORYDATA,6,FALSE)","v":"16G"},null,{"$f":"\"CPU/Speed: \"","v":"CPU/Speed: "},{"$f":"VLOOKUP(K699,INVENTORYDATA,4,FALSE)&\" / \"&VLOOKUP(K699,INVENTORYDATA,5,FALSE)&\"GHz\"","v":"I5-1245U / 3.9GHz"},null,{"$f":"\"Memory: \"","v":"Memory: "},{"$f":"VLOOKUP(K699,INVENTORYDATA,6,FALSE)","v":"16G"}]
[]
["Key Function",null,"Pass","Fail ","Comments",null,"Key Function",null,"Pass","Fail ","Comments"]
["Hard Drive Removed",null,{"$f":"IF(ISBLANK(VLOOKUP(E699,INVENTORYDATA,13,FALSE)),\"X\",\"\")","v":""},null,{"$f":"IF(ISBLANK(VLOOKUP(E699,INVENTORYDATA,13,FALSE)),\"\",VLOOKUP(E699,INVENTORYDATA,13,FALSE))","v":"512G"},null,"Hard Drive Removed",null,{"$f":"IF(ISBLANK(VLOOKUP(K699,INVENTORYDATA,13,FALSE)),\"X\",\"\")","v":""},null,{"$f":"IF(ISBLANK(VLOOKUP(K699,INVENTORYDATA,13,FALSE)),\"\",VLOOKUP(K699,INVENTORYDATA,13,FALSE))","v":"512G"}]
["Install Memory",null,"X",{"$nulls":3},"Install Memory",null,"X"]
["Power ON",null,"X",{"$nulls":3},"Power ON",null,"X"]
["Record BIOS info",null,"X",{"$nulls":3},"Record BIOS info",null,"X"]
["Check Optical Drive",null,{"$f":"IF((VLOOKUP(E699,INVENTORYDATA,7,FALSE))=\"YES\",\"X\",\"\")","v":""},{"$f":"IF((VLOOKUP(E699,INVENTORYDATA,7,FALSE))=\"NO\",\"X\",\"\")","v":"X"},null,null,"Check Optical Drive",null,{"$f":"IF((VLOOKUP(K699,INVENTORYDATA,7,FALSE))=\"YES\",\"X\",\"\")","v":""},{"$f":"IF((VLOOKUP(K699,INVENTORYDATA,7,FALSE))=\"NO\",\"X\",\"\")","v":"X"}]
["Power Off",null,"X",{"$nulls":3},"Power Off",null,"X"]
["HDD Serial No.",null,{"$f":"IF(ISBLANK(VLOOKUP(E699,INVENTORYDATA,12,FALSE)),\"\",VLOOKUP(E699,INVENTORYDATA,12,FALSE))","v":"tw07YGY09DH0002J01K5"},{"$nulls":3},"HDD Serial No.",null,{"$f":"IF(ISBLANK(VLOOKUP(K699,INVENTORYDATA,12,FALSE)),\"\",VLOOKUP(K699,INVENTORYDATA,12,FALSE))","v":"20153B801936"}]
[]
["Tested for key functions,R2/Ready for Resale",{"$nulls":5},"Tested for key functions,R2/Ready for Resale"]
["BIOS Lock","Caddy","Optical","WebCam","Battery",null,"BIOS Lock","Caddy","Optical","WebCam","Battery"]
[null,null,{"$f":"VLOOKUP(E699,INVENTORY!$A$2:$N$144,7,FALSE)","v":"NO"},{"$f":"VLOOKUP(E699,INVENTORY!$A$2:$N$144,8,FALSE)","v":"YES"},{"$f":"VLOOKUP(E699,INVENTORY!$A$2:$N$144,9,FALSE)","v":"YES"},{"$nulls":3},{"$f":"VLOOKUP(K699,INVENTORY!$A$2:$N$144,7,FALSE)","v":"NO"},{"$f":"VLOOKUP(K699,INVENTORY!$A$2:$N$144,8,FALSE)","v":"YES"},{"$f":"VLOOKUP(K699,INVENTORY!$A$2:$N$144,9,FALSE)","v":"YES"}]
[]
["CPU Cosmetics Defects:",null,{"$f":"\"Function Code: \"&VLOOKUP(E699,INVENTORY!$A$2:$Q$144,14,FALSE)","v":"Function Code: F3"},{"$nulls":3},"CPU Cosmetics Defects:",null,{"$f":"\"Function Code: \"&VLOOKUP(K699,INVENTORY!$A$2:$Q$144,14,FALSE)","v":"Function Code: F3"}]
[]
[null,null,{"$f":"\"Cosmetic Code: \"&VLOOKUP(E699,INVENTORY!$A$2:$Q$144,15,FALSE)","v":"Cosmetic Code: C5"},{"$nulls":5},{"$f":"\"Cosmetic Code: \"&VLOOKUP(K699,INVENTORY!$A$2:$Q$144,15,FALSE)","v":"Cosmetic Code: C5"}]
[]
["Casing","Plugs/Ports",{"$nulls":4},"Casing","Plugs/Ports"]
["Pass","Pass",{"$nulls":4},"Pass","Pass"]
["Fail","Fail",null,"TRRC#:L.T.R.",null,null,"Fail","Fail",null,"TRRC#:L.T.R."]
[]
["LAPTOP TESTING RECORD",{"$nulls":5},"LAPTOP TESTING RECORD"]
[]
[{"$nulls":3},"ITEM #",{"$f":"E699+2","v":51},{"$nulls":4},"ITEM #",{"$f":"K699+2","v":52}]
["Tester: ","RR","Date:",{"$f":"NOW()","v":"2026-01-06T11:13:00.960"},null,null,"Tester: ","RR","Date:",{"$f":"NOW()","v":"2026-01-06T11:13:00.960"}]
["Type: ","LAPTOP","SN:",{"$f":"VLOOKUP(E728,INVENTORYDATA,10,FALSE)","v":"2TK3330291"},null,null,"Type: ","LAPTOP","SN:",{"$f":"VLOOKUP(K728,INVENTORYDATA,10,FALSE)","v":{"$error":"#N/A"}}]
[{"$f":"\"Make: \"","v":"Make: "},{"$f":"VLOOKUP(E728,INVENTORYDATA,2,FALSE)","v":"HP"},{"$f":"\"Model: \"","v":"Model: "},{"$f":"VLOOKUP(E728,INVENTORYDATA,3,FALSE)","v":"ELITEBOOK 630 G9"},null,null,{"$f":"\"Make: \"","v":"Make: "},{"$f":"VLOOKUP(K728,INVENTORYDATA,2,FALSE)","v":{"$error":"#N/A"}},{"$f":"\"Model: \"","v":"Model: "},{"$f":"VLOOKUP(K728,INVENTORYDATA,3,FALSE)","v":{"$error":"#N/A"}}]
[{"$f":"\"CPU/Speed: \"","v":"CPU/Speed: "},{"$f":"VLOOKUP(E728,INVENTORYDATA,4,FALSE)&\" / \"&VLOOKUP(E728,INVENTORYDATA,5,FALSE)&\"GHz\"","v":"I5-1245U / 3.9GHz"},null,{"$f":"\"Memory: \"","v":"Memory: "},{"$f":"VLOOKUP(E728,INVENTORYDATA,6,FALSE)","v":"16G"},null,{"$f":"\"CPU/Speed: \"","v":"CPU/Speed: "},{"$f":"VLOOKUP(K728,INVENTORYDATA,4,FALSE)&\" / \"&VLOOKUP(K728,INVENTORYDATA,5,FALSE)&\"GHz\"","v":{"$error":"#N/A"}},null,{"$f":"\"Memory: \"","v":"Memory: "},{"$f":"VLOOKUP(K728,INVENTORYDATA,6,FALSE)","v":{"$error":"#N/A"}}]
[]
["Key Function",null,"Pass","Fail ","Comments",null,"Key Function",null,"Pass","Fail ","Comments"]
["Hard Drive Removed",null,{"$f":"IF(ISBLANK(VLOOKUP(E728,INVENTORYDATA,13,FALSE)),\"X\",\"\")","v":""},null,{"$f":"IF(ISBLANK(VLOOKUP(E728,INVENTORYDATA,13,FALSE)),\"\",VLOOKUP(E728,INVENTORYDATA,13,FALSE))","v":"512G"},null,"Hard Drive Removed",null,{"$f":"IF(ISBLANK(VLOOKUP(K728,INVENTORYDATA,13,FALSE)),\"X\",\"\")","v":""},null,{"$f":"IF(ISBLANK(VLOOKUP(K728,INVENTORYDATA,13,FALSE)),\"\",VLOOKUP(K728,INVENTORYDATA,13,FALSE))","v":{"$error":"#N/A"}}]
["Install Memory",null,"X",{"$nulls":3},"Install Memory",null,"X"]
["Power ON",null,"X",{"$nulls":3},"Power ON",null,"X"]
["Record BIOS info",null,"X",{"$nulls":3},"Record BIOS info",null,"X"]
["Check Optical Drive",null,{"$f":"IF((VLOOKUP(E728,INVENTORYDATA,7,FALSE))=\"YES\",\"X\",\"\")","v":""},{"$f":"IF((VLOOKUP(E728,INVENTORYDATA,7,FALSE))=\"NO\",\"X\",\"\")","v":"X"},null,null,"Check Optical Drive",null,{"$f":"IF((VLOOKUP(K728,INVENTORYDATA,7,FALSE))=\"YES\",\"X\",\"\")","v":{"$error":"#N/A"}},{"$f":"IF((VLOOKUP(K728,INVENTORYDATA,7,FALSE))=\"NO\",\"X\",\"\")","v":{"$error":"#N/A"}}]
["Power Off",null,"X",{"$nulls":3},"Power Off",null,"X"]
["HDD Serial No.",null,{"$f":"IF(ISBLANK(VLOOKUP(E728,INVENTORYDATA,12,FALSE)),\"\",VLOOKUP(E728,INVENTORYDATA,12,FALSE))","v":"50APC6B9QTML"},{"$nulls":3},"HDD Serial No.",null,{"$f":"IF(ISBLANK(VLOOKUP(K728,INVENTORYDATA,12,FALSE)),\"\",VLOOKUP(K728,INVENTORYDATA,12,FALSE))","v":{"$error":"#N/A"}}]
[]
["Tested for key functions,R2/Ready for Resale",{"$nulls":5},"Tested for key functions,R2/Ready for Resale"]
["BIOS Lock","Caddy","Optical","WebCam","Battery",null,"BIOS Lock","Caddy","Optical","WebCam","Battery"]
[null,null,{"$f":"VLOOKUP(E728,INVENTORY!$A$2:$N$144,7,FALSE)","v":"NO"},{"$f":"VLOOKUP(E728,INVENTORY!$A$2:$N$144,8,FALSE)","v":"YES"},{"$f":"VLOOKUP(E728,INVENTORY!$A$2:$N$144,9,FALSE)","v":"YES"},{"$nulls":3},{"$f":"VLOOKUP(K728,INVENTORY!$A$2:$N$144,7,FALSE)","v":{"$error":"#N/A"}},{"$f":"VLOOKUP(K728,INVENTORY!$A$2:$N$144,8,FALSE)","v":{"$error":"#N/A"}},{"$f":"VLOOKUP(K728,INVENTORY!$A$2:$N$144,9,FALSE)","v":{"$error":"#N/A"}}]
[]
["CPU Cosmetics Defects:",null,{"$f":"\"Function Code: \"&VLOOKUP(E728,INVENTORY!$A$2:$Q$144,14,FALSE)","v":"Function Code: F3"},{"$nulls":3},"CPU Cosmetics Defects:",null,{"$f":"\"Function Code: \"&VLOOKUP(K728,INVENTORY!$A$2:$Q$144,14,FALSE)","v":{"$error":"#N/A"}}]
[]
[null,null,{"$f":"\"Cosmetic Code: \"&VLOOKUP(E728,INVENTORY!$A$2:$Q$144,15,FALSE)","v":"Cosmetic Code: C5"},{"$nulls":5},{"$f":"\"Cosmetic Code: \"&VLOOKUP(K728,INVENTORY!$A$2:$Q$144,15,FALSE)","v":{"$error":"#N/A"}}]
[]
["Casing","Plugs/Ports",{"$nulls":4},"Casing","Plugs/Ports"]
["Pass","Pass",{"$nulls":4},"Pass","Pass"]
["Fail","Fail",null,"TRRC#:L.T.R.",null,null,"Fail","Fail",null,"TRRC#:L.T.R."]
[]
["LAPTOP TESTING RECORD",{"$nulls":5},"LAPTOP TESTING RECORD"]
[]
[{"$nulls":3},"ITEM #",{"$f":"E728+2","v":53},{"$nulls":4},"ITEM #",{"$f":"K728+2","v":54}]
["Tester: ","RR","Date:",{"$f":"NOW()","v":"2026-01-06T11:13:00.960"},null,null,"Tester: ","RR","Date:",{"$f":"NOW()","v":"2026-01-06T11:13:00.960"}]
["Type: ","LAPTOP","SN:",{"$f":"VLOOKUP(E757,INVENTORYDATA,10,FALSE)","v":{"$error":"#N/A"}},null,null,"Type: ","LAPTOP","SN:",{"$f":"VLOOKUP(K757,INVENTORYDATA,10,FALSE)","v":{"$error":"#N/A"}}]
[{"$f":"\"Make: \"","v":"Make: "},{"$f":"VLOOKUP(E757,INVENTORYDATA,2,FALSE)","v":{"$error":"#N/A"}},{"$f":"\"Model: \"","v":"Model: "},{"$f":"VLOOKUP(E757,INVENTORYDATA,3,FALSE)","v":{"$error":"#N/A"}},null,null,{"$f":"\"Make: \"","v":"Make: "},{"$f":"VLOOKUP(K757,INVENTORYDATA,2,FALSE)","v":{"$error":"#N/A"}},{"$f":"\"Model: \"","v":"Model: "},{"$f":"VLOOKUP(K757,INVENTORYDATA,3,FALSE)","v":{"$error":"#N/A"}}]
[{"$f":"\"CPU/Speed: \"","v":"CPU/Speed: "},{"$f":"VLOOKUP(E757,INVENTORYDATA,4,FALSE)&\" / \"&VLOOKUP(E757,INVENTORYDATA,5,FALSE)&\"GHz\"","v":{"$error":"#N/A"}},null,{"$f":"\"Memory: \"","v":"Memory: "},{"$f":"VLOOKUP(E757,INVENTORYDATA,6,FALSE)","v":{"$error":"#N/A"}},null,{"$f":"\"CPU/Speed: \"","v":"CPU/Speed: "},{"$f":"VLOOKUP(K757,INVENTORYDATA,4,FALSE)&\" / \"&VLOOKUP(K757,INVENTORYDATA,5,FALSE)&\"GHz\"","v":{"$error":"#N/A"}},null,{"$f":"\"Memory: \"","v":"Memory: "},{"$f":"VLOOKUP(K757,INVENTORYDATA,6,FALSE)","v":{"$error":"#N/A"}}]
[]
["Key Function",null,"Pass","Fail ","Comments",null,"Key Function",null,"Pass","Fail ","Comments"]
["Hard Drive Removed",null,{"$f":"IF(ISBLANK(VLOOKUP(E757,INVENTORYDATA,13,FALSE)),\"X\",\"\")","v":""},null,{"$f":"IF(ISBLANK(VLOOKUP(E757,INVENTORYDATA,13,FALSE)),\"\",VLOOKUP(E757,INVENTORYDATA,13,FALSE))","v":{"$error":"#N/A"}},null,"Hard Drive Removed",null,{"$f":"IF(ISBLANK(VLOOKUP(K757,INVENTORYDATA,13,FALSE)),\"X\",\"\")","v":""},null,{"$f":"IF(ISBLANK(VLOOKUP(K757,INVENTORYDATA,13,FALSE)),\"\",VLOOKUP(K757,INVENTORYDATA,13,FALSE))","v":{"$error":"#N/A"}}]
["Install Memory",null,"X",{"$nulls":3},"Install Memory",null,"X"]
["Power ON",null,"X",{"$nulls":3},"Power ON",null,"X"]
["Record BIOS info",null,"X",{"$nulls":3},"Record BIOS info",null,"X"]
["Check Optical Drive",null,{"$f":"IF((VLOOKUP(E757,INVENTORYDATA,7,FALSE))=\"YES\",\"X\",\"\")","v":{"$error":"#N/A"}},{"$f":"IF((VLOOKUP(E757,INVENTORYDATA,7,FALSE))=\"NO\",\"X\",\"\")","v":{"$error":"#N/A"}},null,null,"Check Optical Drive",null,{"$f":"IF((VLOOKUP(K757,INVENTORYDATA,7,FALSE))=\"YES\",\"X\",\"\")","v":{"$error":"#N/A"}},{"$f":"IF((VLOOKUP(K757,INVENTORYDATA,7,FALSE))=\"NO\",\"X\",\"\")","v":{"$error":"#N/A"}}]
["Power Off",null,"X",{"$nulls":3},"Power Off",null,"X"]
["HDD Serial No.",null,{"$f":"IF(ISBLANK(VLOOKUP(E757,INVENTORYDATA,12,FALSE)),\"\",VLOOKUP(E757,INVENTORYDATA,12,FALSE))","v":{"$error":"#N/A"}},{"$nulls":3},"HDD Serial No.",null,{"$f":"IF(ISBLANK(VLOOKUP(K757,INVENTORYDATA,12,FALSE)),\"\",VLOOKUP(K757,INVENTORYDATA,12,FALSE))","v":{"$error":"#N/A"}}]
[]
["Tested for key functions,R2/Ready for Resale",{"$nulls":5},"Tested for key functions,R2/Ready for Resale"]
["BIOS Lock","Caddy","Optical","WebCam","Battery",null,"BIOS Lock","Caddy","Optical","WebCam","Battery"]
[null,null,{"$f":"VLOOKUP(E757,INVENTORY!$A$2:$N$144,7,FALSE)","v":{"$error":"#N/A"}},{"$f":"VLOOKUP(E757,INVENTORY!$A$2:$N$144,8,FALSE)","v":{"$error":"#N/A"}},{"$f":"VLOOKUP(E757,INVENTORY!$A$2:$N$144,9,FALSE)","v":{"$error":"#N/A"}},{"$nulls":3},{"$f":"VLOOKUP(K757,INVENTORY!$A$2:$N$144,7,FALSE)","v":{"$error":"#N/A"}},{"$f":"VLOOKUP(K757,INVENTORY!$A$2:$N$144,8,FALSE)","v":{"$error":"#N/A"}},{"$f":"VLOOKUP(K757,INVENTORY!$A$2:$N$144,9,FALSE)","v":{"$error":"#N/A"}}]
[]
["CPU Cosmetics Defects:",null,{"$f":"\"Function Code: \"&VLOOKUP(E757,INVENTORY!$A$2:$Q$144,14,FALSE)","v":{"$error":"#N/A"}},{"$nulls":3},"CPU Cosmetics Defects:",null,{"$f":"\"Function Code: \"&VLOOKUP(K757,INVENTORY!$A$2:$Q$144,14,FALSE)","v":{"$error":"#N/A"}}]
[]
[null,null,{"$f":"\"Cosmetic Code: \"&VLOOKUP(E757,INVENTORY!$A$2:$Q$144,15,FALSE)","v":{"$error":"#N/A"}},{"$nulls":5},{"$f":"\"Cosmetic Code: \"&VLOOKUP(K757,INVENTORY!$A$2:$Q$144,15,FALSE)","v":{"$error":"#N/A"}}]
[]
["Casing","Plugs/Ports",{"$nulls":4},"Casing","Plugs/Ports"]
["Pass","Pass",{"$nulls":4},"Pass","Pass"]
["Fail","Fail",null,"TRRC#:L.T.R.",null,null,"Fail","Fail",null,"TRRC#:L.T.R."]
[]
["LAPTOP TESTING RECORD",{"$nulls":5},"LAPTOP TESTING RECORD"]
[]
[{"$nulls":3},"ITEM #",{"$f":"E757+2","v":55},{"$nulls":4},"ITEM #",{"$f":"K757+2","v":56}]
["Tester: ","RR","Date:",{"$f":"NOW()","v":"2026-01-06T11:13:00.960"},null,null,"Tester: ","RR","Date:",{"$f":"NOW()","v":"2026-01-06T11:13:00.960"}]
["Type: ","LAPTOP","SN:",{"$f":"VLOOKUP(E786,INVENTORYDATA,10,FALSE)","v":{"$error":"#N/A"}},null,null,"Type: ","LAPTOP","SN:",{"$f":"VLOOKUP(K786,INVENTORYDATA,10,FALSE)","v":{"$error":"#N/A"}}]
[{"$f":"\"Make: \"","v":"Make: "},{"$f":"VLOOKUP(E786,INVENTORYDATA,2,FALSE)","v":{"$error":"#N/A"}},{"$f":"\"Model: \"","v":"Model: "},{"$f":"VLOOKUP(E786,INVENTORYDATA,3,FALSE)","v":{"$error":"#N/A"}},null,null,{"$f":"\"Make: \"","v":"Make: "},{"$f":"VLOOKUP(K786,INVENTORYDATA,2,FALSE)","v":{"$error":"#N/A"}},{"$f":"\"Model: \"","v":"Model: "},{"$f":"VLOOKUP(K786,INVENTORYDATA,3,FALSE)","v":{"$error":"#N/A"}}]
[{"$f":"\"CPU/Speed: \"","v":"CPU/Speed: "},{"$f":"VLOOKUP(E786,INVENTORYDATA,4,FALSE)&\" / \"&VLOOKUP(E786,INVENTORYDATA,5,FALSE)&\"GHz\"","v":{"$error":"#N/A"}},null,{"$f":"\"Memory: \"","v":"Memory: "},{"$f":"VLOOKUP(E786,INVENTORYDATA,6,FALSE)","v":{"$error":"#N/A"}},null,{"$f":"\"CPU/Speed: \"","v":"CPU/Speed: "},{"$f":"VLOOKUP(K786,INVENTORYDATA,4,FALSE)&\" / \"&VLOOKUP(K786,INVENTORYDATA,5,FALSE)&\"GHz\"","v":{"$error":"#N/A"}},null,{"$f":"\"Memory: \"","v":"Memory: "},{"$f":"VLOOKUP(K786,INVENTORYDATA,6,FALSE)","v":{"$error":"#N/A"}}]
[]
["Key Function",null,"Pass","Fail ","Comments",null,"Key Function",null,"Pass","Fail ","Comments"]
["Hard Drive Removed",null,{"$f":"IF(ISBLANK(VLOOKUP(E786,INVENTORYDATA,13,FALSE)),\"X\",\"\")","v":""},null,{"$f":"IF(ISBLANK(VLOOKUP(E786,INVENTORYDATA,13,FALSE)),\"\",VLOOKUP(E786,INVENTORYDATA,13,FALSE))","v":{"$error":"#N/A"}},null,"Hard Drive Removed",null,{"$f":"IF(ISBLANK(VLOOKUP(K786,INVENTORYDATA,13,FALSE)),\"X\",\"\")","v":""},null,{"$f":"IF(ISBLANK(VLOOKUP(K786,INVENTORYDATA,13,FALSE)),\"\",VLOOKUP(K786,INVENTORYDATA,13,FALSE))","v":{"$error":"#N/A"}}]
["Install Memory",null,"X",{"$nulls":3},"Install Memory",null,"X"]
["Power ON",null,"X",{"$nulls":3},"Power ON",null,"X"]
["Record BIOS info",null,"X",{"$nulls":3},"Record BIOS info",null,"X"]
["Check Optical Drive",null,{"$f":"IF((VLOOKUP(E786,INVENTORYDATA,7,FALSE))=\"YES\",\"X\",\"\")","v":{"$error":"#N/A"}},{"$f":"IF((VLOOKUP(E786,INVENTORYDATA,7,FALSE))=\"NO\",\"X\",\"\")","v":{"$error":"#N/A"}},null,null,"Check Optical Drive",null,{"$f":"IF((VLOOKUP(K786,INVENTORYDATA,7,FALSE))=\"YES\",\"X\",\"\")","v":{"$error":"#N/A"}},{"$f":"IF((VLOOKUP(K786,INVENTORYDATA,7,FALSE))=\"NO\",\"X\",\"\")","v":{"$error":"#N/A"}}]
["Power Off",null,"X",{"$nulls":3},"Power Off",null,"X"]
["HDD Serial No.",null,{"$f":"IF(ISBLANK(VLOOKUP(E786,INVENTORYDATA,12,FALSE)),\"\",VLOOKUP(E786,INVENTORYDATA,12,FALSE))","v":{"$error":"#N/A"}},{"$nulls":3},"HDD Serial No.",null,{"$f":"IF(ISBLANK(VLOOKUP(K786,INVENTORYDATA,12,FALSE)),\"\",VLOOKUP(K786,INVENTORYDATA,12,FALSE))","v":{"$error":"#N/A"}}]
[]
["Tested for key functions,R2/Ready for Resale",{"$nulls":5},"Tested for key functions,R2/Ready for Resale"]
["BIOS Lock","Caddy","Optical","WebCam","Battery",null,"BIOS Lock","Caddy","Optical","WebCam","Battery"]
[null,null,{"$f":"VLOOKUP(E786,INVENTORY!$A$2:$N$144,7,FALSE)","v":{"$error":"#N/A"}},{"$f":"VLOOKUP(E786,INVENTORY!$A$2:$N$144,8,FALSE)","v":{"$error":"#N/A"}},{"$f":"VLOOKUP(E786,INVENTORY!$A$2:$N$144,9,FALSE)","v":{"$error":"#N/A"}},{"$nulls":3},{"$f":"VLOOKUP(K786,INVENTORY!$A$2:$N$144,7,FALSE)","v":{"$error":"#N/A"}},{"$f":"VLOOKUP(K786,INVENTORY!$A$2:$N$144,8,FALSE)","v":{"$error":"#N/A"}},{"$f":"VLOOKUP(K786,INVENTORY!$A$2:$N$144,9,FALSE)","v":{"$error":"#N/A"}}]
[]
["CPU Cosmetics Defects:",null,{"$f":"\"Function Code: \"&VLOOKUP(E786,INVENTORY!$A$2:$Q$144,14,FALSE)","v":{"$error":"#N/A"}},{"$nulls":3},"CPU Cosmetics Defects:",null,{"$f":"\"Function Code: \"&VLOOKUP(K786,INVENTORY!$A$2:$Q$144,14,FALSE)","v":{"$error":"#N/A"}}]
[]
[null,null,{"$f":"\"Cosmetic Code: \"&VLOOKUP(E786,INVENTORY!$A$2:$Q$144,15,FALSE)","v":{"$error":"#N/A"}},{"$nulls":5},{"$f":"\"Cosmetic Code: \"&VLOOKUP(K786,INVENTORY!$A$2:$Q$144,15,FALSE)","v":{"$error":"#N/A"}}]
[]
["Casing","Plugs/Ports",{"$nulls":4},"Casing","Plugs/Ports"]
["Pass","Pass",{"$nulls":4},"Pass","Pass"]
["Fail","Fail",null,"TRRC#:L.T.R.",null,null,"Fail","Fail",null,"TRRC#:L.T.R."]
[]
["LAPTOP TESTING RECORD",{"$nulls":5},"LAPTOP TESTING RECORD"]
[]
[{"$nulls":3},"ITEM #",{"$f":"E786+2","v":57},{"$nulls":4},"ITEM #",{"$f":"K786+2","v":58}]
["Tester: ","RR","Date:",{"$f":"NOW()","v":"2026-01-06T11:13:00.960"},null,null,"Tester: ","RR","Date:",{"$f":"NOW()","v":"2026-01-06T11:13:00.960"}]
["Type: ","LAPTOP","SN:",{"$f":"VLOOKUP(E815,INVENTORYDATA,10,FALSE)","v":{"$error":"#N/A"}},null,null,"Type: ","LAPTOP","SN:",{"$f":"VLOOKUP(K815,INVENTORYDATA,10,FALSE)","v":{"$error":"#N/A"}}]
[{"$f":"\"Make: \"","v":"Make: "},{"$f":"VLOOKUP(E815,INVENTORYDATA,2,FALSE)","v":{"$error":"#N/A"}},{"$f":"\"Model: \"","v":"Model: "},{"$f":"VLOOKUP(E815,INVENTORYDATA,3,FALSE)","v":{"$error":"#N/A"}},null,null,{"$f":"\"Make: \"","v":"Make: "},{"$f":"VLOOKUP(K815,INVENTORYDATA,2,FALSE)","v":{"$error":"#N/A"}},{"$f":"\"Model: \"","v":"Model: "},{"$f":"VLOOKUP(K815,INVENTORYDATA,3,FALSE)","v":{"$error":"#N/A"}}]
[{"$f":"\"CPU/Speed: \"","v":"CPU/Speed: "},{"$f":"VLOOKUP(E815,INVENTORYDATA,4,FALSE)&\" / \"&VLOOKUP(E815,INVENTORYDATA,5,FALSE)&\"GHz\"","v":{"$error":"#N/A"}},null,{"$f":"\"Memory: \"","v":"Memory: "},{"$f":"VLOOKUP(E815,INVENTORYDATA,6,FALSE)","v":{"$error":"#N/A"}},null,{"$f":"\"CPU/Speed: \"","v":"CPU/Speed: "},{"$f":"VLOOKUP(K815,INVENTORYDATA,4,FALSE)&\" / \"&VLOOKUP(K815,INVENTORYDATA,5,FALSE)&\"GHz\"","v":{"$error":"#N/A"}},null,{"$f":"\"Memory: \"","v":"Memory: "},{"$f":"VLOOKUP(K815,INVENTORYDATA,6,FALSE)","v":{"$error":"#N/A"}}]
[]
["Key Function",null,"Pass","Fail ","Comments",null,"Key Function",null,"Pass","Fail ","Comments"]
["Hard Drive Removed",null,{"$f":"IF(ISBLANK(VLOOKUP(E815,INVENTORYDATA,13,FALSE)),\"X\",\"\")","v":""},null,{"$f":"IF(ISBLANK(VLOOKUP(E815,INVENTORYDATA,13,FALSE)),\"\",VLOOKUP(E815,INVENTORYDATA,13,FALSE))","v":{"$error":"#N/A"}},null,"Hard Drive Removed",null,{"$f":"IF(ISBLANK(VLOOKUP(K815,INVENTORYDATA,13,FALSE)),\"X\",\"\")","v":""},null,{"$f":"IF(ISBLANK(VLOOKUP(K815,INVENTORYDATA,13,FALSE)),\"\",VLOOKUP(K815,INVENTORYDATA,13,FALSE))","v":{"$error":"#N/A"}}]
["Install Memory",null,"X",{"$nulls":3},"Install Memory",null,"X"]
["Power ON",null,"X",{"$nulls":3},"Power ON",null,"X"]
["Record BIOS info",null,"X",{"$nulls":3},"Record BIOS info",null,"X"]
["Check Optical Drive",null,{"$f":"IF((VLOOKUP(E815,INVENTORYDATA,7,FALSE))=\"YES\",\"X\",\"\")","v":{"$error":"#N/A"}},{"$f":"IF((VLOOKUP(E815,INVENTORYDATA,7,FALSE))=\"NO\",\"X\",\"\")","v":{"$error":"#N/A"}},null,null,"Check Optical Drive",null,{"$f":"IF((VLOOKUP(K815,INVENTORYDATA,7,FALSE))=\"YES\",\"X\",\"\")","v":{"$error":"#N/A"}},{"$f":"IF((VLOOKUP(K815,INVENTORYDATA,7,FALSE))=\"NO\",\"X\",\"\")","v":{"$error":"#N/A"}}]
["Power Off",null,"X",{"$nulls":3},"Power Off",null,"X"]
["HDD Serial No.",null,{"$f":"IF(ISBLANK(VLOOKUP(E815,INVENTORYDATA,12,FALSE)),\"\",VLOOKUP(E815,INVENTORYDATA,12,FALSE))","v":{"$error":"#N/A"}},{"$nulls":3},"HDD Serial No.",null,{"$f":"IF(ISBLANK(VLOOKUP(K815,INVENTORYDATA,12,FALSE)),\"\",VLOOKUP(K815,INVENTORYDATA,12,FALSE))","v":{"$error":"#N/A"}}]
[]
["Tested for key functions,R2/Ready for Resale",{"$nulls":5},"Tested for key functions,R2/Ready for Resale"]
["BIOS Lock","Caddy","Optical","WebCam","Battery",null,"BIOS Lock","Caddy","Optical","WebCam","Battery"]
[null,null,{"$f":"VLOOKUP(E815,INVENTORY!$A$2:$N$144,7,FALSE)","v":{"$error":"#N/A"}},{"$f":"VLOOKUP(E815,INVENTORY!$A$2:$N$144,8,FALSE)","v":{"$error":"#N/A"}},{"$f":"VLOOKUP(E815,INVENTORY!$A$2:$N$144,9,FALSE)","v":{"$error":"#N/A"}},{"$nulls":3},{"$f":"VLOOKUP(K815,INVENTORY!$A$2:$N$144,7,FALSE)","v":{"$error":"#N/A"}},{"$f":"VLOOKUP(K815,INVENTORY!$A$2:$N$144,8,FALSE)","v":{"$error":"#N/A"}},{"$f":"VLOOKUP(K815,INVENTORY!$A$2:$N$144,9,FALSE)","v":{"$error":"#N/A"}}]
[]
["CPU Cosmetics Defects:",null,{"$f":"\"Function Code: \"&VLOOKUP(E815,INVENTORY!$A$2:$Q$144,14,FALSE)","v":{"$error":"#N/A"}},{"$nulls":3},"CPU Cosmetics Defects:",null,{"$f":"\"Function Code: \"&VLOOKUP(K815,INVENTORY!$A$2:$Q$144,14,FALSE)","v":{"$error":"#N/A"}}]
[]
[null,null,{"$f":"\"Cosmetic Code: \"&VLOOKUP(E815,INVENTORY!$A$2:$Q$144,15,FALSE)","v":{"$error":"#N/A"}},{"$nulls":5},{"$f":"\"Cosmetic Code: \"&VLOOKUP(K815,INVENTORY!$A$2:$Q$144,15,FALSE)","v":{"$error":"#N/A"}}]
[]
["Casing","Plugs/Ports",{"$nulls":4},"Casing","Plugs/Ports"]
["Pass","Pass",{"$nulls":4},"Pass","Pass"]
["Fail","Fail",null,"TRRC#:L.T.R.",null,null,"Fail","Fail",null,"TRRC#:L.T.R."]
[]
["LAPTOP TESTING RECORD",{"$nulls":5},"LAPTOP TESTING RECORD"]
[]
[{"$nulls":3},"ITEM #",{"$f":"E815+2","v":59},{"$nulls":4},"ITEM #",{"$f":"K815+2","v":60}]
["Tester: ","RR","Date:",{"$f":"NOW()","v":"2026-01-06T11:13:00.960"},null,null,"Tester: ","RR","Date:",{"$f":"NOW()","v":"2026-01-06T11:13:00.960"}]
["Type: ","LAPTOP","SN:",{"$f":"VLOOKUP(E844,INVENTORYDATA,10,FALSE)","v":{"$error":"#N/A"}},null,null,"Type: ","LAPTOP","SN:",{"$f":"VLOOKUP(K844,INVENTORYDATA,10,FALSE)","v":{"$error":"#N/A"}}]
[{"$f":"\"Make: \"","v":"Make: "},{"$f":"VLOOKUP(E844,INVENTORYDATA,2,FALSE)","v":{"$error":"#N/A"}},{"$f":"\"Model: \"","v":"Model: "},{"$f":"VLOOKUP(E844,INVENTORYDATA,3,FALSE)","v":{"$error":"#N/A"}},null,null,{"$f":"\"Make: \"","v":"Make: "},{"$f":"VLOOKUP(K844,INVENTORYDATA,2,FALSE)","v":{"$error":"#N/A"}},{"$f":"\"Model: \"","v":"Model: "},{"$f":"VLOOKUP(K844,INVENTORYDATA,3,FALSE)","v":{"$error":"#N/A"}}]
[{"$f":"\"CPU/Speed: \"","v":"CPU/Speed: "},{"$f":"VLOOKUP(E844,INVENTORYDATA,4,FALSE)&\" / \"&VLOOKUP(E844,INVENTORYDATA,5,FALSE)&\"GHz\"","v":{"$error":"#N/A"}},null,{"$f":"\"Memory: \"","v":"Memory: "},{"$f":"VLOOKUP(E844,INVENTORYDATA,6,FALSE)","v":{"$error":"#N/A"}},null,{"$f":"\"CPU/Speed: \"","v":"CPU/Speed: "},{"$f":"VLOOKUP(K844,INVENTORYDATA,4,FALSE)&\" / \"&VLOOKUP(K844,INVENTORYDATA,5,FALSE)&\"GHz\"","v":{"$error":"#N/A"}},null,{"$f":"\"Memory: \"","v":"Memory: "},{"$f":"VLOOKUP(K844,INVENTORYDATA,6,FALSE)","v":{"$error":"#N/A"}}]
[]
["Key Function",null,"Pass","Fail ","Comments",null,"Key Function",null,"Pass","Fail ","Comments"]
["Hard Drive Removed",null,{"$f":"IF(ISBLANK(VLOOKUP(E844,INVENTORYDATA,13,FALSE)),\"X\",\"\")","v":""},null,{"$f":"IF(ISBLANK(VLOOKUP(E844,INVENTORYDATA,13,FALSE)),\"\",VLOOKUP(E844,INVENTORYDATA,13,FALSE))","v":{"$error":"#N/A"}},null,"Hard Drive Removed",null,{"$f":"IF(ISBLANK(VLOOKUP(K844,INVENTORYDATA,13,FALSE)),\"X\",\"\")","v":""},null,{"$f":"IF(ISBLANK(VLOOKUP(K844,INVENTORYDATA,13,FALSE)),\"\",VLOOKUP(K844,INVENTORYDATA,13,FALSE))","v":{"$error":"#N/A"}}]
["Install Memory",null,"X",{"$nulls":3},"Install Memory",null,"X"]
["Power ON",null,"X",{"$nulls":3},"Power ON",null,"X"]
["Record BIOS info",null,"X",{"$nulls":3},"Record BIOS info",null,"X"]
["Check Optical Drive",null,{"$f":"IF((VLOOKUP(E844,INVENTORYDATA,7,FALSE))=\"YES\",\"X\",\"\")","v":{"$error":"#N/A"}},{"$f":"IF((VLOOKUP(E844,INVENTORYDATA,7,FALSE))=\"NO\",\"X\",\"\")","v":{"$error":"#N/A"}},null,null,"Check Optical Drive",null,{"$f":"IF((VLOOKUP(K844,INVENTORYDATA,7,FALSE))=\"YES\",\"X\",\"\")","v":{"$error":"#N/A"}},{"$f":"IF((VLOOKUP(K844,INVENTORYDATA,7,FALSE))=\"NO\",\"X\",\"\")","v":{"$error":"#N/A"}}]
["Power Off",null,"X",{"$nulls":3},"Power Off",null,"X"]
["HDD Serial No.",null,{"$f":"IF(ISBLANK(VLOOKUP(E844,INVENTORYDATA,12,FALSE)),\"\",VLOOKUP(E844,INVENTORYDATA,12,FALSE))","v":{"$error":"#N/A"}},{"$nulls":3},"HDD Serial No.",null,{"$f":"IF(ISBLANK(VLOOKUP(K844,INVENTORYDATA,12,FALSE)),\"\",VLOOKUP(K844,INVENTORYDATA,12,FALSE))","v":{"$error":"#N/A"}}]
[]
["Tested for key functions,R2/Ready for Resale",{"$nulls":5},"Tested for key functions,R2/Ready for Resale"]
["BIOS Lock","Caddy","Optical","WebCam","Battery",null,"BIOS Lock","Caddy","Optical","WebCam","Battery"]
[null,null,{"$f":"VLOOKUP(E844,INVENTORY!$A$2:$N$144,7,FALSE)","v":{"$error":"#N/A"}},{"$f":"VLOOKUP(E844,INVENTORY!$A$2:$N$144,8,FALSE)","v":{"$error":"#N/A"}},{"$f":"VLOOKUP(E844,INVENTORY!$A$2:$N$144,9,FALSE)","v":{"$error":"#N/A"}},{"$nulls":3},{"$f":"VLOOKUP(K844,INVENTORY!$A$2:$N$144,7,FALSE)","v":{"$error":"#N/A"}},{"$f":"VLOOKUP(K844,INVENTORY!$A$2:$N$144,8,FALSE)","v":{"$error":"#N/A"}},{"$f":"VLOOKUP(K844,INVENTORY!$A$2:$N$144,9,FALSE)","v":{"$error":"#N/A"}}]
[]
["CPU Cosmetics Defects:",null,{"$f":"\"Function Code: \"&VLOOKUP(E844,INVENTORY!$A$2:$Q$144,14,FALSE)","v":{"$error":"#N/A"}},{"$nulls":3},"CPU Cosmetics Defects:",null,{"$f":"\"Function Code: \"&VLOOKUP(K844,INVENTORY!$A$2:$Q$144,14,FALSE)","v":{"$error":"#N/A"}}]
[]
[null,null,{"$f":"\"Cosmetic Code: \"&VLOOKUP(E844,INVENTORY!$A$2:$Q$144,15,FALSE)","v":{"$error":"#N/A"}},{"$nulls":5},{"$f":"\"Cosmetic Code: \"&VLOOKUP(K844,INVENTORY!$A$2:$Q$144,15,FALSE)","v":{"$error":"#N/A"}}]
[]
["Casing","Plugs/Ports",{"$nulls":4},"Casing","Plugs/Ports"]
["Pass","Pass",{"$nulls":4},"Pass","Pass"]
["Fail","Fail",null,"TRRC#:L.T.R.",null,null,"Fail","Fail",null,"TRRC#:L.T.R."]
[]
["LAPTOP TESTING RECORD",{"$nulls":5},"LAPTOP TESTING RECORD"]
[]
[{"$nulls":3},"ITEM #",{"$f":"E844+2","v":61},{"$nulls":4},"ITEM #",{"$f":"K844+2","v":62}]
["Tester: ","RR","Date:",{"$f":"NOW()","v":"2026-01-06T11:13:00.960"},null,null,"Tester: ","RR","Date:",{"$f":"NOW()","v":"2026-01-06T11:13:00.960"}]
["Type: ","LAPTOP","SN:",{"$f":"VLOOKUP(E873,INVENTORYDATA,10,FALSE)","v":{"$error":"#N/A"}},null,null,"Type: ","LAPTOP","SN:",{"$f":"VLOOKUP(K873,INVENTORYDATA,10,FALSE)","v":{"$error":"#N/A"}}]
[{"$f":"\"Make: \"","v":"Make: "},{"$f":"VLOOKUP(E873,INVENTORYDATA,2,FALSE)","v":{"$error":"#N/A"}},{"$f":"\"Model: \"","v":"Model: "},{"$f":"VLOOKUP(E873,INVENTORYDATA,3,FALSE)","v":{"$error":"#N/A"}},null,null,{"$f":"\"Make: \"","v":"Make: "},{"$f":"VLOOKUP(K873,INVENTORYDATA,2,FALSE)","v":{"$error":"#N/A"}},{"$f":"\"Model: \"","v":"Model: "},{"$f":"VLOOKUP(K873,INVENTORYDATA,3,FALSE)","v":{"$error":"#N/A"}}]
[{"$f":"\"CPU/Speed: \"","v":"CPU/Speed: "},{"$f":"VLOOKUP(E873,INVENTORYDATA,4,FALSE)&\" / \"&VLOOKUP(E873,INVENTORYDATA,5,FALSE)&\"GHz\"","v":{"$error":"#N/A"}},null,{"$f":"\"Memory: \"","v":"Memory: "},{"$f":"VLOOKUP(E873,INVENTORYDATA,6,FALSE)","v":{"$error":"#N/A"}},null,{"$f":"\"CPU/Speed: \"","v":"CPU/Speed: "},{"$f":"VLOOKUP(K873,INVENTORYDATA,4,FALSE)&\" / \"&VLOOKUP(K873,INVENTORYDATA,5,FALSE)&\"GHz\"","v":{"$error":"#N/A"}},null,{"$f":"\"Memory: \"","v":"Memory: "},{"$f":"VLOOKUP(K873,INVENTORYDATA,6,FALSE)","v":{"$error":"#N/A"}}]
[]
["Key Function",null,"Pass","Fail ","Comments",null,"Key Function",null,"Pass","Fail ","Comments"]
["Hard Drive Removed",null,{"$f":"IF(ISBLANK(VLOOKUP(E873,INVENTORYDATA,13,FALSE)),\"X\",\"\")","v":""},null,{"$f":"IF(ISBLANK(VLOOKUP(E873,INVENTORYDATA,13,FALSE)),\"\",VLOOKUP(E873,INVENTORYDATA,13,FALSE))","v":{"$error":"#N/A"}},null,"Hard Drive Removed",null,{"$f":"IF(ISBLANK(VLOOKUP(K873,INVENTORYDATA,13,FALSE)),\"X\",\"\")","v":""},null,{"$f":"IF(ISBLANK(VLOOKUP(K873,INVENTORYDATA,13,FALSE)),\"\",VLOOKUP(K873,INVENTORYDATA,13,FALSE))","v":{"$error":"#N/A"}}]
["Install Memory",null,"X",{"$nulls":3},"Install Memory",null,"X"]
["Power ON",null,"X",{"$nulls":3},"Power ON",null,"X"]
["Record BIOS info",null,"X",{"$nulls":3},"Record BIOS info",null,"X"]
["Check Optical Drive",null,{"$f":"IF((VLOOKUP(E873,INVENTORYDATA,7,FALSE))=\"YES\",\"X\",\"\")","v":{"$error":"#N/A"}},{"$f":"IF((VLOOKUP(E873,INVENTORYDATA,7,FALSE))=\"NO\",\"X\",\"\")","v":{"$error":"#N/A"}},null,null,"Check Optical Drive",null,{"$f":"IF((VLOOKUP(K873,INVENTORYDATA,7,FALSE))=\"YES\",\"X\",\"\")","v":{"$error":"#N/A"}},{"$f":"IF((VLOOKUP(K873,INVENTORYDATA,7,FALSE))=\"NO\",\"X\",\"\")","v":{"$error":"#N/A"}}]
["Power Off",null,"X",{"$nulls":3},"Power Off",null,"X"]
["HDD Serial No.",null,{"$f":"IF(ISBLANK(VLOOKUP(E873,INVENTORYDATA,12,FALSE)),\"\",VLOOKUP(E873,INVENTORYDATA,12,FALSE))","v":{"$error":"#N/A"}},{"$nulls":3},"HDD Serial No.",null,{"$f":"IF(ISBLANK(VLOOKUP(K873,INVENTORYDATA,12,FALSE)),\"\",VLOOKUP(K873,INVENTORYDATA,12,FALSE))","v":{"$error":"#N/A"}}]
[]
["Tested for key functions,R2/Ready for Resale",{"$nulls":5},"Tested for key functions,R2/Ready for Resale"]
["BIOS Lock","Caddy","Optical","WebCam","Battery",null,"BIOS Lock","Caddy","Optical","WebCam","Battery"]
[null,null,{"$f":"VLOOKUP(E873,INVENTORY!$A$2:$N$144,7,FALSE)","v":{"$error":"#N/A"}},{"$f":"VLOOKUP(E873,INVENTORY!$A$2:$N$144,8,FALSE)","v":{"$error":"#N/A"}},{"$f":"VLOOKUP(E873,INVENTORY!$A$2:$N$144,9,FALSE)","v":{"$error":"#N/A"}},{"$nulls":3},{"$f":"VLOOKUP(K873,INVENTORY!$A$2:$N$144,7,FALSE)","v":{"$error":"#N/A"}},{"$f":"VLOOKUP(K873,INVENTORY!$A$2:$N$144,8,FALSE)","v":{"$error":"#N/A"}},{"$f":"VLOOKUP(K873,INVENTORY!$A$2:$N$144,9,FALSE)","v":{"$error":"#N/A"}}]
[]
["CPU Cosmetics Defects:",null,{"$f":"\"Function Code: \"&VLOOKUP(E873,INVENTORY!$A$2:$Q$144,14,FALSE)","v":{"$error":"#N/A"}},{"$nulls":3},"CPU Cosmetics Defects:",null,{"$f":"\"Function Code: \"&VLOOKUP(K873,INVENTORY!$A$2:$Q$144,14,FALSE)","v":{"$error":"#N/A"}}]
[]
[null,null,{"$f":"\"Cosmetic Code: \"&VLOOKUP(E873,INVENTORY!$A$2:$Q$144,15,FALSE)","v":{"$error":"#N/A"}},{"$nulls":5},{"$f":"\"Cosmetic Code: \"&VLOOKUP(K873,INVENTORY!$A$2:$Q$144,15,FALSE)","v":{"$error":"#N/A"}}]
[]
["Casing","Plugs/Ports",{"$nulls":4},"Casing","Plugs/Ports"]
["Pass","Pass",{"$nulls":4},"Pass","Pass"]
["Fail","Fail",null,"TRRC#:L.T.R.",null,null,"Fail","Fail",null,"TRRC#:L.T.R."]
[]
["LAPTOP TESTING RECORD",{"$nulls":5},"LAPTOP TESTING RECORD"]
[]
[{"$nulls":3},"ITEM #",{"$f":"E873+2","v":63},{"$nulls":4},"ITEM #",{"$f":"K873+2","v":64}]
["Tester: ","RR","Date:",{"$f":"NOW()","v":"2026-01-06T11:13:00.960"},null,null,"Tester: ","RR","Date:",{"$f":"NOW()","v":"2026-01-06T11:13:00.960"}]
["Type: ","LAPTOP","SN:",{"$f":"VLOOKUP(E902,INVENTORYDATA,10,FALSE)","v":{"$error":"#N/A"}},null,null,"Type: ","LAPTOP","SN:",{"$f":"VLOOKUP(K902,INVENTORYDATA,10,FALSE)","v":{"$error":"#N/A"}}]
[{"$f":"\"Make: \"","v":"Make: "},{"$f":"VLOOKUP(E902,INVENTORYDATA,2,FALSE)","v":{"$error":"#N/A"}},{"$f":"\"Model: \"","v":"Model: "},{"$f":"VLOOKUP(E902,INVENTORYDATA,3,FALSE)","v":{"$error":"#N/A"}},null,null,{"$f":"\"Make: \"","v":"Make: "},{"$f":"VLOOKUP(K902,INVENTORYDATA,2,FALSE)","v":{"$error":"#N/A"}},{"$f":"\"Model: \"","v":"Model: "},{"$f":"VLOOKUP(K902,INVENTORYDATA,3,FALSE)","v":{"$error":"#N/A"}}]
[{"$f":"\"CPU/Speed: \"","v":"CPU/Speed: "},{"$f":"VLOOKUP(E902,INVENTORYDATA,4,FALSE)&\" / \"&VLOOKUP(E902,INVENTORYDATA,5,FALSE)&\"GHz\"","v":{"$error":"#N/A"}},null,{"$f":"\"Memory: \"","v":"Memory: "},{"$f":"VLOOKUP(E902,INVENTORYDATA,6,FALSE)","v":{"$error":"#N/A"}},null,{"$f":"\"CPU/Speed: \"","v":"CPU/Speed: "},{"$f":"VLOOKUP(K902,INVENTORYDATA,4,FALSE)&\" / \"&VLOOKUP(K902,INVENTORYDATA,5,FALSE)&\"GHz\"","v":{"$error":"#N/A"}},null,{"$f":"\"Memory: \"","v":"Memory: "},{"$f":"VLOOKUP(K902,INVENTORYDATA,6,FALSE)","v":{"$error":"#N/A"}}]
[]
["Key Function",null,"Pass","Fail ","Comments",null,"Key Function",null,"Pass","Fail ","Comments"]
["Hard Drive Removed",null,{"$f":"IF(ISBLANK(VLOOKUP(E902,INVENTORYDATA,13,FALSE)),\"X\",\"\")","v":""},null,{"$f":"IF(ISBLANK(VLOOKUP(E902,INVENTORYDATA,13,FALSE)),\"\",VLOOKUP(E902,INVENTORYDATA,13,FALSE))","v":{"$error":"#N/A"}},null,"Hard Drive Removed",null,{"$f":"IF(ISBLANK(VLOOKUP(K902,INVENTORYDATA,13,FALSE)),\"X\",\"\")","v":""},null,{"$f":"IF(ISBLANK(VLOOKUP(K902,INVENTORYDATA,13,FALSE)),\"\",VLOOKUP(K902,INVENTORYDATA,13,FALSE))","v":{"$error":"#N/A"}}]
["Install Memory",null,"X",{"$nulls":3},"Install Memory",null,"X"]
["Power ON",null,"X",{"$nulls":3},"Power ON",null,"X"]
["Record BIOS info",null,"X",{"$nulls":3},"Record BIOS info",null,"X"]
["Check Optical Drive",null,{"$f":"IF((VLOOKUP(E902,INVENTORYDATA,7,FALSE))=\"YES\",\"X\",\"\")","v":{"$error":"#N/A"}},{"$f":"IF((VLOOKUP(E902,INVENTORYDATA,7,FALSE))=\"NO\",\"X\",\"\")","v":{"$error":"#N/A"}},null,null,"Check Optical Drive",null,{"$f":"IF((VLOOKUP(K902,INVENTORYDATA,7,FALSE))=\"YES\",\"X\",\"\")","v":{"$error":"#N/A"}},{"$f":"IF((VLOOKUP(K902,INVENTORYDATA,7,FALSE))=\"NO\",\"X\",\"\")","v":{"$error":"#N/A"}}]
["Power Off",null,"X",{"$nulls":3},"Power Off",null,"X"]
["HDD Serial No.",null,{"$f":"IF(ISBLANK(VLOOKUP(E902,INVENTORYDATA,12,FALSE)),\"\",VLOOKUP(E902,INVENTORYDATA,12,FALSE))","v":{"$error":"#N/A"}},{"$nulls":3},"HDD Serial No.",null,{"$f":"IF(ISBLANK(VLOOKUP(K902,INVENTORYDATA,12,FALSE)),\"\",VLOOKUP(K902,INVENTORYDATA,12,FALSE))","v":{"$error":"#N/A"}}]
[]
["Tested for key functions,R2/Ready for Resale",{"$nulls":5},"Tested for key functions,R2/Ready for Resale"]
["BIOS Lock","Caddy","Optical","WebCam","Battery",null,"BIOS Lock","Caddy","Optical","WebCam","Battery"]
[null,null,{"$f":"VLOOKUP(E902,INVENTORY!$A$2:$N$144,7,FALSE)","v":{"$error":"#N/A"}},{"$f":"VLOOKUP(E902,INVENTORY!$A$2:$N$144,8,FALSE)","v":{"$error":"#N/A"}},{"$f":"VLOOKUP(E902,INVENTORY!$A$2:$N$144,9,FALSE)","v":{"$error":"#N/A"}},{"$nulls":3},{"$f":"VLOOKUP(K902,INVENTORY!$A$2:$N$144,7,FALSE)","v":{"$error":"#N/A"}},{"$f":"VLOOKUP(K902,INVENTORY!$A$2:$N$144,8,FALSE)","v":{"$error":"#N/A"}},{"$f":"VLOOKUP(K902,INVENTORY!$A$2:$N$144,9,FALSE)","v":{"$error":"#N/A"}}]
[]
["CPU Cosmetics Defects:",null,{"$f":"\"Function Code: \"&VLOOKUP(E902,INVENTORY!$A$2:$Q$144,14,FALSE)","v":{"$error":"#N/A"}},{"$nulls":3},"CPU Cosmetics Defects:",null,{"$f":"\"Function Code: \"&VLOOKUP(K902,INVENTORY!$A$2:$Q$144,14,FALSE)","v":{"$error":"#N/A"}}]
[]
[null,null,{"$f":"\"Cosmetic Code: \"&VLOOKUP(E902,INVENTORY!$A$2:$Q$144,15,FALSE)","v":{"$error":"#N/A"}},{"$nulls":5},{"$f":"\"Cosmetic Code: \"&VLOOKUP(K902,INVENTORY!$A$2:$Q$144,15,FALSE)","v":{"$error":"#N/A"}}]
[]
["Casing","Plugs/Ports",{"$nulls":4},"Casing","Plugs/Ports"]
["Pass","Pass",{"$nulls":4},"Pass","Pass"]
["Fail","Fail",null,"TRRC#:L.T.R.",null,null,"Fail","Fail",null,"TRRC#:L.T.R."]
[]
["LAPTOP TESTING RECORD",{"$nulls":5},"LAPTOP TESTING RECORD"]
[]
[{"$nulls":3},"ITEM #",{"$f":"E902+2","v":65},{"$nulls":4},"ITEM #",{"$f":"K902+2","v":66}]
["Tester: ","RR","Date:",{"$f":"NOW()","v":"2026-01-06T11:13:00.960"},null,null,"Tester: ","RR","Date:",{"$f":"NOW()","v":"2026-01-06T11:13:00.960"}]
["Type: ","LAPTOP","SN:",{"$f":"VLOOKUP(E931,INVENTORYDATA,10,FALSE)","v":{"$error":"#N/A"}},null,null,"Type: ","LAPTOP","SN:",{"$f":"VLOOKUP(K931,INVENTORYDATA,10,FALSE)","v":{"$error":"#N/A"}}]
[{"$f":"\"Make: \"","v":"Make: "},{"$f":"VLOOKUP(E931,INVENTORYDATA,2,FALSE)","v":{"$error":"#N/A"}},{"$f":"\"Model: \"","v":"Model: "},{"$f":"VLOOKUP(E931,INVENTORYDATA,3,FALSE)","v":{"$error":"#N/A"}},null,null,{"$f":"\"Make: \"","v":"Make: "},{"$f":"VLOOKUP(K931,INVENTORYDATA,2,FALSE)","v":{"$error":"#N/A"}},{"$f":"\"Model: \"","v":"Model: "},{"$f":"VLOOKUP(K931,INVENTORYDATA,3,FALSE)","v":{"$error":"#N/A"}}]
[{"$f":"\"CPU/Speed: \"","v":"CPU/Speed: "},{"$f":"VLOOKUP(E931,INVENTORYDATA,4,FALSE)&\" / \"&VLOOKUP(E931,INVENTORYDATA,5,FALSE)&\"GHz\"","v":{"$error":"#N/A"}},null,{"$f":"\"Memory: \"","v":"Memory: "},{"$f":"VLOOKUP(E931,INVENTORYDATA,6,FALSE)","v":{"$error":"#N/A"}},null,{"$f":"\"CPU/Speed: \"","v":"CPU/Speed: "},{"$f":"VLOOKUP(K931,INVENTORYDATA,4,FALSE)&\" / \"&VLOOKUP(K931,INVENTORYDATA,5,FALSE)&\"GHz\"","v":{"$error":"#N/A"}},null,{"$f":"\"Memory: \"","v":"Memory: "},{"$f":"VLOOKUP(K931,INVENTORYDATA,6,FALSE)","v":{"$error":"#N/A"}}]
[]
["Key Function",null,"Pass","Fail ","Comments",null,"Key Function",null,"Pass","Fail ","Comments"]
["Hard Drive Removed",null,{"$f":"IF(ISBLANK(VLOOKUP(E931,INVENTORYDATA,13,FALSE)),\"X\",\"\")","v":""},null,{"$f":"IF(ISBLANK(VLOOKUP(E931,INVENTORYDATA,13,FALSE)),\"\",VLOOKUP(E931,INVENTORYDATA,13,FALSE))","v":{"$error":"#N/A"}},null,"Hard Drive Removed",null,{"$f":"IF(ISBLANK(VLOOKUP(K931,INVENTORYDATA,13,FALSE)),\"X\",\"\")","v":""},null,{"$f":"IF(ISBLANK(VLOOKUP(K931,INVENTORYDATA,13,FALSE)),\"\",VLOOKUP(K931,INVENTORYDATA,13,FALSE))","v":{"$error":"#N/A"}}]
["Install Memory",null,"X",{"$nulls":3},"Install Memory",null,"X"]
["Power ON",null,"X",{"$nulls":3},"Power ON",null,"X"]
["Record BIOS info",null,"X",{"$nulls":3},"Record BIOS info",null,"X"]
["Check Optical Drive",null,{"$f":"IF((VLOOKUP(E931,INVENTORYDATA,7,FALSE))=\"YES\",\"X\",\"\")","v":{"$error":"#N/A"}},{"$f":"IF((VLOOKUP(E931,INVENTORYDATA,7,FALSE))=\"NO\",\"X\",\"\")","v":{"$error":"#N/A"}},null,null,"Check Optical Drive",null,{"$f":"IF((VLOOKUP(K931,INVENTORYDATA,7,FALSE))=\"YES\",\"X\",\"\")","v":{"$error":"#N/A"}},{"$f":"IF((VLOOKUP(K931,INVENTORYDATA,7,FALSE))=\"NO\",\"X\",\"\")","v":{"$error":"#N/A"}}]
["Power Off",null,"X",{"$nulls":3},"Power Off",null,"X"]
["HDD Serial No.",null,{"$f":"IF(ISBLANK(VLOOKUP(E931,INVENTORYDATA,12,FALSE)),\"\",VLOOKUP(E931,INVENTORYDATA,12,FALSE))","v":{"$error":"#N/A"}},{"$nulls":3},"HDD Serial No.",null,{"$f":"IF(ISBLANK(VLOOKUP(K931,INVENTORYDATA,12,FALSE)),\"\",VLOOKUP(K931,INVENTORYDATA,12,FALSE))","v":{"$error":"#N/A"}}]
[]
["Tested for key functions,R2/Ready for Resale",{"$nulls":5},"Tested for key functions,R2/Ready for Resale"]
["BIOS Lock","Caddy","Optical","WebCam","Battery",null,"BIOS Lock","Caddy","Optical","WebCam","Battery"]
[null,null,{"$f":"VLOOKUP(E931,INVENTORY!$A$2:$N$144,7,FALSE)","v":{"$error":"#N/A"}},{"$f":"VLOOKUP(E931,INVENTORY!$A$2:$N$144,8,FALSE)","v":{"$error":"#N/A"}},{"$f":"VLOOKUP(E931,INVENTORY!$A$2:$N$144,9,FALSE)","v":{"$error":"#N/A"}},{"$nulls":3},{"$f":"VLOOKUP(K931,INVENTORY!$A$2:$N$144,7,FALSE)","v":{"$error":"#N/A"}},{"$f":"VLOOKUP(K931,INVENTORY!$A$2:$N$144,8,FALSE)","v":{"$error":"#N/A"}},{"$f":"VLOOKUP(K931,INVENTORY!$A$2:$N$144,9,FALSE)","v":{"$error":"#N/A"}}]
[]
["CPU Cosmetics Defects:",null,{"$f":"\"Function Code: \"&VLOOKUP(E931,INVENTORY!$A$2:$Q$144,14,FALSE)","v":{"$error":"#N/A"}},{"$nulls":3},"CPU Cosmetics Defects:",null,{"$f":"\"Function Code: \"&VLOOKUP(K931,INVENTORY!$A$2:$Q$144,14,FALSE)","v":{"$error":"#N/A"}}]
[]
[null,null,{"$f":"\"Cosmetic Code: \"&VLOOKUP(E931,INVENTORY!$A$2:$Q$144,15,FALSE)","v":{"$error":"#N/A"}},{"$nulls":5},{"$f":"\"Cosmetic Code: \"&VLOOKUP(K931,INVENTORY!$A$2:$Q$144,15,FALSE)","v":{"$error":"#N/A"}}]
[]
["Casing","Plugs/Ports",{"$nulls":4},"Casing","Plugs/Ports"]
["Pass","Pass",{"$nulls":4},"Pass","Pass"]
["Fail","Fail",null,"TRRC#:L.T.R.",null,null,"Fail","Fail",null,"TRRC#:L.T.R."]
[]
["LAPTOP TESTING RECORD",{"$nulls":5},"LAPTOP TESTING RECORD"]
[]
[{"$nulls":3},"ITEM #",{"$f":"E931+2","v":67},{"$nulls":4},"ITEM #",{"$f":"K931+2","v":68}]
["Tester: ","RR","Date:",{"$f":"NOW()","v":"2026-01-06T11:13:00.960"},null,null,"Tester: ","RR","Date:",{"$f":"NOW()","v":"2026-01-06T11:13:00.960"}]
["Type: ","LAPTOP","SN:",{"$f":"VLOOKUP(E960,INVENTORYDATA,10,FALSE)","v":{"$error":"#N/A"}},null,null,"Type: ","LAPTOP","SN:",{"$f":"VLOOKUP(K960,INVENTORYDATA,10,FALSE)","v":{"$error":"#N/A"}}]
[{"$f":"\"Make: \"","v":"Make: "},{"$f":"VLOOKUP(E960,INVENTORYDATA,2,FALSE)","v":{"$error":"#N/A"}},{"$f":"\"Model: \"","v":"Model: "},{"$f":"VLOOKUP(E960,INVENTORYDATA,3,FALSE)","v":{"$error":"#N/A"}},null,null,{"$f":"\"Make: \"","v":"Make: "},{"$f":"VLOOKUP(K960,INVENTORYDATA,2,FALSE)","v":{"$error":"#N/A"}},{"$f":"\"Model: \"","v":"Model: "},{"$f":"VLOOKUP(K960,INVENTORYDATA,3,FALSE)","v":{"$error":"#N/A"}}]
[{"$f":"\"CPU/Speed: \"","v":"CPU/Speed: "},{"$f":"VLOOKUP(E960,INVENTORYDATA,4,FALSE)&\" / \"&VLOOKUP(E960,INVENTORYDATA,5,FALSE)&\"GHz\"","v":{"$error":"#N/A"}},null,{"$f":"\"Memory: \"","v":"Memory: "},{"$f":"VLOOKUP(E960,INVENTORYDATA,6,FALSE)","v":{"$error":"#N/A"}},null,{"$f":"\"CPU/Speed: \"","v":"CPU/Speed: "},{"$f":"VLOOKUP(K960,INVENTORYDATA,4,FALSE)&\" / \"&VLOOKUP(K960,INVENTORYDATA,5,FALSE)&\"GHz\"","v":{"$error":"#N/A"}},null,{"$f":"\"Memory: \"","v":"Memory: "},{"$f":"VLOOKUP(K960,INVENTORYDATA,6,FALSE)","v":{"$error":"#N/A"}}]
[]
["Key Function",null,"Pass","Fail ","Comments",null,"Key Function",null,"Pass","Fail ","Comments"]
["Hard Drive Removed",null,{"$f":"IF(ISBLANK(VLOOKUP(E960,INVENTORYDATA,13,FALSE)),\"X\",\"\")","v":""},null,{"$f":"IF(ISBLANK(VLOOKUP(E960,INVENTORYDATA,13,FALSE)),\"\",VLOOKUP(E960,INVENTORYDATA,13,FALSE))","v":{"$error":"#N/A"}},null,"Hard Drive Removed",null,{"$f":"IF(ISBLANK(VLOOKUP(K960,INVENTORYDATA,13,FALSE)),\"X\",\"\")","v":""},null,{"$f":"IF(ISBLANK(VLOOKUP(K960,INVENTORYDATA,13,FALSE)),\"\",VLOOKUP(K960,INVENTORYDATA,13,FALSE))","v":{"$error":"#N/A"}}]
["Install Memory",null,"X",{"$nulls":3},"Install Memory",null,"X"]
["Power ON",null,"X",{"$nulls":3},"Power ON",null,"X"]
["Record BIOS info",null,"X",{"$nulls":3},"Record BIOS info",null,"X"]
["Check Optical Drive",null,{"$f":"IF((VLOOKUP(E960,INVENTORYDATA,7,FALSE))=\"YES\",\"X\",\"\")","v":{"$error":"#N/A"}},{"$f":"IF((VLOOKUP(E960,INVENTORYDATA,7,FALSE))=\"NO\",\"X\",\"\")","v":{"$error":"#N/A"}},null,null,"Check Optical Drive",null,{"$f":"IF((VLOOKUP(K960,INVENTORYDATA,7,FALSE))=\"YES\",\"X\",\"\")","v":{"$error":"#N/A"}},{"$f":"IF((VLOOKUP(K960,INVENTORYDATA,7,FALSE))=\"NO\",\"X\",\"\")","v":{"$error":"#N/A"}}]
["Power Off",null,"X",{"$nulls":3},"Power Off",null,"X"]
["HDD Serial No.",null,{"$f":"IF(ISBLANK(VLOOKUP(E960,INVENTORYDATA,12,FALSE)),\"\",VLOOKUP(E960,INVENTORYDATA,12,FALSE))","v":{"$error":"#N/A"}},{"$nulls":3},"HDD Serial No.",null,{"$f":"IF(ISBLANK(VLOOKUP(K960,INVENTORYDATA,12,FALSE)),\"\",VLOOKUP(K960,INVENTORYDATA,12,FALSE))","v":{"$error":"#N/A"}}]
[]
["Tested for key functions,R2/Ready for Resale",{"$nulls":5},"Tested for key functions,R2/Ready for Resale"]
["BIOS Lock","Caddy","Optical","WebCam","Battery",null,"BIOS Lock","Caddy","Optical","WebCam","Battery"]
[null,null,{"$f":"VLOOKUP(E960,INVENTORY!$A$2:$N$144,7,FALSE)","v":{"$error":"#N/A"}},{"$f":"VLOOKUP(E960,INVENTORY!$A$2:$N$144,8,FALSE)","v":{"$error":"#N/A"}},{"$f":"VLOOKUP(E960,INVENTORY!$A$2:$N$144,9,FALSE)","v":{"$error":"#N/A"}},{"$nulls":3},{"$f":"VLOOKUP(K960,INVENTORY!$A$2:$N$144,7,FALSE)","v":{"$error":"#N/A"}},{"$f":"VLOOKUP(K960,INVENTORY!$A$2:$N$144,8,FALSE)","v":{"$error":"#N/A"}},{"$f":"VLOOKUP(K960,INVENTORY!$A$2:$N$144,9,FALSE)","v":{"$error":"#N/A"}}]
[]
["CPU Cosmetics Defects:",null,{"$f":"\"Function Code: \"&VLOOKUP(E960,INVENTORY!$A$2:$Q$144,14,FALSE)","v":{"$error":"#N/A"}},{"$nulls":3},"CPU Cosmetics Defects:",null,{"$f":"\"Function Code: \"&VLOOKUP(K960,INVENTORY!$A$2:$Q$144,14,FALSE)","v":{"$error":"#N/A"}}]
[]
[null,null,{"$f":"\"Cosmetic Code: \"&VLOOKUP(E960,INVENTORY!$A$2:$Q$144,15,FALSE)","v":{"$error":"#N/A"}},{"$nulls":5},{"$f":"\"Cosmetic Code: \"&VLOOKUP(K960,INVENTORY!$A$2:$Q$144,15,FALSE)","v":{"$error":"#N/A"}}]
[]
["Casing","Plugs/Ports",{"$nulls":4},"Casing","Plugs/Ports"]
["Pass","Pass",{"$nulls":4},"Pass","Pass"]
["Fail","Fail",null,"TRRC#:L.T.R.",null,null,"Fail","Fail",null,"TRRC#:L.T.R."]
[]
["LAPTOP TESTING RECORD",{"$nulls":5},"LAPTOP TESTING RECORD"]
[]
[{"$nulls":3},"ITEM #",{"$f":"E960+2","v":69},{"$nulls":4},"ITEM #",{"$f":"K960+2","v":70}]
["Tester: ","RR","Date:",{"$f":"NOW()","v":"2026-01-06T11:13:00.960"},null,null,"Tester: ","RR","Date:",{"$f":"NOW()","v":"2026-01-06T11:13:00.960"}]
["Type: ","LAPTOP","SN:",{"$f":"VLOOKUP(E989,INVENTORYDATA,10,FALSE)","v":{"$error":"#N/A"}},null,null,"Type: ","LAPTOP","SN:",{"$f":"VLOOKUP(K989,INVENTORYDATA,10,FALSE)","v":{"$error":"#N/A"}}]
[{"$f":"\"Make: \"","v":"Make: "},{"$f":"VLOOKUP(E989,INVENTORYDATA,2,FALSE)","v":{"$error":"#N/A"}},{"$f":"\"Model: \"","v":"Model: "},{"$f":"VLOOKUP(E989,INVENTORYDATA,3,FALSE)","v":{"$error":"#N/A"}},null,null,{"$f":"\"Make: \"","v":"Make: "},{"$f":"VLOOKUP(K989,INVENTORYDATA,2,FALSE)","v":{"$error":"#N/A"}},{"$f":"\"Model: \"","v":"Model: "},{"$f":"VLOOKUP(K989,INVENTORYDATA,3,FALSE)","v":{"$error":"#N/A"}}]
[{"$f":"\"CPU/Speed: \"","v":"CPU/Speed: "},{"$f":"VLOOKUP(E989,INVENTORYDATA,4,FALSE)&\" / \"&VLOOKUP(E989,INVENTORYDATA,5,FALSE)&\"GHz\"","v":{"$error":"#N/A"}},null,{"$f":"\"Memory: \"","v":"Memory: "},{"$f":"VLOOKUP(E989,INVENTORYDATA,6,FALSE)","v":{"$error":"#N/A"}},null,{"$f":"\"CPU/Speed: \"","v":"CPU/Speed: "},{"$f":"VLOOKUP(K989,INVENTORYDATA,4,FALSE)&\" / \"&VLOOKUP(K989,INVENTORYDATA,5,FALSE)&\"GHz\"","v":{"$error":"#N/A"}},null,{"$f":"\"Memory: \"","v":"Memory: "},{"$f":"VLOOKUP(K989,INVENTORYDATA,6,FALSE)","v":{"$error":"#N/A"}}]
[]
["Key Function",null,"Pass","Fail ","Comments",null,"Key Function",null,"Pass","Fail ","Comments"]
["Hard Drive Removed",null,{"$f":"IF(ISBLANK(VLOOKUP(E989,INVENTORYDATA,13,FALSE)),\"X\",\"\")","v":""},null,{"$f":"IF(ISBLANK(VLOOKUP(E989,INVENTORYDATA,13,FALSE)),\"\",VLOOKUP(E989,INVENTORYDATA,13,FALSE))","v":{"$error":"#N/A"}},null,"Hard Drive Removed",null,{"$f":"IF(ISBLANK(VLOOKUP(K989,INVENTORYDATA,13,FALSE)),\"X\",\"\")","v":""},null,{"$f":"IF(ISBLANK(VLOOKUP(K989,INVENTORYDATA,13,FALSE)),\"\",VLOOKUP(K989,INVENTORYDATA,13,FALSE))","v":{"$error":"#N/A"}}]
["Install Memory",null,"X",{"$nulls":3},"Install Memory",null,"X"]
["Power ON",null,"X",{"$nulls":3},"Power ON",null,"X"]
["Record BIOS info",null,"X",{"$nulls":3},"Record BIOS info",null,"X"]
["Check Optical Drive",null,{"$f":"IF((VLOOKUP(E989,INVENTORYDATA,7,FALSE))=\"YES\",\"X\",\"\")","v":{"$error":"#N/A"}},{"$f":"IF((VLOOKUP(E989,INVENTORYDATA,7,FALSE))=\"NO\",\"X\",\"\")","v":{"$error":"#N/A"}},null,null,"Check Optical Drive",null,{"$f":"IF((VLOOKUP(K989,INVENTORYDATA,7,FALSE))=\"YES\",\"X\",\"\")","v":{"$error":"#N/A"}},{"$f":"IF((VLOOKUP(K989,INVENTORYDATA,7,FALSE))=\"NO\",\"X\",\"\")","v":{"$error":"#N/A"}}]
["Power Off",null,"X",{"$nulls":3},"Power Off",null,"X"]
["HDD Serial No.",null,{"$f":"IF(ISBLANK(VLOOKUP(E989,INVENTORYDATA,12,FALSE)),\"\",VLOOKUP(E989,INVENTORYDATA,12,FALSE))","v":{"$error":"#N/A"}},{"$nulls":3},"HDD Serial No.",null,{"$f":"IF(ISBLANK(VLOOKUP(K989,INVENTORYDATA,12,FALSE)),\"\",VLOOKUP(K989,INVENTORYDATA,12,FALSE))","v":{"$error":"#N/A"}}]
[]
["Tested for key functions,R2/Ready for Resale",{"$nulls":5},"Tested for key functions,R2/Ready for Resale"]
["BIOS Lock","Caddy","Optical","WebCam","Battery",null,"BIOS Lock","Caddy","Optical","WebCam","Battery"]
[null,null,{"$f":"VLOOKUP(E989,INVENTORY!$A$2:$N$144,7,FALSE)","v":{"$error":"#N/A"}},{"$f":"VLOOKUP(E989,INVENTORY!$A$2:$N$144,8,FALSE)","v":{"$error":"#N/A"}},{"$f":"VLOOKUP(E989,INVENTORY!$A$2:$N$144,9,FALSE)","v":{"$error":"#N/A"}},{"$nulls":3},{"$f":"VLOOKUP(K989,INVENTORY!$A$2:$N$144,7,FALSE)","v":{"$error":"#N/A"}},{"$f":"VLOOKUP(K989,INVENTORY!$A$2:$N$144,8,FALSE)","v":{"$error":"#N/A"}},{"$f":"VLOOKUP(K989,INVENTORY!$A$2:$N$144,9,FALSE)","v":{"$error":"#N/A"}}]
[]
["CPU Cosmetics Defects:",null,{"$f":"\"Function Code: \"&VLOOKUP(E989,INVENTORY!$A$2:$Q$144,14,FALSE)","v":{"$error":"#N/A"}},{"$nulls":3},"CPU Cosmetics Defects:",null,{"$f":"\"Function Code: \"&VLOOKUP(K989,INVENTORY!$A$2:$Q$144,14,FALSE)","v":{"$error":"#N/A"}}]
[]
[null,null,{"$f":"\"Cosmetic Code: \"&VLOOKUP(E989,INVENTORY!$A$2:$Q$144,15,FALSE)","v":{"$error":"#N/A"}},{"$nulls":5},{"$f":"\"Cosmetic Code: \"&VLOOKUP(K989,INVENTORY!$A$2:$Q$144,15,FALSE)","v":{"$error":"#N/A"}}]
[]
["Casing","Plugs/Ports",{"$nulls":4},"Casing","Plugs/Ports"]
["Pass","Pass",{"$nulls":4},"Pass","Pass"]
["Fail","Fail",null,"TRRC#:L.T.R.",null,null,"Fail","Fail",null,"TRRC#:L.T.R."]
[]
["LAPTOP TESTING RECORD",{"$nulls":5},"LAPTOP TESTING RECORD"]
[]
[{"$nulls":3},"ITEM #",{"$f":"E989+2","v":71},{"$nulls":4},"ITEM #",{"$f":"K989+2","v":72}]
["Tester: ","RR","Date:",{"$f":"NOW()","v":"2026-01-06T11:13:00.960"},null,null,"Tester: ","RR","Date:",{"$f":"NOW()","v":"2026-01-06T11:13:00.960"}]
["Type: ","LAPTOP","SN:",{"$f":"VLOOKUP(E1018,INVENTORYDATA,10,FALSE)","v":{"$error":"#N/A"}},null,null,"Type: ","LAPTOP","SN:",{"$f":"VLOOKUP(K1018,INVENTORYDATA,10,FALSE)","v":{"$error":"#N/A"}}]
[{"$f":"\"Make: \"","v":"Make: "},{"$f":"VLOOKUP(E1018,INVENTORYDATA,2,FALSE)","v":{"$error":"#N/A"}},{"$f":"\"Model: \"","v":"Model: "},{"$f":"VLOOKUP(E1018,INVENTORYDATA,3,FALSE)","v":{"$error":"#N/A"}},null,null,{"$f":"\"Make: \"","v":"Make: "},{"$f":"VLOOKUP(K1018,INVENTORYDATA,2,FALSE)","v":{"$error":"#N/A"}},{"$f":"\"Model: \"","v":"Model: "},{"$f":"VLOOKUP(K1018,INVENTORYDATA,3,FALSE)","v":{"$error":"#N/A"}}]
[{"$f":"\"CPU/Speed: \"","v":"CPU/Speed: "},{"$f":"VLOOKUP(E1018,INVENTORYDATA,4,FALSE)&\" / \"&VLOOKUP(E1018,INVENTORYDATA,5,FALSE)&\"GHz\"","v":{"$error":"#N/A"}},null,{"$f":"\"Memory: \"","v":"Memory: "},{"$f":"VLOOKUP(E1018,INVENTORYDATA,6,FALSE)","v":{"$error":"#N/A"}},null,{"$f":"\"CPU/Speed: \"","v":"CPU/Speed: "},{"$f":"VLOOKUP(K1018,INVENTORYDATA,4,FALSE)&\" / \"&VLOOKUP(K1018,INVENTORYDATA,5,FALSE)&\"GHz\"","v":{"$error":"#N/A"}},null,{"$f":"\"Memory: \"","v":"Memory: "},{"$f":"VLOOKUP(K1018,INVENTORYDATA,6,FALSE)","v":{"$error":"#N/A"}}]
[]
["Key Function",null,"Pass","Fail ","Comments",null,"Key Function",null,"Pass","Fail ","Comments"]
["Hard Drive Removed",null,{"$f":"IF(ISBLANK(VLOOKUP(E1018,INVENTORYDATA,13,FALSE)),\"X\",\"\")","v":""},null,{"$f":"IF(ISBLANK(VLOOKUP(E1018,INVENTORYDATA,13,FALSE)),\"\",VLOOKUP(E1018,INVENTORYDATA,13,FALSE))","v":{"$error":"#N/A"}},null,"Hard Drive Removed",null,{"$f":"IF(ISBLANK(VLOOKUP(K1018,INVENTORYDATA,13,FALSE)),\"X\",\"\")","v":""},null,{"$f":"IF(ISBLANK(VLOOKUP(K1018,INVENTORYDATA,13,FALSE)),\"\",VLOOKUP(K1018,INVENTORYDATA,13,FALSE))","v":{"$error":"#N/A"}}]
["Install Memory",null,"X",{"$nulls":3},"Install Memory",null,"X"]
["Power ON",null,"X",{"$nulls":3},"Power ON",null,"X"]
["Record BIOS info",null,"X",{"$nulls":3},"Record BIOS info",null,"X"]
["Check Optical Drive",null,{"$f":"IF((VLOOKUP(E1018,INVENTORYDATA,7,FALSE))=\"YES\",\"X\",\"\")","v":{"$error":"#N/A"}},{"$f":"IF((VLOOKUP(E1018,INVENTORYDATA,7,FALSE))=\"NO\",\"X\",\"\")","v":{"$error":"#N/A"}},null,null,"Check Optical Drive",null,{"$f":"IF((VLOOKUP(K1018,INVENTORYDATA,7,FALSE))=\"YES\",\"X\",\"\")","v":{"$error":"#N/A"}},{"$f":"IF((VLOOKUP(K1018,INVENTORYDATA,7,FALSE))=\"NO\",\"X\",\"\")","v":{"$error":"#N/A"}}]
["Power Off",null,"X",{"$nulls":3},"Power Off",null,"X"]
["HDD Serial No.",null,{"$f":"IF(ISBLANK(VLOOKUP(E1018,INVENTORYDATA,12,FALSE)),\"\",VLOOKUP(E1018,INVENTORYDATA,12,FALSE))","v":{"$error":"#N/A"}},{"$nulls":3},"HDD Serial No.",null,{"$f":"IF(ISBLANK(VLOOKUP(K1018,INVENTORYDATA,12,FALSE)),\"\",VLOOKUP(K1018,INVENTORYDATA,12,FALSE))","v":{"$error":"#N/A"}}]
[]
["Tested for key functions,R2/Ready for Resale",{"$nulls":5},"Tested for key functions,R2/Ready for Resale"]
["BIOS Lock","Caddy","Optical","WebCam","Battery",null,"BIOS Lock","Caddy","Optical","WebCam","Battery"]
[null,null,{"$f":"VLOOKUP(E1018,INVENTORY!$A$2:$N$144,7,FALSE)","v":{"$error":"#N/A"}},{"$f":"VLOOKUP(E1018,INVENTORY!$A$2:$N$144,8,FALSE)","v":{"$error":"#N/A"}},{"$f":"VLOOKUP(E1018,INVENTORY!$A$2:$N$144,9,FALSE)","v":{"$error":"#N/A"}},{"$nulls":3},{"$f":"VLOOKUP(K1018,INVENTORY!$A$2:$N$144,7,FALSE)","v":{"$error":"#N/A"}},{"$f":"VLOOKUP(K1018,INVENTORY!$A$2:$N$144,8,FALSE)","v":{"$error":"#N/A"}},{"$f":"VLOOKUP(K1018,INVENTORY!$A$2:$N$144,9,FALSE)","v":{"$error":"#N/A"}}]
[]
["CPU Cosmetics Defects:",null,{"$f":"\"Function Code: \"&VLOOKUP(E1018,INVENTORY!$A$2:$Q$144,14,FALSE)","v":{"$error":"#N/A"}},{"$nulls":3},"CPU Cosmetics Defects:",null,{"$f":"\"Function Code: \"&VLOOKUP(K1018,INVENTORY!$A$2:$Q$144,14,FALSE)","v":{"$error":"#N/A"}}]
[]
[null,null,{"$f":"\"Cosmetic Code: \"&VLOOKUP(E1018,INVENTORY!$A$2:$Q$144,15,FALSE)","v":{"$error":"#N/A"}},{"$nulls":5},{"$f":"\"Cosmetic Code: \"&VLOOKUP(K1018,INVENTORY!$A$2:$Q$144,15,FALSE)","v":{"$error":"#N/A"}}]
[]
["Casing","Plugs/Ports",{"$nulls":4},"Casing","Plugs/Ports"]
["Pass","Pass",{"$nulls":4},"Pass","Pass"]
["Fail","Fail",null,"TRRC#:L.T.R.",null,null,"Fail","Fail",null,"TRRC#:L.T.R."]
[]
["LAPTOP TESTING RECORD",{"$nulls":5},"LAPTOP TESTING RECORD"]
[]
[{"$nulls":3},"ITEM #",{"$f":"E1018+2","v":73},{"$nulls":4},"ITEM #",{"$f":"K1018+2","v":74}]
["Tester: ","RR","Date:",{"$f":"NOW()","v":"2026-01-06T11:13:00.960"},null,null,"Tester: ","RR","Date:",{"$f":"NOW()","v":"2026-01-06T11:13:00.960"}]
["Type: ","LAPTOP","SN:",{"$f":"VLOOKUP(E1047,INVENTORYDATA,10,FALSE)","v":{"$error":"#N/A"}},null,null,"Type: ","LAPTOP","SN:",{"$f":"VLOOKUP(K1047,INVENTORYDATA,10,FALSE)","v":{"$error":"#N/A"}}]
[{"$f":"\"Make: \"","v":"Make: "},{"$f":"VLOOKUP(E1047,INVENTORYDATA,2,FALSE)","v":{"$error":"#N/A"}},{"$f":"\"Model: \"","v":"Model: "},{"$f":"VLOOKUP(E1047,INVENTORYDATA,3,FALSE)","v":{"$error":"#N/A"}},null,null,{"$f":"\"Make: \"","v":"Make: "},{"$f":"VLOOKUP(K1047,INVENTORYDATA,2,FALSE)","v":{"$error":"#N/A"}},{"$f":"\"Model: \"","v":"Model: "},{"$f":"VLOOKUP(K1047,INVENTORYDATA,3,FALSE)","v":{"$error":"#N/A"}}]
[{"$f":"\"CPU/Speed: \"","v":"CPU/Speed: "},{"$f":"VLOOKUP(E1047,INVENTORYDATA,4,FALSE)&\" / \"&VLOOKUP(E1047,INVENTORYDATA,5,FALSE)&\"GHz\"","v":{"$error":"#N/A"}},null,{"$f":"\"Memory: \"","v":"Memory: "},{"$f":"VLOOKUP(E1047,INVENTORYDATA,6,FALSE)","v":{"$error":"#N/A"}},null,{"$f":"\"CPU/Speed: \"","v":"CPU/Speed: "},{"$f":"VLOOKUP(K1047,INVENTORYDATA,4,FALSE)&\" / \"&VLOOKUP(K1047,INVENTORYDATA,5,FALSE)&\"GHz\"","v":{"$error":"#N/A"}},null,{"$f":"\"Memory: \"","v":"Memory: "},{"$f":"VLOOKUP(K1047,INVENTORYDATA,6,FALSE)","v":{"$error":"#N/A"}}]
[]
["Key Function",null,"Pass","Fail ","Comments",null,"Key Function",null,"Pass","Fail ","Comments"]
["Hard Drive Removed",null,{"$f":"IF(ISBLANK(VLOOKUP(E1047,INVENTORYDATA,13,FALSE)),\"X\",\"\")","v":""},null,{"$f":"IF(ISBLANK(VLOOKUP(E1047,INVENTORYDATA,13,FALSE)),\"\",VLOOKUP(E1047,INVENTORYDATA,13,FALSE))","v":{"$error":"#N/A"}},null,"Hard Drive Removed",null,{"$f":"IF(ISBLANK(VLOOKUP(K1047,INVENTORYDATA,13,FALSE)),\"X\",\"\")","v":""},null,{"$f":"IF(ISBLANK(VLOOKUP(K1047,INVENTORYDATA,13,FALSE)),\"\",VLOOKUP(K1047,INVENTORYDATA,13,FALSE))","v":{"$error":"#N/A"}}]
["Install Memory",null,"X",{"$nulls":3},"Install Memory",null,"X"]
["Power ON",null,"X",{"$nulls":3},"Power ON",null,"X"]
["Record BIOS info",null,"X",{"$nulls":3},"Record BIOS info",null,"X"]
["Check Optical Drive",null,{"$f":"IF((VLOOKUP(E1047,INVENTORYDATA,7,FALSE))=\"YES\",\"X\",\"\")","v":{"$error":"#N/A"}},{"$f":"IF((VLOOKUP(E1047,INVENTORYDATA,7,FALSE))=\"NO\",\"X\",\"\")","v":{"$error":"#N/A"}},null,null,"Check Optical Drive",null,{"$f":"IF((VLOOKUP(K1047,INVENTORYDATA,7,FALSE))=\"YES\",\"X\",\"\")","v":{"$error":"#N/A"}},{"$f":"IF((VLOOKUP(K1047,INVENTORYDATA,7,FALSE))=\"NO\",\"X\",\"\")","v":{"$error":"#N/A"}}]
["Power Off",null,"X",{"$nulls":3},"Power Off",null,"X"]
["HDD Serial No.",null,{"$f":"IF(ISBLANK(VLOOKUP(E1047,INVENTORYDATA,12,FALSE)),\"\",VLOOKUP(E1047,INVENTORYDATA,12,FALSE))","v":{"$error":"#N/A"}},{"$nulls":3},"HDD Serial No.",null,{"$f":"IF(ISBLANK(VLOOKUP(K1047,INVENTORYDATA,12,FALSE)),\"\",VLOOKUP(K1047,INVENTORYDATA,12,FALSE))","v":{"$error":"#N/A"}}]
[]
["Tested for key functions,R2/Ready for Resale",{"$nulls":5},"Tested for key functions,R2/Ready for Resale"]
["BIOS Lock","Caddy","Optical","WebCam","Battery",null,"BIOS Lock","Caddy","Optical","WebCam","Battery"]
[null,null,{"$f":"VLOOKUP(E1047,INVENTORY!$A$2:$N$144,7,FALSE)","v":{"$error":"#N/A"}},{"$f":"VLOOKUP(E1047,INVENTORY!$A$2:$N$144,8,FALSE)","v":{"$error":"#N/A"}},{"$f":"VLOOKUP(E1047,INVENTORY!$A$2:$N$144,9,FALSE)","v":{"$error":"#N/A"}},{"$nulls":3},{"$f":"VLOOKUP(K1047,INVENTORY!$A$2:$N$144,7,FALSE)","v":{"$error":"#N/A"}},{"$f":"VLOOKUP(K1047,INVENTORY!$A$2:$N$144,8,FALSE)","v":{"$error":"#N/A"}},{"$f":"VLOOKUP(K1047,INVENTORY!$A$2:$N$144,9,FALSE)","v":{"$error":"#N/A"}}]
[]
["CPU Cosmetics Defects:",null,{"$f":"\"Function Code: \"&VLOOKUP(E1047,INVENTORY!$A$2:$Q$144,14,FALSE)","v":{"$error":"#N/A"}},{"$nulls":3},"CPU Cosmetics Defects:",null,{"$f":"\"Function Code: \"&VLOOKUP(K1047,INVENTORY!$A$2:$Q$144,14,FALSE)","v":{"$error":"#N/A"}}]
[]
[null,null,{"$f":"\"Cosmetic Code: \"&VLOOKUP(E1047,INVENTORY!$A$2:$Q$144,15,FALSE)","v":{"$error":"#N/A"}},{"$nulls":5},{"$f":"\"Cosmetic Code: \"&VLOOKUP(K1047,INVENTORY!$A$2:$Q$144,15,FALSE)","v":{"$error":"#N/A"}}]
[]
["Casing","Plugs/Ports",{"$nulls":4},"Casing","Plugs/Ports"]
["Pass","Pass",{"$nulls":4},"Pass","Pass"]
["Fail","Fail",null,"TRRC#:L.T.R.",null,null,"Fail","Fail",null,"TRRC#:L.T.R."]
[]
["LAPTOP TESTING RECORD",{"$nulls":5},"LAPTOP TESTING RECORD"]
[]
[{"$nulls":3},"ITEM #",{"$f":"E1047+2","v":75},{"$nulls":4},"ITEM #",{"$f":"K1047+2","v":76}]
["Tester: ","RR","Date:",{"$f":"NOW()","v":"2026-01-06T11:13:00.960"},null,null,"Tester: ","RR","Date:",{"$f":"NOW()","v":"2026-01-06T11:13:00.960"}]
["Type: ","LAPTOP","SN:",{"$f":"VLOOKUP(E1076,INVENTORYDATA,10,FALSE)","v":{"$error":"#N/A"}},null,null,"Type: ","LAPTOP","SN:",{"$f":"VLOOKUP(K1076,INVENTORYDATA,10,FALSE)","v":{"$error":"#N/A"}}]
[{"$f":"\"Make: \"","v":"Make: "},{"$f":"VLOOKUP(E1076,INVENTORYDATA,2,FALSE)","v":{"$error":"#N/A"}},{"$f":"\"Model: \"","v":"Model: "},{"$f":"VLOOKUP(E1076,INVENTORYDATA,3,FALSE)","v":{"$error":"#N/A"}},null,null,{"$f":"\"Make: \"","v":"Make: "},{"$f":"VLOOKUP(K1076,INVENTORYDATA,2,FALSE)","v":{"$error":"#N/A"}},{"$f":"\"Model: \"","v":"Model: "},{"$f":"VLOOKUP(K1076,INVENTORYDATA,3,FALSE)","v":{"$error":"#N/A"}}]
[{"$f":"\"CPU/Speed: \"","v":"CPU/Speed: "},{"$f":"VLOOKUP(E1076,INVENTORYDATA,4,FALSE)&\" / \"&VLOOKUP(E1076,INVENTORYDATA,5,FALSE)&\"GHz\"","v":{"$error":"#N/A"}},null,{"$f":"\"Memory: \"","v":"Memory: "},{"$f":"VLOOKUP(E1076,INVENTORYDATA,6,FALSE)","v":{"$error":"#N/A"}},null,{"$f":"\"CPU/Speed: \"","v":"CPU/Speed: "},{"$f":"VLOOKUP(K1076,INVENTORYDATA,4,FALSE)&\" / \"&VLOOKUP(K1076,INVENTORYDATA,5,FALSE)&\"GHz\"","v":{"$error":"#N/A"}},null,{"$f":"\"Memory: \"","v":"Memory: "},{"$f":"VLOOKUP(K1076,INVENTORYDATA,6,FALSE)","v":{"$error":"#N/A"}}]
[]
["Key Function",null,"Pass","Fail ","Comments",null,"Key Function",null,"Pass","Fail ","Comments"]
["Hard Drive Removed",null,{"$f":"IF(ISBLANK(VLOOKUP(E1076,INVENTORYDATA,13,FALSE)),\"X\",\"\")","v":""},null,{"$f":"IF(ISBLANK(VLOOKUP(E1076,INVENTORYDATA,13,FALSE)),\"\",VLOOKUP(E1076,INVENTORYDATA,13,FALSE))","v":{"$error":"#N/A"}},null,"Hard Drive Removed",null,{"$f":"IF(ISBLANK(VLOOKUP(K1076,INVENTORYDATA,13,FALSE)),\"X\",\"\")","v":""},null,{"$f":"IF(ISBLANK(VLOOKUP(K1076,INVENTORYDATA,13,FALSE)),\"\",VLOOKUP(K1076,INVENTORYDATA,13,FALSE))","v":{"$error":"#N/A"}}]
["Install Memory",null,"X",{"$nulls":3},"Install Memory",null,"X"]
["Power ON",null,"X",{"$nulls":3},"Power ON",null,"X"]
["Record BIOS info",null,"X",{"$nulls":3},"Record BIOS info",null,"X"]
["Check Optical Drive",null,{"$f":"IF((VLOOKUP(E1076,INVENTORYDATA,7,FALSE))=\"YES\",\"X\",\"\")","v":{"$error":"#N/A"}},{"$f":"IF((VLOOKUP(E1076,INVENTORYDATA,7,FALSE))=\"NO\",\"X\",\"\")","v":{"$error":"#N/A"}},null,null,"Check Optical Drive",null,{"$f":"IF((VLOOKUP(K1076,INVENTORYDATA,7,FALSE))=\"YES\",\"X\",\"\")","v":{"$error":"#N/A"}},{"$f":"IF((VLOOKUP(K1076,INVENTORYDATA,7,FALSE))=\"NO\",\"X\",\"\")","v":{"$error":"#N/A"}}]
["Power Off",null,"X",{"$nulls":3},"Power Off",null,"X"]
["HDD Serial No.",null,{"$f":"IF(ISBLANK(VLOOKUP(E1076,INVENTORYDATA,12,FALSE)),\"\",VLOOKUP(E1076,INVENTORYDATA,12,FALSE))","v":{"$error":"#N/A"}},{"$nulls":3},"HDD Serial No.",null,{"$f":"IF(ISBLANK(VLOOKUP(K1076,INVENTORYDATA,12,FALSE)),\"\",VLOOKUP(K1076,INVENTORYDATA,12,FALSE))","v":{"$error":"#N/A"}}]
[]
["Tested for key functions,R2/Ready for Resale",{"$nulls":5},"Tested for key functions,R2/Ready for Resale"]
["BIOS Lock","Caddy","Optical","WebCam","Battery",null,"BIOS Lock","Caddy","Optical","WebCam","Battery"]
[null,null,{"$f":"VLOOKUP(E1076,INVENTORY!$A$2:$N$144,7,FALSE)","v":{"$error":"#N/A"}},{"$f":"VLOOKUP(E1076,INVENTORY!$A$2:$N$144,8,FALSE)","v":{"$error":"#N/A"}},{"$f":"VLOOKUP(E1076,INVENTORY!$A$2:$N$144,9,FALSE)","v":{"$error":"#N/A"}},{"$nulls":3},{"$f":"VLOOKUP(K1076,INVENTORY!$A$2:$N$144,7,FALSE)","v":{"$error":"#N/A"}},{"$f":"VLOOKUP(K1076,INVENTORY!$A$2:$N$144,8,FALSE)","v":{"$error":"#N/A"}},{"$f":"VLOOKUP(K1076,INVENTORY!$A$2:$N$144,9,FALSE)","v":{"$error":"#N/A"}}]
[]
["CPU Cosmetics Defects:",null,{"$f":"\"Function Code: \"&VLOOKUP(E1076,INVENTORY!$A$2:$Q$144,14,FALSE)","v":{"$error":"#N/A"}},{"$nulls":3},"CPU Cosmetics Defects:",null,{"$f":"\"Function Code: \"&VLOOKUP(K1076,INVENTORY!$A$2:$Q$144,14,FALSE)","v":{"$error":"#N/A"}}]
[]
[null,null,{"$f":"\"Cosmetic Code: \"&VLOOKUP(E1076,INVENTORY!$A$2:$Q$144,15,FALSE)","v":{"$error":"#N/A"}},{"$nulls":5},{"$f":"\"Cosmetic Code: \"&VLOOKUP(K1076,INVENTORY!$A$2:$Q$144,15,FALSE)","v":{"$error":"#N/A"}}]
[]
["Casing","Plugs/Ports",{"$nulls":4},"Casing","Plugs/Ports"]
["Pass","Pass",{"$nulls":4},"Pass","Pass"]
["Fail","Fail",null,"TRRC#:L.T.R.",null,null,"Fail","Fail",null,"TRRC#:L.T.R."]
[]
["LAPTOP TESTING RECORD",{"$nulls":5},"LAPTOP TESTING RECORD"]
[]
[{"$nulls":3},"ITEM #",{"$f":"E1076+2","v":77},{"$nulls":4},"ITEM #",{"$f":"K1076+2","v":78}]
["Tester: ","RR","Date:",{"$f":"NOW()","v":"2026-01-06T11:13:00.960"},null,null,"Tester: ","RR","Date:",{"$f":"NOW()","v":"2026-01-06T11:13:00.960"}]
["Type: ","LAPTOP","SN:",{"$f":"VLOOKUP(E1105,INVENTORYDATA,10,FALSE)","v":{"$error":"#N/A"}},null,null,"Type: ","LAPTOP","SN:",{"$f":"VLOOKUP(K1105,INVENTORYDATA,10,FALSE)","v":{"$error":"#N/A"}}]
[{"$f":"\"Make: \"","v":"Make: "},{"$f":"VLOOKUP(E1105,INVENTORYDATA,2,FALSE)","v":{"$error":"#N/A"}},{"$f":"\"Model: \"","v":"Model: "},{"$f":"VLOOKUP(E1105,INVENTORYDATA,3,FALSE)","v":{"$error":"#N/A"}},null,null,{"$f":"\"Make: \"","v":"Make: "},{"$f":"VLOOKUP(K1105,INVENTORYDATA,2,FALSE)","v":{"$error":"#N/A"}},{"$f":"\"Model: \"","v":"Model: "},{"$f":"VLOOKUP(K1105,INVENTORYDATA,3,FALSE)","v":{"$error":"#N/A"}}]
[{"$f":"\"CPU/Speed: \"","v":"CPU/Speed: "},{"$f":"VLOOKUP(E1105,INVENTORYDATA,4,FALSE)&\" / \"&VLOOKUP(E1105,INVENTORYDATA,5,FALSE)&\"GHz\"","v":{"$error":"#N/A"}},null,{"$f":"\"Memory: \"","v":"Memory: "},{"$f":"VLOOKUP(E1105,INVENTORYDATA,6,FALSE)","v":{"$error":"#N/A"}},null,{"$f":"\"CPU/Speed: \"","v":"CPU/Speed: "},{"$f":"VLOOKUP(K1105,INVENTORYDATA,4,FALSE)&\" / \"&VLOOKUP(K1105,INVENTORYDATA,5,FALSE)&\"GHz\"","v":{"$error":"#N/A"}},null,{"$f":"\"Memory: \"","v":"Memory: "},{"$f":"VLOOKUP(K1105,INVENTORYDATA,6,FALSE)","v":{"$error":"#N/A"}}]
[]
["Key Function",null,"Pass","Fail ","Comments",null,"Key Function",null,"Pass","Fail ","Comments"]
["Hard Drive Removed",null,{"$f":"IF(ISBLANK(VLOOKUP(E1105,INVENTORYDATA,13,FALSE)),\"X\",\"\")","v":""},null,{"$f":"IF(ISBLANK(VLOOKUP(E1105,INVENTORYDATA,13,FALSE)),\"\",VLOOKUP(E1105,INVENTORYDATA,13,FALSE))","v":{"$error":"#N/A"}},null,"Hard Drive Removed",null,{"$f":"IF(ISBLANK(VLOOKUP(K1105,INVENTORYDATA,13,FALSE)),\"X\",\"\")","v":""},null,{"$f":"IF(ISBLANK(VLOOKUP(K1105,INVENTORYDATA,13,FALSE)),\"\",VLOOKUP(K1105,INVENTORYDATA,13,FALSE))","v":{"$error":"#N/A"}}]
["Install Memory",null,"X",{"$nulls":3},"Install Memory",null,"X"]
["Power ON",null,"X",{"$nulls":3},"Power ON",null,"X"]
["Record BIOS info",null,"X",{"$nulls":3},"Record BIOS info",null,"X"]
["Check Optical Drive",null,{"$f":"IF((VLOOKUP(E1105,INVENTORYDATA,7,FALSE))=\"YES\",\"X\",\"\")","v":{"$error":"#N/A"}},{"$f":"IF((VLOOKUP(E1105,INVENTORYDATA,7,FALSE))=\"NO\",\"X\",\"\")","v":{"$error":"#N/A"}},null,null,"Check Optical Drive",null,{"$f":"IF((VLOOKUP(K1105,INVENTORYDATA,7,FALSE))=\"YES\",\"X\",\"\")","v":{"$error":"#N/A"}},{"$f":"IF((VLOOKUP(K1105,INVENTORYDATA,7,FALSE))=\"NO\",\"X\",\"\")","v":{"$error":"#N/A"}}]
["Power Off",null,"X",{"$nulls":3},"Power Off",null,"X"]
["HDD Serial No.",null,{"$f":"IF(ISBLANK(VLOOKUP(E1105,INVENTORYDATA,12,FALSE)),\"\",VLOOKUP(E1105,INVENTORYDATA,12,FALSE))","v":{"$error":"#N/A"}},{"$nulls":3},"HDD Serial No.",null,{"$f":"IF(ISBLANK(VLOOKUP(K1105,INVENTORYDATA,12,FALSE)),\"\",VLOOKUP(K1105,INVENTORYDATA,12,FALSE))","v":{"$error":"#N/A"}}]
[]
["Tested for key functions,R2/Ready for Resale",{"$nulls":5},"Tested for key functions,R2/Ready for Resale"]
["BIOS Lock","Caddy","Optical","WebCam","Battery",null,"BIOS Lock","Caddy","Optical","WebCam","Battery"]
[null,null,{"$f":"VLOOKUP(E1105,INVENTORY!$A$2:$N$144,7,FALSE)","v":{"$error":"#N/A"}},{"$f":"VLOOKUP(E1105,INVENTORY!$A$2:$N$144,8,FALSE)","v":{"$error":"#N/A"}},{"$f":"VLOOKUP(E1105,INVENTORY!$A$2:$N$144,9,FALSE)","v":{"$error":"#N/A"}},{"$nulls":3},{"$f":"VLOOKUP(K1105,INVENTORY!$A$2:$N$144,7,FALSE)","v":{"$error":"#N/A"}},{"$f":"VLOOKUP(K1105,INVENTORY!$A$2:$N$144,8,FALSE)","v":{"$error":"#N/A"}},{"$f":"VLOOKUP(K1105,INVENTORY!$A$2:$N$144,9,FALSE)","v":{"$error":"#N/A"}}]
[]
["CPU Cosmetics Defects:",null,{"$f":"\"Function Code: \"&VLOOKUP(E1105,INVENTORY!$A$2:$Q$144,14,FALSE)","v":{"$error":"#N/A"}},{"$nulls":3},"CPU Cosmetics Defects:",null,{"$f":"\"Function Code: \"&VLOOKUP(K1105,INVENTORY!$A$2:$Q$144,14,FALSE)","v":{"$error":"#N/A"}}]
[]
[null,null,{"$f":"\"Cosmetic Code: \"&VLOOKUP(E1105,INVENTORY!$A$2:$Q$144,15,FALSE)","v":{"$error":"#N/A"}},{"$nulls":5},{"$f":"\"Cosmetic Code: \"&VLOOKUP(K1105,INVENTORY!$A$2:$Q$144,15,FALSE)","v":{"$error":"#N/A"}}]
[]
["Casing","Plugs/Ports",{"$nulls":4},"Casing","Plugs/Ports"]
["Pass","Pass",{"$nulls":4},"Pass","Pass"]
["Fail","Fail",null,"TRRC#:L.T.R.",null,null,"Fail","Fail",null,"TRRC#:L.T.R."]
[]
["LAPTOP TESTING RECORD",{"$nulls":5},"LAPTOP TESTING RECORD"]
[]
[{"$nulls":3},"ITEM #",{"$f":"E1105+2","v":79},{"$nulls":4},"ITEM #",{"$f":"K1105+2","v":80}]
["Tester: ","RR","Date:",{"$f":"NOW()","v":"2026-01-06T11:13:00.960"},null,null,"Tester: ","RR","Date:",{"$f":"NOW()","v":"2026-01-06T11:13:00.960"}]
["Type: ","LAPTOP","SN:",{"$f":"VLOOKUP(E1134,INVENTORYDATA,10,FALSE)","v":{"$error":"#N/A"}},null,null,"Type: ","LAPTOP","SN:",{"$f":"VLOOKUP(K1134,INVENTORYDATA,10,FALSE)","v":{"$error":"#N/A"}}]
[{"$f":"\"Make: \"","v":"Make: "},{"$f":"VLOOKUP(E1134,INVENTORYDATA,2,FALSE)","v":{"$error":"#N/A"}},{"$f":"\"Model: \"","v":"Model: "},{"$f":"VLOOKUP(E1134,INVENTORYDATA,3,FALSE)","v":{"$error":"#N/A"}},null,null,{"$f":"\"Make: \"","v":"Make: "},{"$f":"VLOOKUP(K1134,INVENTORYDATA,2,FALSE)","v":{"$error":"#N/A"}},{"$f":"\"Model: \"","v":"Model: "},{"$f":"VLOOKUP(K1134,INVENTORYDATA,3,FALSE)","v":{"$error":"#N/A"}}]
[{"$f":"\"CPU/Speed: \"","v":"CPU/Speed: "},{"$f":"VLOOKUP(E1134,INVENTORYDATA,4,FALSE)&\" / \"&VLOOKUP(E1134,INVENTORYDATA,5,FALSE)&\"GHz\"","v":{"$error":"#N/A"}},null,{"$f":"\"Memory: \"","v":"Memory: "},{"$f":"VLOOKUP(E1134,INVENTORYDATA,6,FALSE)","v":{"$error":"#N/A"}},null,{"$f":"\"CPU/Speed: \"","v":"CPU/Speed: "},{"$f":"VLOOKUP(K1134,INVENTORYDATA,4,FALSE)&\" / \"&VLOOKUP(K1134,INVENTORYDATA,5,FALSE)&\"GHz\"","v":{"$error":"#N/A"}},null,{"$f":"\"Memory: \"","v":"Memory: "},{"$f":"VLOOKUP(K1134,INVENTORYDATA,6,FALSE)","v":{"$error":"#N/A"}}]
[]
["Key Function",null,"Pass","Fail ","Comments",null,"Key Function",null,"Pass","Fail ","Comments"]
["Hard Drive Removed",null,{"$f":"IF(ISBLANK(VLOOKUP(E1134,INVENTORYDATA,13,FALSE)),\"X\",\"\")","v":""},null,{"$f":"IF(ISBLANK(VLOOKUP(E1134,INVENTORYDATA,13,FALSE)),\"\",VLOOKUP(E1134,INVENTORYDATA,13,FALSE))","v":{"$error":"#N/A"}},null,"Hard Drive Removed",null,{"$f":"IF(ISBLANK(VLOOKUP(K1134,INVENTORYDATA,13,FALSE)),\"X\",\"\")","v":""},null,{"$f":"IF(ISBLANK(VLOOKUP(K1134,INVENTORYDATA,13,FALSE)),\"\",VLOOKUP(K1134,INVENTORYDATA,13,FALSE))","v":{"$error":"#N/A"}}]
["Install Memory",null,"X",{"$nulls":3},"Install Memory",null,"X"]
["Power ON",null,"X",{"$nulls":3},"Power ON",null,"X"]
["Record BIOS info",null,"X",{"$nulls":3},"Record BIOS info",null,"X"]
["Check Optical Drive",null,{"$f":"IF((VLOOKUP(E1134,INVENTORYDATA,7,FALSE))=\"YES\",\"X\",\"\")","v":{"$error":"#N/A"}},{"$f":"IF((VLOOKUP(E1134,INVENTORYDATA,7,FALSE))=\"NO\",\"X\",\"\")","v":{"$error":"#N/A"}},null,null,"Check Optical Drive",null,{"$f":"IF((VLOOKUP(K1134,INVENTORYDATA,7,FALSE))=\"YES\",\"X\",\"\")","v":{"$error":"#N/A"}},{"$f":"IF((VLOOKUP(K1134,INVENTORYDATA,7,FALSE))=\"NO\",\"X\",\"\")","v":{"$error":"#N/A"}}]
["Power Off",null,"X",{"$nulls":3},"Power Off",null,"X"]
["HDD Serial No.",null,{"$f":"IF(ISBLANK(VLOOKUP(E1134,INVENTORYDATA,12,FALSE)),\"\",VLOOKUP(E1134,INVENTORYDATA,12,FALSE))","v":{"$error":"#N/A"}},{"$nulls":3},"HDD Serial No.",null,{"$f":"IF(ISBLANK(VLOOKUP(K1134,INVENTORYDATA,12,FALSE)),\"\",VLOOKUP(K1134,INVENTORYDATA,12,FALSE))","v":{"$error":"#N/A"}}]
[]
["Tested for key functions,R2/Ready for Resale",{"$nulls":5},"Tested for key functions,R2/Ready for Resale"]
["BIOS Lock","Caddy","Optical","WebCam","Battery",null,"BIOS Lock","Caddy","Optical","WebCam","Battery"]
[null,null,{"$f":"VLOOKUP(E1134,INVENTORY!$A$2:$N$144,7,FALSE)","v":{"$error":"#N/A"}},{"$f":"VLOOKUP(E1134,INVENTORY!$A$2:$N$144,8,FALSE)","v":{"$error":"#N/A"}},{"$f":"VLOOKUP(E1134,INVENTORY!$A$2:$N$144,9,FALSE)","v":{"$error":"#N/A"}},{"$nulls":3},{"$f":"VLOOKUP(K1134,INVENTORY!$A$2:$N$144,7,FALSE)","v":{"$error":"#N/A"}},{"$f":"VLOOKUP(K1134,INVENTORY!$A$2:$N$144,8,FALSE)","v":{"$error":"#N/A"}},{"$f":"VLOOKUP(K1134,INVENTORY!$A$2:$N$144,9,FALSE)","v":{"$error":"#N/A"}}]
[]
["CPU Cosmetics Defects:",null,{"$f":"\"Function Code: \"&VLOOKUP(E1134,INVENTORY!$A$2:$Q$144,14,FALSE)","v":{"$error":"#N/A"}},{"$nulls":3},"CPU Cosmetics Defects:",null,{"$f":"\"Function Code: \"&VLOOKUP(K1134,INVENTORY!$A$2:$Q$144,14,FALSE)","v":{"$error":"#N/A"}}]
[]
[null,null,{"$f":"\"Cosmetic Code: \"&VLOOKUP(E1134,INVENTORY!$A$2:$Q$144,15,FALSE)","v":{"$error":"#N/A"}},{"$nulls":5},{"$f":"\"Cosmetic Code: \"&VLOOKUP(K1134,INVENTORY!$A$2:$Q$144,15,FALSE)","v":{"$error":"#N/A"}}]
[]
["Casing","Plugs/Ports",{"$nulls":4},"Casing","Plugs/Ports"]
["Pass","Pass",{"$nulls":4},"Pass","Pass"]
["Fail","Fail",null,"TRRC#:L.T.R.",null,null,"Fail","Fail",null,"TRRC#:L.T.R."]
[]
["LAPTOP TESTING RECORD",{"$nulls":5},"LAPTOP TESTING RECORD"]
[]
[{"$nulls":3},"ITEM #",{"$f":"E1134+2","v":81},{"$nulls":4},"ITEM #",{"$f":"K1134+2","v":82}]
["Tester: ","RR","Date:",{"$f":"NOW()","v":"2026-01-06T11:13:00.960"},null,null,"Tester: ","RR","Date:",{"$f":"NOW()","v":"2026-01-06T11:13:00.960"}]
["Type: ","LAPTOP","SN:",{"$f":"VLOOKUP(E1163,INVENTORYDATA,10,FALSE)","v":{"$error":"#N/A"}},null,null,"Type: ","LAPTOP","SN:",{"$f":"VLOOKUP(K1163,INVENTORYDATA,10,FALSE)","v":{"$error":"#N/A"}}]
[{"$f":"\"Make: \"","v":"Make: "},{"$f":"VLOOKUP(E1163,INVENTORYDATA,2,FALSE)","v":{"$error":"#N/A"}},{"$f":"\"Model: \"","v":"Model: "},{"$f":"VLOOKUP(E1163,INVENTORYDATA,3,FALSE)","v":{"$error":"#N/A"}},null,null,{"$f":"\"Make: \"","v":"Make: "},{"$f":"VLOOKUP(K1163,INVENTORYDATA,2,FALSE)","v":{"$error":"#N/A"}},{"$f":"\"Model: \"","v":"Model: "},{"$f":"VLOOKUP(K1163,INVENTORYDATA,3,FALSE)","v":{"$error":"#N/A"}}]
[{"$f":"\"CPU/Speed: \"","v":"CPU/Speed: "},{"$f":"VLOOKUP(E1163,INVENTORYDATA,4,FALSE)&\" / \"&VLOOKUP(E1163,INVENTORYDATA,5,FALSE)&\"GHz\"","v":{"$error":"#N/A"}},null,{"$f":"\"Memory: \"","v":"Memory: "},{"$f":"VLOOKUP(E1163,INVENTORYDATA,6,FALSE)","v":{"$error":"#N/A"}},null,{"$f":"\"CPU/Speed: \"","v":"CPU/Speed: "},{"$f":"VLOOKUP(K1163,INVENTORYDATA,4,FALSE)&\" / \"&VLOOKUP(K1163,INVENTORYDATA,5,FALSE)&\"GHz\"","v":{"$error":"#N/A"}},null,{"$f":"\"Memory: \"","v":"Memory: "},{"$f":"VLOOKUP(K1163,INVENTORYDATA,6,FALSE)","v":{"$error":"#N/A"}}]
[]
["Key Function",null,"Pass","Fail ","Comments",null,"Key Function",null,"Pass","Fail ","Comments"]
["Hard Drive Removed",null,{"$f":"IF(ISBLANK(VLOOKUP(E1163,INVENTORYDATA,13,FALSE)),\"X\",\"\")","v":""},null,{"$f":"IF(ISBLANK(VLOOKUP(E1163,INVENTORYDATA,13,FALSE)),\"\",VLOOKUP(E1163,INVENTORYDATA,13,FALSE))","v":{"$error":"#N/A"}},null,"Hard Drive Removed",null,{"$f":"IF(ISBLANK(VLOOKUP(K1163,INVENTORYDATA,13,FALSE)),\"X\",\"\")","v":""},null,{"$f":"IF(ISBLANK(VLOOKUP(K1163,INVENTORYDATA,13,FALSE)),\"\",VLOOKUP(K1163,INVENTORYDATA,13,FALSE))","v":{"$error":"#N/A"}}]
["Install Memory",null,"X",{"$nulls":3},"Install Memory",null,"X"]
["Power ON",null,"X",{"$nulls":3},"Power ON",null,"X"]
["Record BIOS info",null,"X",{"$nulls":3},"Record BIOS info",null,"X"]
["Check Optical Drive",null,{"$f":"IF((VLOOKUP(E1163,INVENTORYDATA,7,FALSE))=\"YES\",\"X\",\"\")","v":{"$error":"#N/A"}},{"$f":"IF((VLOOKUP(E1163,INVENTORYDATA,7,FALSE))=\"NO\",\"X\",\"\")","v":{"$error":"#N/A"}},null,null,"Check Optical Drive",null,{"$f":"IF((VLOOKUP(K1163,INVENTORYDATA,7,FALSE))=\"YES\",\"X\",\"\")","v":{"$error":"#N/A"}},{"$f":"IF((VLOOKUP(K1163,INVENTORYDATA,7,FALSE))=\"NO\",\"X\",\"\")","v":{"$error":"#N/A"}}]
["Power Off",null,"X",{"$nulls":3},"Power Off",null,"X"]
["HDD Serial No.",null,{"$f":"IF(ISBLANK(VLOOKUP(E1163,INVENTORYDATA,12,FALSE)),\"\",VLOOKUP(E1163,INVENTORYDATA,12,FALSE))","v":{"$error":"#N/A"}},{"$nulls":3},"HDD Serial No.",null,{"$f":"IF(ISBLANK(VLOOKUP(K1163,INVENTORYDATA,12,FALSE)),\"\",VLOOKUP(K1163,INVENTORYDATA,12,FALSE))","v":{"$error":"#N/A"}}]
[]
["Tested for key functions,R2/Ready for Resale",{"$nulls":5},"Tested for key functions,R2/Ready for Resale"]
["BIOS Lock","Caddy","Optical","WebCam","Battery",null,"BIOS Lock","Caddy","Optical","WebCam","Battery"]
[null,null,{"$f":"VLOOKUP(E1163,INVENTORY!$A$2:$N$144,7,FALSE)","v":{"$error":"#N/A"}},{"$f":"VLOOKUP(E1163,INVENTORY!$A$2:$N$144,8,FALSE)","v":{"$error":"#N/A"}},{"$f":"VLOOKUP(E1163,INVENTORY!$A$2:$N$144,9,FALSE)","v":{"$error":"#N/A"}},{"$nulls":3},{"$f":"VLOOKUP(K1163,INVENTORY!$A$2:$N$144,7,FALSE)","v":{"$error":"#N/A"}},{"$f":"VLOOKUP(K1163,INVENTORY!$A$2:$N$144,8,FALSE)","v":{"$error":"#N/A"}},{"$f":"VLOOKUP(K1163,INVENTORY!$A$2:$N$144,9,FALSE)","v":{"$error":"#N/A"}}]
[]
["CPU Cosmetics Defects:",null,{"$f":"\"Function Code: \"&VLOOKUP(E1163,INVENTORY!$A$2:$Q$144,14,FALSE)","v":{"$error":"#N/A"}},{"$nulls":3},"CPU Cosmetics Defects:",null,{"$f":"\"Function Code: \"&VLOOKUP(K1163,INVENTORY!$A$2:$Q$144,14,FALSE)","v":{"$error":"#N/A"}}]
[]
[null,null,{"$f":"\"Cosmetic Code: \"&VLOOKUP(E1163,INVENTORY!$A$2:$Q$144,15,FALSE)","v":{"$error":"#N/A"}},{"$nulls":5},{"$f":"\"Cosmetic Code: \"&VLOOKUP(K1163,INVENTORY!$A$2:$Q$144,15,FALSE)","v":{"$error":"#N/A"}}]
[]
["Casing","Plugs/Ports",{"$nulls":4},"Casing","Plugs/Ports"]
["Pass","Pass",{"$nulls":4},"Pass","Pass"]
["Fail","Fail",null,"TRRC#:L.T.R.",null,null,"Fail","Fail",null,"TRRC#:L.T.R."]
[]
["LAPTOP TESTING RECORD",{"$nulls":5},"LAPTOP TESTING RECORD"]
[]
[{"$nulls":3},"ITEM #",{"$f":"E1163+2","v":83},{"$nulls":4},"ITEM #",{"$f":"K1163+2","v":84}]
["Tester: ","RR","Date:",{"$f":"NOW()","v":"2026-01-06T11:13:00.960"},null,null,"Tester: ","RR","Date:",{"$f":"NOW()","v":"2026-01-06T11:13:00.960"}]
["Type: ","LAPTOP","SN:",{"$f":"VLOOKUP(E1192,INVENTORYDATA,10,FALSE)","v":{"$error":"#N/A"}},null,null,"Type: ","LAPTOP","SN:",{"$f":"VLOOKUP(K1192,INVENTORYDATA,10,FALSE)","v":{"$error":"#N/A"}}]
[{"$f":"\"Make: \"","v":"Make: "},{"$f":"VLOOKUP(E1192,INVENTORYDATA,2,FALSE)","v":{"$error":"#N/A"}},{"$f":"\"Model: \"","v":"Model: "},{"$f":"VLOOKUP(E1192,INVENTORYDATA,3,FALSE)","v":{"$error":"#N/A"}},null,null,{"$f":"\"Make: \"","v":"Make: "},{"$f":"VLOOKUP(K1192,INVENTORYDATA,2,FALSE)","v":{"$error":"#N/A"}},{"$f":"\"Model: \"","v":"Model: "},{"$f":"VLOOKUP(K1192,INVENTORYDATA,3,FALSE)","v":{"$error":"#N/A"}}]
[{"$f":"\"CPU/Speed: \"","v":"CPU/Speed: "},{"$f":"VLOOKUP(E1192,INVENTORYDATA,4,FALSE)&\" / \"&VLOOKUP(E1192,INVENTORYDATA,5,FALSE)&\"GHz\"","v":{"$error":"#N/A"}},null,{"$f":"\"Memory: \"","v":"Memory: "},{"$f":"VLOOKUP(E1192,INVENTORYDATA,6,FALSE)","v":{"$error":"#N/A"}},null,{"$f":"\"CPU/Speed: \"","v":"CPU/Speed: "},{"$f":"VLOOKUP(K1192,INVENTORYDATA,4,FALSE)&\" / \"&VLOOKUP(K1192,INVENTORYDATA,5,FALSE)&\"GHz\"","v":{"$error":"#N/A"}},null,{"$f":"\"Memory: \"","v":"Memory: "},{"$f":"VLOOKUP(K1192,INVENTORYDATA,6,FALSE)","v":{"$error":"#N/A"}}]
[]
["Key Function",null,"Pass","Fail ","Comments",null,"Key Function",null,"Pass","Fail ","Comments"]
["Hard Drive Removed",null,{"$f":"IF(ISBLANK(VLOOKUP(E1192,INVENTORYDATA,13,FALSE)),\"X\",\"\")","v":""},null,{"$f":"IF(ISBLANK(VLOOKUP(E1192,INVENTORYDATA,13,FALSE)),\"\",VLOOKUP(E1192,INVENTORYDATA,13,FALSE))","v":{"$error":"#N/A"}},null,"Hard Drive Removed",null,{"$f":"IF(ISBLANK(VLOOKUP(K1192,INVENTORYDATA,13,FALSE)),\"X\",\"\")","v":""},null,{"$f":"IF(ISBLANK(VLOOKUP(K1192,INVENTORYDATA,13,FALSE)),\"\",VLOOKUP(K1192,INVENTORYDATA,13,FALSE))","v":{"$error":"#N/A"}}]
["Install Memory",null,"X",{"$nulls":3},"Install Memory",null,"X"]
["Power ON",null,"X",{"$nulls":3},"Power ON",null,"X"]
["Record BIOS info",null,"X",{"$nulls":3},"Record BIOS info",null,"X"]
["Check Optical Drive",null,{"$f":"IF((VLOOKUP(E1192,INVENTORYDATA,7,FALSE))=\"YES\",\"X\",\"\")","v":{"$error":"#N/A"}},{"$f":"IF((VLOOKUP(E1192,INVENTORYDATA,7,FALSE))=\"NO\",\"X\",\"\")","v":{"$error":"#N/A"}},null,null,"Check Optical Drive",null,{"$f":"IF((VLOOKUP(K1192,INVENTORYDATA,7,FALSE))=\"YES\",\"X\",\"\")","v":{"$error":"#N/A"}},{"$f":"IF((VLOOKUP(K1192,INVENTORYDATA,7,FALSE))=\"NO\",\"X\",\"\")","v":{"$error":"#N/A"}}]
["Power Off",null,"X",{"$nulls":3},"Power Off",null,"X"]
["HDD Serial No.",null,{"$f":"IF(ISBLANK(VLOOKUP(E1192,INVENTORYDATA,12,FALSE)),\"\",VLOOKUP(E1192,INVENTORYDATA,12,FALSE))","v":{"$error":"#N/A"}},{"$nulls":3},"HDD Serial No.",null,{"$f":"IF(ISBLANK(VLOOKUP(K1192,INVENTORYDATA,12,FALSE)),\"\",VLOOKUP(K1192,INVENTORYDATA,12,FALSE))","v":{"$error":"#N/A"}}]
[]
["Tested for key functions,R2/Ready for Resale",{"$nulls":5},"Tested for key functions,R2/Ready for Resale"]
["BIOS Lock","Caddy","Optical","WebCam","Battery",null,"BIOS Lock","Caddy","Optical","WebCam","Battery"]
[null,null,{"$f":"VLOOKUP(E1192,INVENTORY!$A$2:$N$144,7,FALSE)","v":{"$error":"#N/A"}},{"$f":"VLOOKUP(E1192,INVENTORY!$A$2:$N$144,8,FALSE)","v":{"$error":"#N/A"}},{"$f":"VLOOKUP(E1192,INVENTORY!$A$2:$N$144,9,FALSE)","v":{"$error":"#N/A"}},{"$nulls":3},{"$f":"VLOOKUP(K1192,INVENTORY!$A$2:$N$144,7,FALSE)","v":{"$error":"#N/A"}},{"$f":"VLOOKUP(K1192,INVENTORY!$A$2:$N$144,8,FALSE)","v":{"$error":"#N/A"}},{"$f":"VLOOKUP(K1192,INVENTORY!$A$2:$N$144,9,FALSE)","v":{"$error":"#N/A"}}]
[]
["CPU Cosmetics Defects:",null,{"$f":"\"Function Code: \"&VLOOKUP(E1192,INVENTORY!$A$2:$Q$144,14,FALSE)","v":{"$error":"#N/A"}},{"$nulls":3},"CPU Cosmetics Defects:",null,{"$f":"\"Function Code: \"&VLOOKUP(K1192,INVENTORY!$A$2:$Q$144,14,FALSE)","v":{"$error":"#N/A"}}]
[]
[null,null,{"$f":"\"Cosmetic Code: \"&VLOOKUP(E1192,INVENTORY!$A$2:$Q$144,15,FALSE)","v":{"$error":"#N/A"}},{"$nulls":5},{"$f":"\"Cosmetic Code: \"&VLOOKUP(K1192,INVENTORY!$A$2:$Q$144,15,FALSE)","v":{"$error":"#N/A"}}]
[]
["Casing","Plugs/Ports",{"$nulls":4},"Casing","Plugs/Ports"]
["Pass","Pass",{"$nulls":4},"Pass","Pass"]
["Fail","Fail",null,"TRRC#:L.T.R.",null,null,"Fail","Fail",null,"TRRC#:L.T.R."]
[]
["LAPTOP TESTING RECORD",{"$nulls":5},"LAPTOP TESTING RECORD"]
[]
[{"$nulls":3},"ITEM #",{"$f":"E1192+2","v":85},{"$nulls":4},"ITEM #",{"$f":"K1192+2","v":86}]
["Tester: ","RR","Date:",{"$f":"NOW()","v":"2026-01-06T11:13:00.960"},null,null,"Tester: ","RR","Date:",{"$f":"NOW()","v":"2026-01-06T11:13:00.960"}]
["Type: ","LAPTOP","SN:",{"$f":"VLOOKUP(E1221,INVENTORYDATA,10,FALSE)","v":{"$error":"#N/A"}},null,null,"Type: ","LAPTOP","SN:",{"$f":"VLOOKUP(K1221,INVENTORYDATA,10,FALSE)","v":{"$error":"#N/A"}}]
[{"$f":"\"Make: \"","v":"Make: "},{"$f":"VLOOKUP(E1221,INVENTORYDATA,2,FALSE)","v":{"$error":"#N/A"}},{"$f":"\"Model: \"","v":"Model: "},{"$f":"VLOOKUP(E1221,INVENTORYDATA,3,FALSE)","v":{"$error":"#N/A"}},null,null,{"$f":"\"Make: \"","v":"Make: "},{"$f":"VLOOKUP(K1221,INVENTORYDATA,2,FALSE)","v":{"$error":"#N/A"}},{"$f":"\"Model: \"","v":"Model: "},{"$f":"VLOOKUP(K1221,INVENTORYDATA,3,FALSE)","v":{"$error":"#N/A"}}]
[{"$f":"\"CPU/Speed: \"","v":"CPU/Speed: "},{"$f":"VLOOKUP(E1221,INVENTORYDATA,4,FALSE)&\" / \"&VLOOKUP(E1221,INVENTORYDATA,5,FALSE)&\"GHz\"","v":{"$error":"#N/A"}},null,{"$f":"\"Memory: \"","v":"Memory: "},{"$f":"VLOOKUP(E1221,INVENTORYDATA,6,FALSE)","v":{"$error":"#N/A"}},null,{"$f":"\"CPU/Speed: \"","v":"CPU/Speed: "},{"$f":"VLOOKUP(K1221,INVENTORYDATA,4,FALSE)&\" / \"&VLOOKUP(K1221,INVENTORYDATA,5,FALSE)&\"GHz\"","v":{"$error":"#N/A"}},null,{"$f":"\"Memory: \"","v":"Memory: "},{"$f":"VLOOKUP(K1221,INVENTORYDATA,6,FALSE)","v":{"$error":"#N/A"}}]
[]
["Key Function",null,"Pass","Fail ","Comments",null,"Key Function",null,"Pass","Fail ","Comments"]
["Hard Drive Removed",null,{"$f":"IF(ISBLANK(VLOOKUP(E1221,INVENTORYDATA,13,FALSE)),\"X\",\"\")","v":""},null,{"$f":"IF(ISBLANK(VLOOKUP(E1221,INVENTORYDATA,13,FALSE)),\"\",VLOOKUP(E1221,INVENTORYDATA,13,FALSE))","v":{"$error":"#N/A"}},null,"Hard Drive Removed",null,{"$f":"IF(ISBLANK(VLOOKUP(K1221,INVENTORYDATA,13,FALSE)),\"X\",\"\")","v":""},null,{"$f":"IF(ISBLANK(VLOOKUP(K1221,INVENTORYDATA,13,FALSE)),\"\",VLOOKUP(K1221,INVENTORYDATA,13,FALSE))","v":{"$error":"#N/A"}}]
["Install Memory",null,"X",{"$nulls":3},"Install Memory",null,"X"]
["Power ON",null,"X",{"$nulls":3},"Power ON",null,"X"]
["Record BIOS info",null,"X",{"$nulls":3},"Record BIOS info",null,"X"]
["Check Optical Drive",null,{"$f":"IF((VLOOKUP(E1221,INVENTORYDATA,7,FALSE))=\"YES\",\"X\",\"\")","v":{"$error":"#N/A"}},{"$f":"IF((VLOOKUP(E1221,INVENTORYDATA,7,FALSE))=\"NO\",\"X\",\"\")","v":{"$error":"#N/A"}},null,null,"Check Optical Drive",null,{"$f":"IF((VLOOKUP(K1221,INVENTORYDATA,7,FALSE))=\"YES\",\"X\",\"\")","v":{"$error":"#N/A"}},{"$f":"IF((VLOOKUP(K1221,INVENTORYDATA,7,FALSE))=\"NO\",\"X\",\"\")","v":{"$error":"#N/A"}}]
["Power Off",null,"X",{"$nulls":3},"Power Off",null,"X"]
["HDD Serial No.",null,{"$f":"IF(ISBLANK(VLOOKUP(E1221,INVENTORYDATA,12,FALSE)),\"\",VLOOKUP(E1221,INVENTORYDATA,12,FALSE))","v":{"$error":"#N/A"}},{"$nulls":3},"HDD Serial No.",null,{"$f":"IF(ISBLANK(VLOOKUP(K1221,INVENTORYDATA,12,FALSE)),\"\",VLOOKUP(K1221,INVENTORYDATA,12,FALSE))","v":{"$error":"#N/A"}}]
[]
["Tested for key functions,R2/Ready for Resale",{"$nulls":5},"Tested for key functions,R2/Ready for Resale"]
["BIOS Lock","Caddy","Optical","WebCam","Battery",null,"BIOS Lock","Caddy","Optical","WebCam","Battery"]
[null,null,{"$f":"VLOOKUP(E1221,INVENTORY!$A$2:$N$144,7,FALSE)","v":{"$error":"#N/A"}},{"$f":"VLOOKUP(E1221,INVENTORY!$A$2:$N$144,8,FALSE)","v":{"$error":"#N/A"}},{"$f":"VLOOKUP(E1221,INVENTORY!$A$2:$N$144,9,FALSE)","v":{"$error":"#N/A"}},{"$nulls":3},{"$f":"VLOOKUP(K1221,INVENTORY!$A$2:$N$144,7,FALSE)","v":{"$error":"#N/A"}},{"$f":"VLOOKUP(K1221,INVENTORY!$A$2:$N$144,8,FALSE)","v":{"$error":"#N/A"}},{"$f":"VLOOKUP(K1221,INVENTORY!$A$2:$N$144,9,FALSE)","v":{"$error":"#N/A"}}]
[]
["CPU Cosmetics Defects:",null,{"$f":"\"Function Code: \"&VLOOKUP(E1221,INVENTORY!$A$2:$Q$144,14,FALSE)","v":{"$error":"#N/A"}},{"$nulls":3},"CPU Cosmetics Defects:",null,{"$f":"\"Function Code: \"&VLOOKUP(K1221,INVENTORY!$A$2:$Q$144,14,FALSE)","v":{"$error":"#N/A"}}]
[]
[null,null,{"$f":"\"Cosmetic Code: \"&VLOOKUP(E1221,INVENTORY!$A$2:$Q$144,15,FALSE)","v":{"$error":"#N/A"}},{"$nulls":5},{"$f":"\"Cosmetic Code: \"&VLOOKUP(K1221,INVENTORY!$A$2:$Q$144,15,FALSE)","v":{"$error":"#N/A"}}]
[]
["Casing","Plugs/Ports",{"$nulls":4},"Casing","Plugs/Ports"]
["Pass","Pass",{"$nulls":4},"Pass","Pass"]
["Fail","Fail",null,"TRRC#:L.T.R.",null,null,"Fail","Fail",null,"TRRC#:L.T.R."]
[]
["LAPTOP TESTING RECORD",{"$nulls":5},"LAPTOP TESTING RECORD"]
[]
[{"$nulls":3},"ITEM #",{"$f":"E1221+2","v":87},{"$nulls":4},"ITEM #",{"$f":"K1221+2","v":88}]
["Tester: ","RR","Date:",{"$f":"NOW()","v":"2026-01-06T11:13:00.960"},null,null,"Tester: ","RR","Date:",{"$f":"NOW()","v":"2026-01-06T11:13:00.960"}]
["Type: ","LAPTOP","SN:",{"$f":"VLOOKUP(E1250,INVENTORYDATA,10,FALSE)","v":{"$error":"#N/A"}},null,null,"Type: ","LAPTOP","SN:",{"$f":"VLOOKUP(K1250,INVENTORYDATA,10,FALSE)","v":{"$error":"#N/A"}}]
[{"$f":"\"Make: \"","v":"Make: "},{"$f":"VLOOKUP(E1250,INVENTORYDATA,2,FALSE)","v":{"$error":"#N/A"}},{"$f":"\"Model: \"","v":"Model: "},{"$f":"VLOOKUP(E1250,INVENTORYDATA,3,FALSE)","v":{"$error":"#N/A"}},null,null,{"$f":"\"Make: \"","v":"Make: "},{"$f":"VLOOKUP(K1250,INVENTORYDATA,2,FALSE)","v":{"$error":"#N/A"}},{"$f":"\"Model: \"","v":"Model: "},{"$f":"VLOOKUP(K1250,INVENTORYDATA,3,FALSE)","v":{"$error":"#N/A"}}]
[{"$f":"\"CPU/Speed: \"","v":"CPU/Speed: "},{"$f":"VLOOKUP(E1250,INVENTORYDATA,4,FALSE)&\" / \"&VLOOKUP(E1250,INVENTORYDATA,5,FALSE)&\"GHz\"","v":{"$error":"#N/A"}},null,{"$f":"\"Memory: \"","v":"Memory: "},{"$f":"VLOOKUP(E1250,INVENTORYDATA,6,FALSE)","v":{"$error":"#N/A"}},null,{"$f":"\"CPU/Speed: \"","v":"CPU/Speed: "},{"$f":"VLOOKUP(K1250,INVENTORYDATA,4,FALSE)&\" / \"&VLOOKUP(K1250,INVENTORYDATA,5,FALSE)&\"GHz\"","v":{"$error":"#N/A"}},null,{"$f":"\"Memory: \"","v":"Memory: "},{"$f":"VLOOKUP(K1250,INVENTORYDATA,6,FALSE)","v":{"$error":"#N/A"}}]
[]
["Key Function",null,"Pass","Fail ","Comments",null,"Key Function",null,"Pass","Fail ","Comments"]
["Hard Drive Removed",null,{"$f":"IF(ISBLANK(VLOOKUP(E1250,INVENTORYDATA,13,FALSE)),\"X\",\"\")","v":""},null,{"$f":"IF(ISBLANK(VLOOKUP(E1250,INVENTORYDATA,13,FALSE)),\"\",VLOOKUP(E1250,INVENTORYDATA,13,FALSE))","v":{"$error":"#N/A"}},null,"Hard Drive Removed",null,{"$f":"IF(ISBLANK(VLOOKUP(K1250,INVENTORYDATA,13,FALSE)),\"X\",\"\")","v":""},null,{"$f":"IF(ISBLANK(VLOOKUP(K1250,INVENTORYDATA,13,FALSE)),\"\",VLOOKUP(K1250,INVENTORYDATA,13,FALSE))","v":{"$error":"#N/A"}}]
["Install Memory",null,"X",{"$nulls":3},"Install Memory",null,"X"]
["Power ON",null,"X",{"$nulls":3},"Power ON",null,"X"]
["Record BIOS info",null,"X",{"$nulls":3},"Record BIOS info",null,"X"]
["Check Optical Drive",null,{"$f":"IF((VLOOKUP(E1250,INVENTORYDATA,7,FALSE))=\"YES\",\"X\",\"\")","v":{"$error":"#N/A"}},{"$f":"IF((VLOOKUP(E1250,INVENTORYDATA,7,FALSE))=\"NO\",\"X\",\"\")","v":{"$error":"#N/A"}},null,null,"Check Optical Drive",null,{"$f":"IF((VLOOKUP(K1250,INVENTORYDATA,7,FALSE))=\"YES\",\"X\",\"\")","v":{"$error":"#N/A"}},{"$f":"IF((VLOOKUP(K1250,INVENTORYDATA,7,FALSE))=\"NO\",\"X\",\"\")","v":{"$error":"#N/A"}}]
["Power Off",null,"X",{"$nulls":3},"Power Off",null,"X"]
["HDD Serial No.",null,{"$f":"IF(ISBLANK(VLOOKUP(E1250,INVENTORYDATA,12,FALSE)),\"\",VLOOKUP(E1250,INVENTORYDATA,12,FALSE))","v":{"$error":"#N/A"}},{"$nulls":3},"HDD Serial No.",null,{"$f":"IF(ISBLANK(VLOOKUP(K1250,INVENTORYDATA,12,FALSE)),\"\",VLOOKUP(K1250,INVENTORYDATA,12,FALSE))","v":{"$error":"#N/A"}}]
[]
["Tested for key functions,R2/Ready for Resale",{"$nulls":5},"Tested for key functions,R2/Ready for Resale"]
["BIOS Lock","Caddy","Optical","WebCam","Battery",null,"BIOS Lock","Caddy","Optical","WebCam","Battery"]
[null,null,{"$f":"VLOOKUP(E1250,INVENTORY!$A$2:$N$144,7,FALSE)","v":{"$error":"#N/A"}},{"$f":"VLOOKUP(E1250,INVENTORY!$A$2:$N$144,8,FALSE)","v":{"$error":"#N/A"}},{"$f":"VLOOKUP(E1250,INVENTORY!$A$2:$N$144,9,FALSE)","v":{"$error":"#N/A"}},{"$nulls":3},{"$f":"VLOOKUP(K1250,INVENTORY!$A$2:$N$144,7,FALSE)","v":{"$error":"#N/A"}},{"$f":"VLOOKUP(K1250,INVENTORY!$A$2:$N$144,8,FALSE)","v":{"$error":"#N/A"}},{"$f":"VLOOKUP(K1250,INVENTORY!$A$2:$N$144,9,FALSE)","v":{"$error":"#N/A"}}]
[]
["CPU Cosmetics Defects:",null,{"$f":"\"Function Code: \"&VLOOKUP(E1250,INVENTORY!$A$2:$Q$144,14,FALSE)","v":{"$error":"#N/A"}},{"$nulls":3},"CPU Cosmetics Defects:",null,{"$f":"\"Function Code: \"&VLOOKUP(K1250,INVENTORY!$A$2:$Q$144,14,FALSE)","v":{"$error":"#N/A"}}]
[]
[null,null,{"$f":"\"Cosmetic Code: \"&VLOOKUP(E1250,INVENTORY!$A$2:$Q$144,15,FALSE)","v":{"$error":"#N/A"}},{"$nulls":5},{"$f":"\"Cosmetic Code: \"&VLOOKUP(K1250,INVENTORY!$A$2:$Q$144,15,FALSE)","v":{"$error":"#N/A"}}]
[]
["Casing","Plugs/Ports",{"$nulls":4},"Casing","Plugs/Ports"]
["Pass","Pass",{"$nulls":4},"Pass","Pass"]
["Fail","Fail",null,"TRRC#:L.T.R.",null,null,"Fail","Fail",null,"TRRC#:L.T.R."]
[]
["LAPTOP TESTING RECORD",{"$nulls":5},"LAPTOP TESTING RECORD"]
[]
[{"$nulls":3},"ITEM #",{"$f":"E1250+2","v":89},{"$nulls":4},"ITEM #",{"$f":"K1250+2","v":90}]
["Tester: ","RR","Date:",{"$f":"NOW()","v":"2026-01-06T11:13:00.960"},null,null,"Tester: ","RR","Date:",{"$f":"NOW()","v":"2026-01-06T11:13:00.960"}]
["Type: ","LAPTOP","SN:",{"$f":"VLOOKUP(E1279,INVENTORYDATA,10,FALSE)","v":{"$error":"#N/A"}},null,null,"Type: ","LAPTOP","SN:",{"$f":"VLOOKUP(K1279,INVENTORYDATA,10,FALSE)","v":{"$error":"#N/A"}}]
[{"$f":"\"Make: \"","v":"Make: "},{"$f":"VLOOKUP(E1279,INVENTORYDATA,2,FALSE)","v":{"$error":"#N/A"}},{"$f":"\"Model: \"","v":"Model: "},{"$f":"VLOOKUP(E1279,INVENTORYDATA,3,FALSE)","v":{"$error":"#N/A"}},null,null,{"$f":"\"Make: \"","v":"Make: "},{"$f":"VLOOKUP(K1279,INVENTORYDATA,2,FALSE)","v":{"$error":"#N/A"}},{"$f":"\"Model: \"","v":"Model: "},{"$f":"VLOOKUP(K1279,INVENTORYDATA,3,FALSE)","v":{"$error":"#N/A"}}]
[{"$f":"\"CPU/Speed: \"","v":"CPU/Speed: "},{"$f":"VLOOKUP(E1279,INVENTORYDATA,4,FALSE)&\" / \"&VLOOKUP(E1279,INVENTORYDATA,5,FALSE)&\"GHz\"","v":{"$error":"#N/A"}},null,{"$f":"\"Memory: \"","v":"Memory: "},{"$f":"VLOOKUP(E1279,INVENTORYDATA,6,FALSE)","v":{"$error":"#N/A"}},null,{"$f":"\"CPU/Speed: \"","v":"CPU/Speed: "},{"$f":"VLOOKUP(K1279,INVENTORYDATA,4,FALSE)&\" / \"&VLOOKUP(K1279,INVENTORYDATA,5,FALSE)&\"GHz\"","v":{"$error":"#N/A"}},null,{"$f":"\"Memory: \"","v":"Memory: "},{"$f":"VLOOKUP(K1279,INVENTORYDATA,6,FALSE)","v":{"$error":"#N/A"}}]
[]
["Key Function",null,"Pass","Fail ","Comments",null,"Key Function",null,"Pass","Fail ","Comments"]
["Hard Drive Removed",null,{"$f":"IF(ISBLANK(VLOOKUP(E1279,INVENTORYDATA,13,FALSE)),\"X\",\"\")","v":""},null,{"$f":"IF(ISBLANK(VLOOKUP(E1279,INVENTORYDATA,13,FALSE)),\"\",VLOOKUP(E1279,INVENTORYDATA,13,FALSE))","v":{"$error":"#N/A"}},null,"Hard Drive Removed",null,{"$f":"IF(ISBLANK(VLOOKUP(K1279,INVENTORYDATA,13,FALSE)),\"X\",\"\")","v":""},null,{"$f":"IF(ISBLANK(VLOOKUP(K1279,INVENTORYDATA,13,FALSE)),\"\",VLOOKUP(K1279,INVENTORYDATA,13,FALSE))","v":{"$error":"#N/A"}}]
["Install Memory",null,"X",{"$nulls":3},"Install Memory",null,"X"]
["Power ON",null,"X",{"$nulls":3},"Power ON",null,"X"]
["Record BIOS info",null,"X",{"$nulls":3},"Record BIOS info",null,"X"]
["Check Optical Drive",null,{"$f":"IF((VLOOKUP(E1279,INVENTORYDATA,7,FALSE))=\"YES\",\"X\",\"\")","v":{"$error":"#N/A"}},{"$f":"IF((VLOOKUP(E1279,INVENTORYDATA,7,FALSE))=\"NO\",\"X\",\"\")","v":{"$error":"#N/A"}},null,null,"Check Optical Drive",null,{"$f":"IF((VLOOKUP(K1279,INVENTORYDATA,7,FALSE))=\"YES\",\"X\",\"\")","v":{"$error":"#N/A"}},{"$f":"IF((VLOOKUP(K1279,INVENTORYDATA,7,FALSE))=\"NO\",\"X\",\"\")","v":{"$error":"#N/A"}}]
["Power Off",null,"X",{"$nulls":3},"Power Off",null,"X"]
["HDD Serial No.",null,{"$f":"IF(ISBLANK(VLOOKUP(E1279,INVENTORYDATA,12,FALSE)),\"\",VLOOKUP(E1279,INVENTORYDATA,12,FALSE))","v":{"$error":"#N/A"}},{"$nulls":3},"HDD Serial No.",null,{"$f":"IF(ISBLANK(VLOOKUP(K1279,INVENTORYDATA,12,FALSE)),\"\",VLOOKUP(K1279,INVENTORYDATA,12,FALSE))","v":{"$error":"#N/A"}}]
[]
["Tested for key functions,R2/Ready for Resale",{"$nulls":5},"Tested for key functions,R2/Ready for Resale"]
["BIOS Lock","Caddy","Optical","WebCam","Battery",null,"BIOS Lock","Caddy","Optical","WebCam","Battery"]
[null,null,{"$f":"VLOOKUP(E1279,INVENTORY!$A$2:$N$144,7,FALSE)","v":{"$error":"#N/A"}},{"$f":"VLOOKUP(E1279,INVENTORY!$A$2:$N$144,8,FALSE)","v":{"$error":"#N/A"}},{"$f":"VLOOKUP(E1279,INVENTORY!$A$2:$N$144,9,FALSE)","v":{"$error":"#N/A"}},{"$nulls":3},{"$f":"VLOOKUP(K1279,INVENTORY!$A$2:$N$144,7,FALSE)","v":{"$error":"#N/A"}},{"$f":"VLOOKUP(K1279,INVENTORY!$A$2:$N$144,8,FALSE)","v":{"$error":"#N/A"}},{"$f":"VLOOKUP(K1279,INVENTORY!$A$2:$N$144,9,FALSE)","v":{"$error":"#N/A"}}]
[]
["CPU Cosmetics Defects:",null,{"$f":"\"Function Code: \"&VLOOKUP(E1279,INVENTORY!$A$2:$Q$144,14,FALSE)","v":{"$error":"#N/A"}},{"$nulls":3},"CPU Cosmetics Defects:",null,{"$f":"\"Function Code: \"&VLOOKUP(K1279,INVENTORY!$A$2:$Q$144,14,FALSE)","v":{"$error":"#N/A"}}]
[]
[null,null,{"$f":"\"Cosmetic Code: \"&VLOOKUP(E1279,INVENTORY!$A$2:$Q$144,15,FALSE)","v":{"$error":"#N/A"}},{"$nulls":5},{"$f":"\"Cosmetic Code: \"&VLOOKUP(K1279,INVENTORY!$A$2:$Q$144,15,FALSE)","v":{"$error":"#N/A"}}]
[]
["Casing","Plugs/Ports",{"$nulls":4},"Casing","Plugs/Ports"]
["Pass","Pass",{"$nulls":4},"Pass","Pass"]
["Fail","Fail",null,"TRRC#:L.T.R.",null,null,"Fail","Fail",null,"TRRC#:L.T.R."]
[]
["LAPTOP TESTING RECORD",{"$nulls":5},"LAPTOP TESTING RECORD"]
[]
[{"$nulls":3},"ITEM #",{"$f":"E1279+2","v":91},{"$nulls":4},"ITEM #",{"$f":"K1279+2","v":92}]
["Tester: ","RR","Date:",{"$f":"NOW()","v":"2026-01-06T11:13:00.960"},null,null,"Tester: ","RR","Date:",{"$f":"NOW()","v":"2026-01-06T11:13:00.960"}]
["Type: ","LAPTOP","SN:",{"$f":"VLOOKUP(E1308,INVENTORYDATA,10,FALSE)","v":{"$error":"#N/A"}},null,null,"Type: ","LAPTOP","SN:",{"$f":"VLOOKUP(K1308,INVENTORYDATA,10,FALSE)","v":{"$error":"#N/A"}}]
[{"$f":"\"Make: \"","v":"Make: "},{"$f":"VLOOKUP(E1308,INVENTORYDATA,2,FALSE)","v":{"$error":"#N/A"}},{"$f":"\"Model: \"","v":"Model: "},{"$f":"VLOOKUP(E1308,INVENTORYDATA,3,FALSE)","v":{"$error":"#N/A"}},null,null,{"$f":"\"Make: \"","v":"Make: "},{"$f":"VLOOKUP(K1308,INVENTORYDATA,2,FALSE)","v":{"$error":"#N/A"}},{"$f":"\"Model: \"","v":"Model: "},{"$f":"VLOOKUP(K1308,INVENTORYDATA,3,FALSE)","v":{"$error":"#N/A"}}]
[{"$f":"\"CPU/Speed: \"","v":"CPU/Speed: "},{"$f":"VLOOKUP(E1308,INVENTORYDATA,4,FALSE)&\" / \"&VLOOKUP(E1308,INVENTORYDATA,5,FALSE)&\"GHz\"","v":{"$error":"#N/A"}},null,{"$f":"\"Memory: \"","v":"Memory: "},{"$f":"VLOOKUP(E1308,INVENTORYDATA,6,FALSE)","v":{"$error":"#N/A"}},null,{"$f":"\"CPU/Speed: \"","v":"CPU/Speed: "},{"$f":"VLOOKUP(K1308,INVENTORYDATA,4,FALSE)&\" / \"&VLOOKUP(K1308,INVENTORYDATA,5,FALSE)&\"GHz\"","v":{"$error":"#N/A"}},null,{"$f":"\"Memory: \"","v":"Memory: "},{"$f":"VLOOKUP(K1308,INVENTORYDATA,6,FALSE)","v":{"$error":"#N/A"}}]
[]
["Key Function",null,"Pass","Fail ","Comments",null,"Key Function",null,"Pass","Fail ","Comments"]
["Hard Drive Removed",null,{"$f":"IF(ISBLANK(VLOOKUP(E1308,INVENTORYDATA,13,FALSE)),\"X\",\"\")","v":""},null,{"$f":"IF(ISBLANK(VLOOKUP(E1308,INVENTORYDATA,13,FALSE)),\"\",VLOOKUP(E1308,INVENTORYDATA,13,FALSE))","v":{"$error":"#N/A"}},null,"Hard Drive Removed",null,{"$f":"IF(ISBLANK(VLOOKUP(K1308,INVENTORYDATA,13,FALSE)),\"X\",\"\")","v":""},null,{"$f":"IF(ISBLANK(VLOOKUP(K1308,INVENTORYDATA,13,FALSE)),\"\",VLOOKUP(K1308,INVENTORYDATA,13,FALSE))","v":{"$error":"#N/A"}}]
["Install Memory",null,"X",{"$nulls":3},"Install Memory",null,"X"]
["Power ON",null,"X",{"$nulls":3},"Power ON",null,"X"]
["Record BIOS info",null,"X",{"$nulls":3},"Record BIOS info",null,"X"]
["Check Optical Drive",null,{"$f":"IF((VLOOKUP(E1308,INVENTORYDATA,7,FALSE))=\"YES\",\"X\",\"\")","v":{"$error":"#N/A"}},{"$f":"IF((VLOOKUP(E1308,INVENTORYDATA,7,FALSE))=\"NO\",\"X\",\"\")","v":{"$error":"#N/A"}},null,null,"Check Optical Drive",null,{"$f":"IF((VLOOKUP(K1308,INVENTORYDATA,7,FALSE))=\"YES\",\"X\",\"\")","v":{"$error":"#N/A"}},{"$f":"IF((VLOOKUP(K1308,INVENTORYDATA,7,FALSE))=\"NO\",\"X\",\"\")","v":{"$error":"#N/A"}}]
["Power Off",null,"X",{"$nulls":3},"Power Off",null,"X"]
["HDD Serial No.",null,{"$f":"IF(ISBLANK(VLOOKUP(E1308,INVENTORYDATA,12,FALSE)),\"\",VLOOKUP(E1308,INVENTORYDATA,12,FALSE))","v":{"$error":"#N/A"}},{"$nulls":3},"HDD Serial No.",null,{"$f":"IF(ISBLANK(VLOOKUP(K1308,INVENTORYDATA,12,FALSE)),\"\",VLOOKUP(K1308,INVENTORYDATA,12,FALSE))","v":{"$error":"#N/A"}}]
[]
["Tested for key functions,R2/Ready for Resale",{"$nulls":5},"Tested for key functions,R2/Ready for Resale"]
["BIOS Lock","Caddy","Optical","WebCam","Battery",null,"BIOS Lock","Caddy","Optical","WebCam","Battery"]
[null,null,{"$f":"VLOOKUP(E1308,INVENTORY!$A$2:$N$144,7,FALSE)","v":{"$error":"#N/A"}},{"$f":"VLOOKUP(E1308,INVENTORY!$A$2:$N$144,8,FALSE)","v":{"$error":"#N/A"}},{"$f":"VLOOKUP(E1308,INVENTORY!$A$2:$N$144,9,FALSE)","v":{"$error":"#N/A"}},{"$nulls":3},{"$f":"VLOOKUP(K1308,INVENTORY!$A$2:$N$144,7,FALSE)","v":{"$error":"#N/A"}},{"$f":"VLOOKUP(K1308,INVENTORY!$A$2:$N$144,8,FALSE)","v":{"$error":"#N/A"}},{"$f":"VLOOKUP(K1308,INVENTORY!$A$2:$N$144,9,FALSE)","v":{"$error":"#N/A"}}]
[]
["CPU Cosmetics Defects:",null,{"$f":"\"Function Code: \"&VLOOKUP(E1308,INVENTORY!$A$2:$Q$144,14,FALSE)","v":{"$error":"#N/A"}},{"$nulls":3},"CPU Cosmetics Defects:",null,{"$f":"\"Function Code: \"&VLOOKUP(K1308,INVENTORY!$A$2:$Q$144,14,FALSE)","v":{"$error":"#N/A"}}]
[]
[null,null,{"$f":"\"Cosmetic Code: \"&VLOOKUP(E1308,INVENTORY!$A$2:$Q$144,15,FALSE)","v":{"$error":"#N/A"}},{"$nulls":5},{"$f":"\"Cosmetic Code: \"&VLOOKUP(K1308,INVENTORY!$A$2:$Q$144,15,FALSE)","v":{"$error":"#N/A"}}]
[]
["Casing","Plugs/Ports",{"$nulls":4},"Casing","Plugs/Ports"]
["Pass","Pass",{"$nulls":4},"Pass","Pass"]
["Fail","Fail",null,"TRRC#:L.T.R.",null,null,"Fail","Fail",null,"TRRC#:L.T.R."]
[]
["LAPTOP TESTING RECORD",{"$nulls":5},"LAPTOP TESTING RECORD"]
[]
[{"$nulls":3},"ITEM #",{"$f":"E1308+2","v":93},{"$nulls":4},"ITEM #",{"$f":"K1308+2","v":94}]
["Tester: ","RR","Date:",{"$f":"NOW()","v":"2026-01-06T11:13:00.960"},null,null,"Tester: ","RR","Date:",{"$f":"NOW()","v":"2026-01-06T11:13:00.960"}]
["Type: ","LAPTOP","SN:",{"$f":"VLOOKUP(E1337,INVENTORYDATA,10,FALSE)","v":{"$error":"#N/A"}},null,null,"Type: ","LAPTOP","SN:",{"$f":"VLOOKUP(K1337,INVENTORYDATA,10,FALSE)","v":{"$error":"#N/A"}}]
[{"$f":"\"Make: \"","v":"Make: "},{"$f":"VLOOKUP(E1337,INVENTORYDATA,2,FALSE)","v":{"$error":"#N/A"}},{"$f":"\"Model: \"","v":"Model: "},{"$f":"VLOOKUP(E1337,INVENTORYDATA,3,FALSE)","v":{"$error":"#N/A"}},null,null,{"$f":"\"Make: \"","v":"Make: "},{"$f":"VLOOKUP(K1337,INVENTORYDATA,2,FALSE)","v":{"$error":"#N/A"}},{"$f":"\"Model: \"","v":"Model: "},{"$f":"VLOOKUP(K1337,INVENTORYDATA,3,FALSE)","v":{"$error":"#N/A"}}]
[{"$f":"\"CPU/Speed: \"","v":"CPU/Speed: "},{"$f":"VLOOKUP(E1337,INVENTORYDATA,4,FALSE)&\" / \"&VLOOKUP(E1337,INVENTORYDATA,5,FALSE)&\"GHz\"","v":{"$error":"#N/A"}},null,{"$f":"\"Memory: \"","v":"Memory: "},{"$f":"VLOOKUP(E1337,INVENTORYDATA,6,FALSE)","v":{"$error":"#N/A"}},null,{"$f":"\"CPU/Speed: \"","v":"CPU/Speed: "},{"$f":"VLOOKUP(K1337,INVENTORYDATA,4,FALSE)&\" / \"&VLOOKUP(K1337,INVENTORYDATA,5,FALSE)&\"GHz\"","v":{"$error":"#N/A"}},null,{"$f":"\"Memory: \"","v":"Memory: "},{"$f":"VLOOKUP(K1337,INVENTORYDATA,6,FALSE)","v":{"$error":"#N/A"}}]
[]
["Key Function",null,"Pass","Fail ","Comments",null,"Key Function",null,"Pass","Fail ","Comments"]
["Hard Drive Removed",null,{"$f":"IF(ISBLANK(VLOOKUP(E1337,INVENTORYDATA,13,FALSE)),\"X\",\"\")","v":""},null,{"$f":"IF(ISBLANK(VLOOKUP(E1337,INVENTORYDATA,13,FALSE)),\"\",VLOOKUP(E1337,INVENTORYDATA,13,FALSE))","v":{"$error":"#N/A"}},null,"Hard Drive Removed",null,{"$f":"IF(ISBLANK(VLOOKUP(K1337,INVENTORYDATA,13,FALSE)),\"X\",\"\")","v":""},null,{"$f":"IF(ISBLANK(VLOOKUP(K1337,INVENTORYDATA,13,FALSE)),\"\",VLOOKUP(K1337,INVENTORYDATA,13,FALSE))","v":{"$error":"#N/A"}}]
["Install Memory",null,"X",{"$nulls":3},"Install Memory",null,"X"]
["Power ON",null,"X",{"$nulls":3},"Power ON",null,"X"]
["Record BIOS info",null,"X",{"$nulls":3},"Record BIOS info",null,"X"]
["Check Optical Drive",null,{"$f":"IF((VLOOKUP(E1337,INVENTORYDATA,7,FALSE))=\"YES\",\"X\",\"\")","v":{"$error":"#N/A"}},{"$f":"IF((VLOOKUP(E1337,INVENTORYDATA,7,FALSE))=\"NO\",\"X\",\"\")","v":{"$error":"#N/A"}},null,null,"Check Optical Drive",null,{"$f":"IF((VLOOKUP(K1337,INVENTORYDATA,7,FALSE))=\"YES\",\"X\",\"\")","v":{"$error":"#N/A"}},{"$f":"IF((VLOOKUP(K1337,INVENTORYDATA,7,FALSE))=\"NO\",\"X\",\"\")","v":{"$error":"#N/A"}}]
["Power Off",null,"X",{"$nulls":3},"Power Off",null,"X"]
["HDD Serial No.",null,{"$f":"IF(ISBLANK(VLOOKUP(E1337,INVENTORYDATA,12,FALSE)),\"\",VLOOKUP(E1337,INVENTORYDATA,12,FALSE))","v":{"$error":"#N/A"}},{"$nulls":3},"HDD Serial No.",null,{"$f":"IF(ISBLANK(VLOOKUP(K1337,INVENTORYDATA,12,FALSE)),\"\",VLOOKUP(K1337,INVENTORYDATA,12,FALSE))","v":{"$error":"#N/A"}}]
[]
["Tested for key functions,R2/Ready for Resale",{"$nulls":5},"Tested for key functions,R2/Ready for Resale"]
["BIOS Lock","Caddy","Optical","WebCam","Battery",null,"BIOS Lock","Caddy","Optical","WebCam","Battery"]
[null,null,{"$f":"VLOOKUP(E1337,INVENTORY!$A$2:$N$144,7,FALSE)","v":{"$error":"#N/A"}},{"$f":"VLOOKUP(E1337,INVENTORY!$A$2:$N$144,8,FALSE)","v":{"$error":"#N/A"}},{"$f":"VLOOKUP(E1337,INVENTORY!$A$2:$N$144,9,FALSE)","v":{"$error":"#N/A"}},{"$nulls":3},{"$f":"VLOOKUP(K1337,INVENTORY!$A$2:$N$144,7,FALSE)","v":{"$error":"#N/A"}},{"$f":"VLOOKUP(K1337,INVENTORY!$A$2:$N$144,8,FALSE)","v":{"$error":"#N/A"}},{"$f":"VLOOKUP(K1337,INVENTORY!$A$2:$N$144,9,FALSE)","v":{"$error":"#N/A"}}]
[]
["CPU Cosmetics Defects:",null,{"$f":"\"Function Code: \"&VLOOKUP(E1337,INVENTORY!$A$2:$Q$144,14,FALSE)","v":{"$error":"#N/A"}},{"$nulls":3},"CPU Cosmetics Defects:",null,{"$f":"\"Function Code: \"&VLOOKUP(K1337,INVENTORY!$A$2:$Q$144,14,FALSE)","v":{"$error":"#N/A"}}]
[]
[null,null,{"$f":"\"Cosmetic Code: \"&VLOOKUP(E1337,INVENTORY!$A$2:$Q$144,15,FALSE)","v":{"$error":"#N/A"}},{"$nulls":5},{"$f":"\"Cosmetic Code: \"&VLOOKUP(K1337,INVENTORY!$A$2:$Q$144,15,FALSE)","v":{"$error":"#N/A"}}]
[]
["Casing","Plugs/Ports",{"$nulls":4},"Casing","Plugs/Ports"]
["Pass","Pass",{"$nulls":4},"Pass","Pass"]
["Fail","Fail",null,"TRRC#:L.T.R.",null,null,"Fail","Fail",null,"TRRC#:L.T.R."]
[]
["LAPTOP TESTING RECORD",{"$nulls":5},"LAPTOP TESTING RECORD"]
[]
[{"$nulls":3},"ITEM #",{"$f":"E1337+2","v":95},{"$nulls":4},"ITEM #",{"$f":"K1337+2","v":96}]
["Tester: ","RR","Date:",{"$f":"NOW()","v":"2026-01-06T11:13:00.960"},null,null,"Tester: ","RR","Date:",{"$f":"NOW()","v":"2026-01-06T11:13:00.960"}]
["Type: ","LAPTOP","SN:",{"$f":"VLOOKUP(E1366,INVENTORYDATA,10,FALSE)","v":{"$error":"#N/A"}},null,null,"Type: ","LAPTOP","SN:",{"$f":"VLOOKUP(K1366,INVENTORYDATA,10,FALSE)","v":{"$error":"#N/A"}}]
[{"$f":"\"Make: \"","v":"Make: "},{"$f":"VLOOKUP(E1366,INVENTORYDATA,2,FALSE)","v":{"$error":"#N/A"}},{"$f":"\"Model: \"","v":"Model: "},{"$f":"VLOOKUP(E1366,INVENTORYDATA,3,FALSE)","v":{"$error":"#N/A"}},null,null,{"$f":"\"Make: \"","v":"Make: "},{"$f":"VLOOKUP(K1366,INVENTORYDATA,2,FALSE)","v":{"$error":"#N/A"}},{"$f":"\"Model: \"","v":"Model: "},{"$f":"VLOOKUP(K1366,INVENTORYDATA,3,FALSE)","v":{"$error":"#N/A"}}]
[{"$f":"\"CPU/Speed: \"","v":"CPU/Speed: "},{"$f":"VLOOKUP(E1366,INVENTORYDATA,4,FALSE)&\" / \"&VLOOKUP(E1366,INVENTORYDATA,5,FALSE)&\"GHz\"","v":{"$error":"#N/A"}},null,{"$f":"\"Memory: \"","v":"Memory: "},{"$f":"VLOOKUP(E1366,INVENTORYDATA,6,FALSE)","v":{"$error":"#N/A"}},null,{"$f":"\"CPU/Speed: \"","v":"CPU/Speed: "},{"$f":"VLOOKUP(K1366,INVENTORYDATA,4,FALSE)&\" / \"&VLOOKUP(K1366,INVENTORYDATA,5,FALSE)&\"GHz\"","v":{"$error":"#N/A"}},null,{"$f":"\"Memory: \"","v":"Memory: "},{"$f":"VLOOKUP(K1366,INVENTORYDATA,6,FALSE)","v":{"$error":"#N/A"}}]
[]
["Key Function",null,"Pass","Fail ","Comments",null,"Key Function",null,"Pass","Fail ","Comments"]
["Hard Drive Removed",null,{"$f":"IF(ISBLANK(VLOOKUP(E1366,INVENTORYDATA,13,FALSE)),\"X\",\"\")","v":""},null,{"$f":"IF(ISBLANK(VLOOKUP(E1366,INVENTORYDATA,13,FALSE)),\"\",VLOOKUP(E1366,INVENTORYDATA,13,FALSE))","v":{"$error":"#N/A"}},null,"Hard Drive Removed",null,{"$f":"IF(ISBLANK(VLOOKUP(K1366,INVENTORYDATA,13,FALSE)),\"X\",\"\")","v":""},null,{"$f":"IF(ISBLANK(VLOOKUP(K1366,INVENTORYDATA,13,FALSE)),\"\",VLOOKUP(K1366,INVENTORYDATA,13,FALSE))","v":{"$error":"#N/A"}}]
["Install Memory",null,"X",{"$nulls":3},"Install Memory",null,"X"]
["Power ON",null,"X",{"$nulls":3},"Power ON",null,"X"]
["Record BIOS info",null,"X",{"$nulls":3},"Record BIOS info",null,"X"]
["Check Optical Drive",null,{"$f":"IF((VLOOKUP(E1366,INVENTORYDATA,7,FALSE))=\"YES\",\"X\",\"\")","v":{"$error":"#N/A"}},{"$f":"IF((VLOOKUP(E1366,INVENTORYDATA,7,FALSE))=\"NO\",\"X\",\"\")","v":{"$error":"#N/A"}},null,null,"Check Optical Drive",null,{"$f":"IF((VLOOKUP(K1366,INVENTORYDATA,7,FALSE))=\"YES\",\"X\",\"\")","v":{"$error":"#N/A"}},{"$f":"IF((VLOOKUP(K1366,INVENTORYDATA,7,FALSE))=\"NO\",\"X\",\"\")","v":{"$error":"#N/A"}}]
["Power Off",null,"X",{"$nulls":3},"Power Off",null,"X"]
["HDD Serial No.",null,{"$f":"IF(ISBLANK(VLOOKUP(E1366,INVENTORYDATA,12,FALSE)),\"\",VLOOKUP(E1366,INVENTORYDATA,12,FALSE))","v":{"$error":"#N/A"}},{"$nulls":3},"HDD Serial No.",null,{"$f":"IF(ISBLANK(VLOOKUP(K1366,INVENTORYDATA,12,FALSE)),\"\",VLOOKUP(K1366,INVENTORYDATA,12,FALSE))","v":{"$error":"#N/A"}}]
[]
["Tested for key functions,R2/Ready for Resale",{"$nulls":5},"Tested for key functions,R2/Ready for Resale"]
["BIOS Lock","Caddy","Optical","WebCam","Battery",null,"BIOS Lock","Caddy","Optical","WebCam","Battery"]
[null,null,{"$f":"VLOOKUP(E1366,INVENTORY!$A$2:$N$144,7,FALSE)","v":{"$error":"#N/A"}},{"$f":"VLOOKUP(E1366,INVENTORY!$A$2:$N$144,8,FALSE)","v":{"$error":"#N/A"}},{"$f":"VLOOKUP(E1366,INVENTORY!$A$2:$N$144,9,FALSE)","v":{"$error":"#N/A"}},{"$nulls":3},{"$f":"VLOOKUP(K1366,INVENTORY!$A$2:$N$144,7,FALSE)","v":{"$error":"#N/A"}},{"$f":"VLOOKUP(K1366,INVENTORY!$A$2:$N$144,8,FALSE)","v":{"$error":"#N/A"}},{"$f":"VLOOKUP(K1366,INVENTORY!$A$2:$N$144,9,FALSE)","v":{"$error":"#N/A"}}]
[]
["CPU Cosmetics Defects:",null,{"$f":"\"Function Code: \"&VLOOKUP(E1366,INVENTORY!$A$2:$Q$144,14,FALSE)","v":{"$error":"#N/A"}},{"$nulls":3},"CPU Cosmetics Defects:",null,{"$f":"\"Function Code: \"&VLOOKUP(K1366,INVENTORY!$A$2:$Q$144,14,FALSE)","v":{"$error":"#N/A"}}]
[]
[null,null,{"$f":"\"Cosmetic Code: \"&VLOOKUP(E1366,INVENTORY!$A$2:$Q$144,15,FALSE)","v":{"$error":"#N/A"}},{"$nulls":5},{"$f":"\"Cosmetic Code: \"&VLOOKUP(K1366,INVENTORY!$A$2:$Q$144,15,FALSE)","v":{"$error":"#N/A"}}]
[]
["Casing","Plugs/Ports",{"$nulls":4},"Casing","Plugs/Ports"]
["Pass","Pass",{"$nulls":4},"Pass","Pass"]
["Fail","Fail",null,"TRRC#:L.T.R.",null,null,"Fail","Fail",null,"TRRC#:L.T.R."]
[]
["LAPTOP TESTING RECORD",{"$nulls":5},"LAPTOP TESTING RECORD"]
[]
[{"$nulls":3},"ITEM #",{"$f":"E1366+2","v":97},{"$nulls":4},"ITEM #",{"$f":"K1366+2","v":98}]
["Tester: ","RR","Date:",{"$f":"NOW()","v":"2026-01-06T11:13:00.960"},null,null,"Tester: ","RR","Date:",{"$f":"NOW()","v":"2026-01-06T11:13:00.960"}]
["Type: ","LAPTOP","SN:",{"$f":"VLOOKUP(E1395,INVENTORYDATA,10,FALSE)","v":{"$error":"#N/A"}},null,null,"Type: ","LAPTOP","SN:",{"$f":"VLOOKUP(K1395,INVENTORYDATA,10,FALSE)","v":{"$error":"#N/A"}}]
[{"$f":"\"Make: \"","v":"Make: "},{"$f":"VLOOKUP(E1395,INVENTORYDATA,2,FALSE)","v":{"$error":"#N/A"}},{"$f":"\"Model: \"","v":"Model: "},{"$f":"VLOOKUP(E1395,INVENTORYDATA,3,FALSE)","v":{"$error":"#N/A"}},null,null,{"$f":"\"Make: \"","v":"Make: "},{"$f":"VLOOKUP(K1395,INVENTORYDATA,2,FALSE)","v":{"$error":"#N/A"}},{"$f":"\"Model: \"","v":"Model: "},{"$f":"VLOOKUP(K1395,INVENTORYDATA,3,FALSE)","v":{"$error":"#N/A"}}]
[{"$f":"\"CPU/Speed: \"","v":"CPU/Speed: "},{"$f":"VLOOKUP(E1395,INVENTORYDATA,4,FALSE)&\" / \"&VLOOKUP(E1395,INVENTORYDATA,5,FALSE)&\"GHz\"","v":{"$error":"#N/A"}},null,{"$f":"\"Memory: \"","v":"Memory: "},{"$f":"VLOOKUP(E1395,INVENTORYDATA,6,FALSE)","v":{"$error":"#N/A"}},null,{"$f":"\"CPU/Speed: \"","v":"CPU/Speed: "},{"$f":"VLOOKUP(K1395,INVENTORYDATA,4,FALSE)&\" / \"&VLOOKUP(K1395,INVENTORYDATA,5,FALSE)&\"GHz\"","v":{"$error":"#N/A"}},null,{"$f":"\"Memory: \"","v":"Memory: "},{"$f":"VLOOKUP(K1395,INVENTORYDATA,6,FALSE)","v":{"$error":"#N/A"}}]
[]
["Key Function",null,"Pass","Fail ","Comments",null,"Key Function",null,"Pass","Fail ","Comments"]
["Hard Drive Removed",null,{"$f":"IF(ISBLANK(VLOOKUP(E1395,INVENTORYDATA,13,FALSE)),\"X\",\"\")","v":""},null,{"$f":"IF(ISBLANK(VLOOKUP(E1395,INVENTORYDATA,13,FALSE)),\"\",VLOOKUP(E1395,INVENTORYDATA,13,FALSE))","v":{"$error":"#N/A"}},null,"Hard Drive Removed",null,{"$f":"IF(ISBLANK(VLOOKUP(K1395,INVENTORYDATA,13,FALSE)),\"X\",\"\")","v":""},null,{"$f":"IF(ISBLANK(VLOOKUP(K1395,INVENTORYDATA,13,FALSE)),\"\",VLOOKUP(K1395,INVENTORYDATA,13,FALSE))","v":{"$error":"#N/A"}}]
["Install Memory",null,"X",{"$nulls":3},"Install Memory",null,"X"]
["Power ON",null,"X",{"$nulls":3},"Power ON",null,"X"]
["Record BIOS info",null,"X",{"$nulls":3},"Record BIOS info",null,"X"]
["Check Optical Drive",null,{"$f":"IF((VLOOKUP(E1395,INVENTORYDATA,7,FALSE))=\"YES\",\"X\",\"\")","v":{"$error":"#N/A"}},{"$f":"IF((VLOOKUP(E1395,INVENTORYDATA,7,FALSE))=\"NO\",\"X\",\"\")","v":{"$error":"#N/A"}},null,null,"Check Optical Drive",null,{"$f":"IF((VLOOKUP(K1395,INVENTORYDATA,7,FALSE))=\"YES\",\"X\",\"\")","v":{"$error":"#N/A"}},{"$f":"IF((VLOOKUP(K1395,INVENTORYDATA,7,FALSE))=\"NO\",\"X\",\"\")","v":{"$error":"#N/A"}}]
["Power Off",null,"X",{"$nulls":3},"Power Off",null,"X"]
["HDD Serial No.",null,{"$f":"IF(ISBLANK(VLOOKUP(E1395,INVENTORYDATA,12,FALSE)),\"\",VLOOKUP(E1395,INVENTORYDATA,12,FALSE))","v":{"$error":"#N/A"}},{"$nulls":3},"HDD Serial No.",null,{"$f":"IF(ISBLANK(VLOOKUP(K1395,INVENTORYDATA,12,FALSE)),\"\",VLOOKUP(K1395,INVENTORYDATA,12,FALSE))","v":{"$error":"#N/A"}}]
[]
["Tested for key functions,R2/Ready for Resale",{"$nulls":5},"Tested for key functions,R2/Ready for Resale"]
["BIOS Lock","Caddy","Optical","WebCam","Battery",null,"BIOS Lock","Caddy","Optical","WebCam","Battery"]
[null,null,{"$f":"VLOOKUP(E1395,INVENTORY!$A$2:$N$144,7,FALSE)","v":{"$error":"#N/A"}},{"$f":"VLOOKUP(E1395,INVENTORY!$A$2:$N$144,8,FALSE)","v":{"$error":"#N/A"}},{"$f":"VLOOKUP(E1395,INVENTORY!$A$2:$N$144,9,FALSE)","v":{"$error":"#N/A"}},{"$nulls":3},{"$f":"VLOOKUP(K1395,INVENTORY!$A$2:$N$144,7,FALSE)","v":{"$error":"#N/A"}},{"$f":"VLOOKUP(K1395,INVENTORY!$A$2:$N$144,8,FALSE)","v":{"$error":"#N/A"}},{"$f":"VLOOKUP(K1395,INVENTORY!$A$2:$N$144,9,FALSE)","v":{"$error":"#N/A"}}]
[]
["CPU Cosmetics Defects:",null,{"$f":"\"Function Code: \"&VLOOKUP(E1395,INVENTORY!$A$2:$Q$144,14,FALSE)","v":{"$error":"#N/A"}},{"$nulls":3},"CPU Cosmetics Defects:",null,{"$f":"\"Function Code: \"&VLOOKUP(K1395,INVENTORY!$A$2:$Q$144,14,FALSE)","v":{"$error":"#N/A"}}]
[]
[null,null,{"$f":"\"Cosmetic Code: \"&VLOOKUP(E1395,INVENTORY!$A$2:$Q$144,15,FALSE)","v":{"$error":"#N/A"}},{"$nulls":5},{"$f":"\"Cosmetic Code: \"&VLOOKUP(K1395,INVENTORY!$A$2:$Q$144,15,FALSE)","v":{"$error":"#N/A"}}]
[]
["Casing","Plugs/Ports",{"$nulls":4},"Casing","Plugs/Ports"]
["Pass","Pass",{"$nulls":4},"Pass","Pass"]
["Fail","Fail",null,"TRRC#:L.T.R.",null,null,"Fail","Fail",null,"TRRC#:L.T.R."]
[]
["LAPTOP TESTING RECORD",{"$nulls":5},"LAPTOP TESTING RECORD"]
[]
[{"$nulls":3},"ITEM #",{"$f":"E1395+2","v":99},{"$nulls":4},"ITEM #",{"$f":"K1395+2","v":100}]
["Tester: ","RR","Date:",{"$f":"NOW()","v":"2026-01-06T11:13:00.960"},null,null,"Tester: ","RR","Date:",{"$f":"NOW()","v":"2026-01-06T11:13:00.960"}]
["Type: ","LAPTOP","SN:",{"$f":"VLOOKUP(E1424,INVENTORYDATA,10,FALSE)","v":{"$error":"#N/A"}},null,null,"Type: ","LAPTOP","SN:",{"$f":"VLOOKUP(K1424,INVENTORYDATA,10,FALSE)","v":{"$error":"#N/A"}}]
[{"$f":"\"Make: \"","v":"Make: "},{"$f":"VLOOKUP(E1424,INVENTORYDATA,2,FALSE)","v":{"$error":"#N/A"}},{"$f":"\"Model: \"","v":"Model: "},{"$f":"VLOOKUP(E1424,INVENTORYDATA,3,FALSE)","v":{"$error":"#N/A"}},null,null,{"$f":"\"Make: \"","v":"Make: "},{"$f":"VLOOKUP(K1424,INVENTORYDATA,2,FALSE)","v":{"$error":"#N/A"}},{"$f":"\"Model: \"","v":"Model: "},{"$f":"VLOOKUP(K1424,INVENTORYDATA,3,FALSE)","v":{"$error":"#N/A"}}]
[{"$f":"\"CPU/Speed: \"","v":"CPU/Speed: "},{"$f":"VLOOKUP(E1424,INVENTORYDATA,4,FALSE)&\" / \"&VLOOKUP(E1424,INVENTORYDATA,5,FALSE)&\"GHz\"","v":{"$error":"#N/A"}},null,{"$f":"\"Memory: \"","v":"Memory: "},{"$f":"VLOOKUP(E1424,INVENTORYDATA,6,FALSE)","v":{"$error":"#N/A"}},null,{"$f":"\"CPU/Speed: \"","v":"CPU/Speed: "},{"$f":"VLOOKUP(K1424,INVENTORYDATA,4,FALSE)&\" / \"&VLOOKUP(K1424,INVENTORYDATA,5,FALSE)&\"GHz\"","v":{"$error":"#N/A"}},null,{"$f":"\"Memory: \"","v":"Memory: "},{"$f":"VLOOKUP(K1424,INVENTORYDATA,6,FALSE)","v":{"$error":"#N/A"}}]
[]
["Key Function",null,"Pass","Fail ","Comments",null,"Key Function",null,"Pass","Fail ","Comments"]
["Hard Drive Removed",null,{"$f":"IF(ISBLANK(VLOOKUP(E1424,INVENTORYDATA,13,FALSE)),\"X\",\"\")","v":""},null,{"$f":"IF(ISBLANK(VLOOKUP(E1424,INVENTORYDATA,13,FALSE)),\"\",VLOOKUP(E1424,INVENTORYDATA,13,FALSE))","v":{"$error":"#N/A"}},null,"Hard Drive Removed",null,{"$f":"IF(ISBLANK(VLOOKUP(K1424,INVENTORYDATA,13,FALSE)),\"X\",\"\")","v":""},null,{"$f":"IF(ISBLANK(VLOOKUP(K1424,INVENTORYDATA,13,FALSE)),\"\",VLOOKUP(K1424,INVENTORYDATA,13,FALSE))","v":{"$error":"#N/A"}}]
["Install Memory",null,"X",{"$nulls":3},"Install Memory",null,"X"]
["Power ON",null,"X",{"$nulls":3},"Power ON",null,"X"]
["Record BIOS info",null,"X",{"$nulls":3},"Record BIOS info",null,"X"]
["Check Optical Drive",null,{"$f":"IF((VLOOKUP(E1424,INVENTORYDATA,7,FALSE))=\"YES\",\"X\",\"\")","v":{"$error":"#N/A"}},{"$f":"IF((VLOOKUP(E1424,INVENTORYDATA,7,FALSE))=\"NO\",\"X\",\"\")","v":{"$error":"#N/A"}},null,null,"Check Optical Drive",null,{"$f":"IF((VLOOKUP(K1424,INVENTORYDATA,7,FALSE))=\"YES\",\"X\",\"\")","v":{"$error":"#N/A"}},{"$f":"IF((VLOOKUP(K1424,INVENTORYDATA,7,FALSE))=\"NO\",\"X\",\"\")","v":{"$error":"#N/A"}}]
["Power Off",null,"X",{"$nulls":3},"Power Off",null,"X"]
["HDD Serial No.",null,{"$f":"IF(ISBLANK(VLOOKUP(E1424,INVENTORYDATA,12,FALSE)),\"\",VLOOKUP(E1424,INVENTORYDATA,12,FALSE))","v":{"$error":"#N/A"}},{"$nulls":3},"HDD Serial No.",null,{"$f":"IF(ISBLANK(VLOOKUP(K1424,INVENTORYDATA,12,FALSE)),\"\",VLOOKUP(K1424,INVENTORYDATA,12,FALSE))","v":{"$error":"#N/A"}}]
[]
["Tested for key functions,R2/Ready for Resale",{"$nulls":5},"Tested for key functions,R2/Ready for Resale"]
["BIOS Lock","Caddy","Optical","WebCam","Battery",null,"BIOS Lock","Caddy","Optical","WebCam","Battery"]
[null,null,{"$f":"VLOOKUP(E1424,INVENTORY!$A$2:$N$144,7,FALSE)","v":{"$error":"#N/A"}},{"$f":"VLOOKUP(E1424,INVENTORY!$A$2:$N$144,8,FALSE)","v":{"$error":"#N/A"}},{"$f":"VLOOKUP(E1424,INVENTORY!$A$2:$N$144,9,FALSE)","v":{"$error":"#N/A"}},{"$nulls":3},{"$f":"VLOOKUP(K1424,INVENTORY!$A$2:$N$144,7,FALSE)","v":{"$error":"#N/A"}},{"$f":"VLOOKUP(K1424,INVENTORY!$A$2:$N$144,8,FALSE)","v":{"$error":"#N/A"}},{"$f":"VLOOKUP(K1424,INVENTORY!$A$2:$N$144,9,FALSE)","v":{"$error":"#N/A"}}]
[]
["CPU Cosmetics Defects:",null,{"$f":"\"Function Code: \"&VLOOKUP(E1424,INVENTORY!$A$2:$Q$144,14,FALSE)","v":{"$error":"#N/A"}},{"$nulls":3},"CPU Cosmetics Defects:",null,{"$f":"\"Function Code: \"&VLOOKUP(K1424,INVENTORY!$A$2:$Q$144,14,FALSE)","v":{"$error":"#N/A"}}]
[]
[null,null,{"$f":"\"Cosmetic Code: \"&VLOOKUP(E1424,INVENTORY!$A$2:$Q$144,15,FALSE)","v":{"$error":"#N/A"}},{"$nulls":5},{"$f":"\"Cosmetic Code: \"&VLOOKUP(K1424,INVENTORY!$A$2:$Q$144,15,FALSE)","v":{"$error":"#N/A"}}]
[]
["Casing","Plugs/Ports",{"$nulls":4},"Casing","Plugs/Ports"]
["Pass","Pass",{"$nulls":4},"Pass","Pass"]
["Fail","Fail",null,"TRRC#:L.T.R.",null,null,"Fail","Fail",null,"TRRC#:L.T.R."]
[]
["LAPTOP TESTING RECORD",{"$nulls":5},"LAPTOP TESTING RECORD"]
[]
[{"$nulls":3},"ITEM #",{"$f":"E1424+2","v":101},{"$nulls":4},"ITEM #",{"$f":"K1424+2","v":102}]
["Tester: ","RR","Date:",{"$f":"NOW()","v":"2026-01-06T11:13:00.960"},null,null,"Tester: ","RR","Date:",{"$f":"NOW()","v":"2026-01-06T11:13:00.960"}]
["Type: ","LAPTOP","SN:",{"$f":"VLOOKUP(E1453,INVENTORYDATA,10,FALSE)","v":{"$error":"#N/A"}},null,null,"Type: ","LAPTOP","SN:",{"$f":"VLOOKUP(K1453,INVENTORYDATA,10,FALSE)","v":{"$error":"#N/A"}}]
[{"$f":"\"Make: \"","v":"Make: "},{"$f":"VLOOKUP(E1453,INVENTORYDATA,2,FALSE)","v":{"$error":"#N/A"}},{"$f":"\"Model: \"","v":"Model: "},{"$f":"VLOOKUP(E1453,INVENTORYDATA,3,FALSE)","v":{"$error":"#N/A"}},null,null,{"$f":"\"Make: \"","v":"Make: "},{"$f":"VLOOKUP(K1453,INVENTORYDATA,2,FALSE)","v":{"$error":"#N/A"}},{"$f":"\"Model: \"","v":"Model: "},{"$f":"VLOOKUP(K1453,INVENTORYDATA,3,FALSE)","v":{"$error":"#N/A"}}]
[{"$f":"\"CPU/Speed: \"","v":"CPU/Speed: "},{"$f":"VLOOKUP(E1453,INVENTORYDATA,4,FALSE)&\" / \"&VLOOKUP(E1453,INVENTORYDATA,5,FALSE)&\"GHz\"","v":{"$error":"#N/A"}},null,{"$f":"\"Memory: \"","v":"Memory: "},{"$f":"VLOOKUP(E1453,INVENTORYDATA,6,FALSE)","v":{"$error":"#N/A"}},null,{"$f":"\"CPU/Speed: \"","v":"CPU/Speed: "},{"$f":"VLOOKUP(K1453,INVENTORYDATA,4,FALSE)&\" / \"&VLOOKUP(K1453,INVENTORYDATA,5,FALSE)&\"GHz\"","v":{"$error":"#N/A"}},null,{"$f":"\"Memory: \"","v":"Memory: "},{"$f":"VLOOKUP(K1453,INVENTORYDATA,6,FALSE)","v":{"$error":"#N/A"}}]
[]
["Key Function",null,"Pass","Fail ","Comments",null,"Key Function",null,"Pass","Fail ","Comments"]
["Hard Drive Removed",null,{"$f":"IF(ISBLANK(VLOOKUP(E1453,INVENTORYDATA,13,FALSE)),\"X\",\"\")","v":""},null,{"$f":"IF(ISBLANK(VLOOKUP(E1453,INVENTORYDATA,13,FALSE)),\"\",VLOOKUP(E1453,INVENTORYDATA,13,FALSE))","v":{"$error":"#N/A"}},null,"Hard Drive Removed",null,{"$f":"IF(ISBLANK(VLOOKUP(K1453,INVENTORYDATA,13,FALSE)),\"X\",\"\")","v":""},null,{"$f":"IF(ISBLANK(VLOOKUP(K1453,INVENTORYDATA,13,FALSE)),\"\",VLOOKUP(K1453,INVENTORYDATA,13,FALSE))","v":{"$error":"#N/A"}}]
["Install Memory",null,"X",{"$nulls":3},"Install Memory",null,"X"]
["Power ON",null,"X",{"$nulls":3},"Power ON",null,"X"]
["Record BIOS info",null,"X",{"$nulls":3},"Record BIOS info",null,"X"]
["Check Optical Drive",null,{"$f":"IF((VLOOKUP(E1453,INVENTORYDATA,7,FALSE))=\"YES\",\"X\",\"\")","v":{"$error":"#N/A"}},{"$f":"IF((VLOOKUP(E1453,INVENTORYDATA,7,FALSE))=\"NO\",\"X\",\"\")","v":{"$error":"#N/A"}},null,null,"Check Optical Drive",null,{"$f":"IF((VLOOKUP(K1453,INVENTORYDATA,7,FALSE))=\"YES\",\"X\",\"\")","v":{"$error":"#N/A"}},{"$f":"IF((VLOOKUP(K1453,INVENTORYDATA,7,FALSE))=\"NO\",\"X\",\"\")","v":{"$error":"#N/A"}}]
["Power Off",null,"X",{"$nulls":3},"Power Off",null,"X"]
["HDD Serial No.",null,{"$f":"IF(ISBLANK(VLOOKUP(E1453,INVENTORYDATA,12,FALSE)),\"\",VLOOKUP(E1453,INVENTORYDATA,12,FALSE))","v":{"$error":"#N/A"}},{"$nulls":3},"HDD Serial No.",null,{"$f":"IF(ISBLANK(VLOOKUP(K1453,INVENTORYDATA,12,FALSE)),\"\",VLOOKUP(K1453,INVENTORYDATA,12,FALSE))","v":{"$error":"#N/A"}}]
[]
["Tested for key functions,R2/Ready for Resale",{"$nulls":5},"Tested for key functions,R2/Ready for Resale"]
["BIOS Lock","Caddy","Optical","WebCam","Battery",null,"BIOS Lock","Caddy","Optical","WebCam","Battery"]
[null,null,{"$f":"VLOOKUP(E1453,INVENTORY!$A$2:$N$144,7,FALSE)","v":{"$error":"#N/A"}},{"$f":"VLOOKUP(E1453,INVENTORY!$A$2:$N$144,8,FALSE)","v":{"$error":"#N/A"}},{"$f":"VLOOKUP(E1453,INVENTORY!$A$2:$N$144,9,FALSE)","v":{"$error":"#N/A"}},{"$nulls":3},{"$f":"VLOOKUP(K1453,INVENTORY!$A$2:$N$144,7,FALSE)","v":{"$error":"#N/A"}},{"$f":"VLOOKUP(K1453,INVENTORY!$A$2:$N$144,8,FALSE)","v":{"$error":"#N/A"}},{"$f":"VLOOKUP(K1453,INVENTORY!$A$2:$N$144,9,FALSE)","v":{"$error":"#N/A"}}]
[]
["CPU Cosmetics Defects:",null,{"$f":"\"Function Code: \"&VLOOKUP(E1453,INVENTORY!$A$2:$Q$144,14,FALSE)","v":{"$error":"#N/A"}},{"$nulls":3},"CPU Cosmetics Defects:",null,{"$f":"\"Function Code: \"&VLOOKUP(K1453,INVENTORY!$A$2:$Q$144,14,FALSE)","v":{"$error":"#N/A"}}]
[]
[null,null,{"$f":"\"Cosmetic Code: \"&VLOOKUP(E1453,INVENTORY!$A$2:$Q$144,15,FALSE)","v":{"$error":"#N/A"}},{"$nulls":5},{"$f":"\"Cosmetic Code: \"&VLOOKUP(K1453,INVENTORY!$A$2:$Q$144,15,FALSE)","v":{"$error":"#N/A"}}]
[]
["Casing","Plugs/Ports",{"$nulls":4},"Casing","Plugs/Ports"]
["Pass","Pass",{"$nulls":4},"Pass","Pass"]
["Fail","Fail",null,"TRRC#:L.T.R.",null,null,"Fail","Fail",null,"TRRC#:L.T.R."]
[]
["LAPTOP TESTING RECORD",{"$nulls":5},"LAPTOP TESTING RECORD"]
[]
[{"$nulls":3},"ITEM #",{"$f":"E1453+2","v":103},{"$nulls":4},"ITEM #",{"$f":"K1453+2","v":104}]
["Tester: ","RR","Date:",{"$f":"NOW()","v":"2026-01-06T11:13:00.960"},null,null,"Tester: ","RR","Date:",{"$f":"NOW()","v":"2026-01-06T11:13:00.960"}]
["Type: ","LAPTOP","SN:",{"$f":"VLOOKUP(E1482,INVENTORYDATA,10,FALSE)","v":{"$error":"#N/A"}},null,null,"Type: ","LAPTOP","SN:",{"$f":"VLOOKUP(K1482,INVENTORYDATA,10,FALSE)","v":{"$error":"#N/A"}}]
[{"$f":"\"Make: \"","v":"Make: "},{"$f":"VLOOKUP(E1482,INVENTORYDATA,2,FALSE)","v":{"$error":"#N/A"}},{"$f":"\"Model: \"","v":"Model: "},{"$f":"VLOOKUP(E1482,INVENTORYDATA,3,FALSE)","v":{"$error":"#N/A"}},null,null,{"$f":"\"Make: \"","v":"Make: "},{"$f":"VLOOKUP(K1482,INVENTORYDATA,2,FALSE)","v":{"$error":"#N/A"}},{"$f":"\"Model: \"","v":"Model: "},{"$f":"VLOOKUP(K1482,INVENTORYDATA,3,FALSE)","v":{"$error":"#N/A"}}]
[{"$f":"\"CPU/Speed: \"","v":"CPU/Speed: "},{"$f":"VLOOKUP(E1482,INVENTORYDATA,4,FALSE)&\" / \"&VLOOKUP(E1482,INVENTORYDATA,5,FALSE)&\"GHz\"","v":{"$error":"#N/A"}},null,{"$f":"\"Memory: \"","v":"Memory: "},{"$f":"VLOOKUP(E1482,INVENTORYDATA,6,FALSE)","v":{"$error":"#N/A"}},null,{"$f":"\"CPU/Speed: \"","v":"CPU/Speed: "},{"$f":"VLOOKUP(K1482,INVENTORYDATA,4,FALSE)&\" / \"&VLOOKUP(K1482,INVENTORYDATA,5,FALSE)&\"GHz\"","v":{"$error":"#N/A"}},null,{"$f":"\"Memory: \"","v":"Memory: "},{"$f":"VLOOKUP(K1482,INVENTORYDATA,6,FALSE)","v":{"$error":"#N/A"}}]
[]
["Key Function",null,"Pass","Fail ","Comments",null,"Key Function",null,"Pass","Fail ","Comments"]
["Hard Drive Removed",null,{"$f":"IF(ISBLANK(VLOOKUP(E1482,INVENTORYDATA,13,FALSE)),\"X\",\"\")","v":""},null,{"$f":"IF(ISBLANK(VLOOKUP(E1482,INVENTORYDATA,13,FALSE)),\"\",VLOOKUP(E1482,INVENTORYDATA,13,FALSE))","v":{"$error":"#N/A"}},null,"Hard Drive Removed",null,{"$f":"IF(ISBLANK(VLOOKUP(K1482,INVENTORYDATA,13,FALSE)),\"X\",\"\")","v":""},null,{"$f":"IF(ISBLANK(VLOOKUP(K1482,INVENTORYDATA,13,FALSE)),\"\",VLOOKUP(K1482,INVENTORYDATA,13,FALSE))","v":{"$error":"#N/A"}}]
["Install Memory",null,"X",{"$nulls":3},"Install Memory",null,"X"]
["Power ON",null,"X",{"$nulls":3},"Power ON",null,"X"]
["Record BIOS info",null,"X",{"$nulls":3},"Record BIOS info",null,"X"]
["Check Optical Drive",null,{"$f":"IF((VLOOKUP(E1482,INVENTORYDATA,7,FALSE))=\"YES\",\"X\",\"\")","v":{"$error":"#N/A"}},{"$f":"IF((VLOOKUP(E1482,INVENTORYDATA,7,FALSE))=\"NO\",\"X\",\"\")","v":{"$error":"#N/A"}},null,null,"Check Optical Drive",null,{"$f":"IF((VLOOKUP(K1482,INVENTORYDATA,7,FALSE))=\"YES\",\"X\",\"\")","v":{"$error":"#N/A"}},{"$f":"IF((VLOOKUP(K1482,INVENTORYDATA,7,FALSE))=\"NO\",\"X\",\"\")","v":{"$error":"#N/A"}}]
["Power Off",null,"X",{"$nulls":3},"Power Off",null,"X"]
["HDD Serial No.",null,{"$f":"IF(ISBLANK(VLOOKUP(E1482,INVENTORYDATA,12,FALSE)),\"\",VLOOKUP(E1482,INVENTORYDATA,12,FALSE))","v":{"$error":"#N/A"}},{"$nulls":3},"HDD Serial No.",null,{"$f":"IF(ISBLANK(VLOOKUP(K1482,INVENTORYDATA,12,FALSE)),\"\",VLOOKUP(K1482,INVENTORYDATA,12,FALSE))","v":{"$error":"#N/A"}}]
[]
["Tested for key functions,R2/Ready for Resale",{"$nulls":5},"Tested for key functions,R2/Ready for Resale"]
["BIOS Lock","Caddy","Optical","WebCam","Battery",null,"BIOS Lock","Caddy","Optical","WebCam","Battery"]
[null,null,{"$f":"VLOOKUP(E1482,INVENTORY!$A$2:$N$144,7,FALSE)","v":{"$error":"#N/A"}},{"$f":"VLOOKUP(E1482,INVENTORY!$A$2:$N$144,8,FALSE)","v":{"$error":"#N/A"}},{"$f":"VLOOKUP(E1482,INVENTORY!$A$2:$N$144,9,FALSE)","v":{"$error":"#N/A"}},{"$nulls":3},{"$f":"VLOOKUP(K1482,INVENTORY!$A$2:$N$144,7,FALSE)","v":{"$error":"#N/A"}},{"$f":"VLOOKUP(K1482,INVENTORY!$A$2:$N$144,8,FALSE)","v":{"$error":"#N/A"}},{"$f":"VLOOKUP(K1482,INVENTORY!$A$2:$N$144,9,FALSE)","v":{"$error":"#N/A"}}]
[]
["CPU Cosmetics Defects:",null,{"$f":"\"Function Code: \"&VLOOKUP(E1482,INVENTORY!$A$2:$Q$144,14,FALSE)","v":{"$error":"#N/A"}},{"$nulls":3},"CPU Cosmetics Defects:",null,{"$f":"\"Function Code: \"&VLOOKUP(K1482,INVENTORY!$A$2:$Q$144,14,FALSE)","v":{"$error":"#N/A"}}]
[]
[null,null,{"$f":"\"Cosmetic Code: \"&VLOOKUP(E1482,INVENTORY!$A$2:$Q$144,15,FALSE)","v":{"$error":"#N/A"}},{"$nulls":5},{"$f":"\"Cosmetic Code: \"&VLOOKUP(K1482,INVENTORY!$A$2:$Q$144,15,FALSE)","v":{"$error":"#N/A"}}]
[]
["Casing","Plugs/Ports",{"$nulls":4},"Casing","Plugs/Ports"]
["Pass","Pass",{"$nulls":4},"Pass","Pass"]
["Fail","Fail",null,"TRRC#:L.T.R.",null,null,"Fail","Fail",null,"TRRC#:L.T.R."]
[]
["LAPTOP TESTING RECORD",{"$nulls":5},"LAPTOP TESTING RECORD"]
[]
[{"$nulls":3},"ITEM #",{"$f":"E1482+2","v":105},{"$nulls":4},"ITEM #",{"$f":"K1482+2","v":106}]
["Tester: ","RR","Date:",{"$f":"NOW()","v":"2026-01-06T11:13:00.960"},null,null,"Tester: ","RR","Date:",{"$f":"NOW()","v":"2026-01-06T11:13:00.960"}]
["Type: ","LAPTOP","SN:",{"$f":"VLOOKUP(E1511,INVENTORYDATA,10,FALSE)","v":{"$error":"#N/A"}},null,null,"Type: ","LAPTOP","SN:",{"$f":"VLOOKUP(K1511,INVENTORYDATA,10,FALSE)","v":{"$error":"#N/A"}}]
[{"$f":"\"Make: \"","v":"Make: "},{"$f":"VLOOKUP(E1511,INVENTORYDATA,2,FALSE)","v":{"$error":"#N/A"}},{"$f":"\"Model: \"","v":"Model: "},{"$f":"VLOOKUP(E1511,INVENTORYDATA,3,FALSE)","v":{"$error":"#N/A"}},null,null,{"$f":"\"Make: \"","v":"Make: "},{"$f":"VLOOKUP(K1511,INVENTORYDATA,2,FALSE)","v":{"$error":"#N/A"}},{"$f":"\"Model: \"","v":"Model: "},{"$f":"VLOOKUP(K1511,INVENTORYDATA,3,FALSE)","v":{"$error":"#N/A"}}]
[{"$f":"\"CPU/Speed: \"","v":"CPU/Speed: "},{"$f":"VLOOKUP(E1511,INVENTORYDATA,4,FALSE)&\" / \"&VLOOKUP(E1511,INVENTORYDATA,5,FALSE)&\"GHz\"","v":{"$error":"#N/A"}},null,{"$f":"\"Memory: \"","v":"Memory: "},{"$f":"VLOOKUP(E1511,INVENTORYDATA,6,FALSE)","v":{"$error":"#N/A"}},null,{"$f":"\"CPU/Speed: \"","v":"CPU/Speed: "},{"$f":"VLOOKUP(K1511,INVENTORYDATA,4,FALSE)&\" / \"&VLOOKUP(K1511,INVENTORYDATA,5,FALSE)&\"GHz\"","v":{"$error":"#N/A"}},null,{"$f":"\"Memory: \"","v":"Memory: "},{"$f":"VLOOKUP(K1511,INVENTORYDATA,6,FALSE)","v":{"$error":"#N/A"}}]
[]
["Key Function",null,"Pass","Fail ","Comments",null,"Key Function",null,"Pass","Fail ","Comments"]
["Hard Drive Removed",null,{"$f":"IF(ISBLANK(VLOOKUP(E1511,INVENTORYDATA,13,FALSE)),\"X\",\"\")","v":""},null,{"$f":"IF(ISBLANK(VLOOKUP(E1511,INVENTORYDATA,13,FALSE)),\"\",VLOOKUP(E1511,INVENTORYDATA,13,FALSE))","v":{"$error":"#N/A"}},null,"Hard Drive Removed",null,{"$f":"IF(ISBLANK(VLOOKUP(K1511,INVENTORYDATA,13,FALSE)),\"X\",\"\")","v":""},null,{"$f":"IF(ISBLANK(VLOOKUP(K1511,INVENTORYDATA,13,FALSE)),\"\",VLOOKUP(K1511,INVENTORYDATA,13,FALSE))","v":{"$error":"#N/A"}}]
["Install Memory",null,"X",{"$nulls":3},"Install Memory",null,"X"]
["Power ON",null,"X",{"$nulls":3},"Power ON",null,"X"]
["Record BIOS info",null,"X",{"$nulls":3},"Record BIOS info",null,"X"]
["Check Optical Drive",null,{"$f":"IF((VLOOKUP(E1511,INVENTORYDATA,7,FALSE))=\"YES\",\"X\",\"\")","v":{"$error":"#N/A"}},{"$f":"IF((VLOOKUP(E1511,INVENTORYDATA,7,FALSE))=\"NO\",\"X\",\"\")","v":{"$error":"#N/A"}},null,null,"Check Optical Drive",null,{"$f":"IF((VLOOKUP(K1511,INVENTORYDATA,7,FALSE))=\"YES\",\"X\",\"\")","v":{"$error":"#N/A"}},{"$f":"IF((VLOOKUP(K1511,INVENTORYDATA,7,FALSE))=\"NO\",\"X\",\"\")","v":{"$error":"#N/A"}}]
["Power Off",null,"X",{"$nulls":3},"Power Off",null,"X"]
["HDD Serial No.",null,{"$f":"IF(ISBLANK(VLOOKUP(E1511,INVENTORYDATA,12,FALSE)),\"\",VLOOKUP(E1511,INVENTORYDATA,12,FALSE))","v":{"$error":"#N/A"}},{"$nulls":3},"HDD Serial No.",null,{"$f":"IF(ISBLANK(VLOOKUP(K1511,INVENTORYDATA,12,FALSE)),\"\",VLOOKUP(K1511,INVENTORYDATA,12,FALSE))","v":{"$error":"#N/A"}}]
[]
["Tested for key functions,R2/Ready for Resale",{"$nulls":5},"Tested for key functions,R2/Ready for Resale"]
["BIOS Lock","Caddy","Optical","WebCam","Battery",null,"BIOS Lock","Caddy","Optical","WebCam","Battery"]
[null,null,{"$f":"VLOOKUP(E1511,INVENTORY!$A$2:$N$144,7,FALSE)","v":{"$error":"#N/A"}},{"$f":"VLOOKUP(E1511,INVENTORY!$A$2:$N$144,8,FALSE)","v":{"$error":"#N/A"}},{"$f":"VLOOKUP(E1511,INVENTORY!$A$2:$N$144,9,FALSE)","v":{"$error":"#N/A"}},{"$nulls":3},{"$f":"VLOOKUP(K1511,INVENTORY!$A$2:$N$144,7,FALSE)","v":{"$error":"#N/A"}},{"$f":"VLOOKUP(K1511,INVENTORY!$A$2:$N$144,8,FALSE)","v":{"$error":"#N/A"}},{"$f":"VLOOKUP(K1511,INVENTORY!$A$2:$N$144,9,FALSE)","v":{"$error":"#N/A"}}]
[]
["CPU Cosmetics Defects:",null,{"$f":"\"Function Code: \"&VLOOKUP(E1511,INVENTORY!$A$2:$Q$144,14,FALSE)","v":{"$error":"#N/A"}},{"$nulls":3},"CPU Cosmetics Defects:",null,{"$f":"\"Function Code: \"&VLOOKUP(K1511,INVENTORY!$A$2:$Q$144,14,FALSE)","v":{"$error":"#N/A"}}]
[]
[null,null,{"$f":"\"Cosmetic Code: \"&VLOOKUP(E1511,INVENTORY!$A$2:$Q$144,15,FALSE)","v":{"$error":"#N/A"}},{"$nulls":5},{"$f":"\"Cosmetic Code: \"&VLOOKUP(K1511,INVENTORY!$A$2:$Q$144,15,FALSE)","v":{"$error":"#N/A"}}]
[]
["Casing","Plugs/Ports",{"$nulls":4},"Casing","Plugs/Ports"]
["Pass","Pass",{"$nulls":4},"Pass","Pass"]
["Fail","Fail",null,"TRRC#:L.T.R.",null,null,"Fail","Fail",null,"TRRC#:L.T.R."]
[]
["LAPTOP TESTING RECORD",{"$nulls":5},"LAPTOP TESTING RECORD"]
[]
[{"$nulls":3},"ITEM #",{"$f":"E1511+2","v":107},{"$nulls":4},"ITEM #",{"$f":"K1511+2","v":108}]
["Tester: ","RR","Date:",{"$f":"NOW()","v":"2026-01-06T11:13:00.960"},null,null,"Tester: ","RR","Date:",{"$f":"NOW()","v":"2026-01-06T11:13:00.960"}]
["Type: ","LAPTOP","SN:",{"$f":"VLOOKUP(E1540,INVENTORYDATA,10,FALSE)","v":{"$error":"#N/A"}},null,null,"Type: ","LAPTOP","SN:",{"$f":"VLOOKUP(K1540,INVENTORYDATA,10,FALSE)","v":{"$error":"#N/A"}}]
[{"$f":"\"Make: \"","v":"Make: "},{"$f":"VLOOKUP(E1540,INVENTORYDATA,2,FALSE)","v":{"$error":"#N/A"}},{"$f":"\"Model: \"","v":"Model: "},{"$f":"VLOOKUP(E1540,INVENTORYDATA,3,FALSE)","v":{"$error":"#N/A"}},null,null,{"$f":"\"Make: \"","v":"Make: "},{"$f":"VLOOKUP(K1540,INVENTORYDATA,2,FALSE)","v":{"$error":"#N/A"}},{"$f":"\"Model: \"","v":"Model: "},{"$f":"VLOOKUP(K1540,INVENTORYDATA,3,FALSE)","v":{"$error":"#N/A"}}]
[{"$f":"\"CPU/Speed: \"","v":"CPU/Speed: "},{"$f":"VLOOKUP(E1540,INVENTORYDATA,4,FALSE)&\" / \"&VLOOKUP(E1540,INVENTORYDATA,5,FALSE)&\"GHz\"","v":{"$error":"#N/A"}},null,{"$f":"\"Memory: \"","v":"Memory: "},{"$f":"VLOOKUP(E1540,INVENTORYDATA,6,FALSE)","v":{"$error":"#N/A"}},null,{"$f":"\"CPU/Speed: \"","v":"CPU/Speed: "},{"$f":"VLOOKUP(K1540,INVENTORYDATA,4,FALSE)&\" / \"&VLOOKUP(K1540,INVENTORYDATA,5,FALSE)&\"GHz\"","v":{"$error":"#N/A"}},null,{"$f":"\"Memory: \"","v":"Memory: "},{"$f":"VLOOKUP(K1540,INVENTORYDATA,6,FALSE)","v":{"$error":"#N/A"}}]
[]
["Key Function",null,"Pass","Fail ","Comments",null,"Key Function",null,"Pass","Fail ","Comments"]
["Hard Drive Removed",null,{"$f":"IF(ISBLANK(VLOOKUP(E1540,INVENTORYDATA,13,FALSE)),\"X\",\"\")","v":""},null,{"$f":"IF(ISBLANK(VLOOKUP(E1540,INVENTORYDATA,13,FALSE)),\"\",VLOOKUP(E1540,INVENTORYDATA,13,FALSE))","v":{"$error":"#N/A"}},null,"Hard Drive Removed",null,{"$f":"IF(ISBLANK(VLOOKUP(K1540,INVENTORYDATA,13,FALSE)),\"X\",\"\")","v":""},null,{"$f":"IF(ISBLANK(VLOOKUP(K1540,INVENTORYDATA,13,FALSE)),\"\",VLOOKUP(K1540,INVENTORYDATA,13,FALSE))","v":{"$error":"#N/A"}}]
["Install Memory",null,"X",{"$nulls":3},"Install Memory",null,"X"]
["Power ON",null,"X",{"$nulls":3},"Power ON",null,"X"]
["Record BIOS info",null,"X",{"$nulls":3},"Record BIOS info",null,"X"]
["Check Optical Drive",null,{"$f":"IF((VLOOKUP(E1540,INVENTORYDATA,7,FALSE))=\"YES\",\"X\",\"\")","v":{"$error":"#N/A"}},{"$f":"IF((VLOOKUP(E1540,INVENTORYDATA,7,FALSE))=\"NO\",\"X\",\"\")","v":{"$error":"#N/A"}},null,null,"Check Optical Drive",null,{"$f":"IF((VLOOKUP(K1540,INVENTORYDATA,7,FALSE))=\"YES\",\"X\",\"\")","v":{"$error":"#N/A"}},{"$f":"IF((VLOOKUP(K1540,INVENTORYDATA,7,FALSE))=\"NO\",\"X\",\"\")","v":{"$error":"#N/A"}}]
["Power Off",null,"X",{"$nulls":3},"Power Off",null,"X"]
["HDD Serial No.",null,{"$f":"IF(ISBLANK(VLOOKUP(E1540,INVENTORYDATA,12,FALSE)),\"\",VLOOKUP(E1540,INVENTORYDATA,12,FALSE))","v":{"$error":"#N/A"}},{"$nulls":3},"HDD Serial No.",null,{"$f":"IF(ISBLANK(VLOOKUP(K1540,INVENTORYDATA,12,FALSE)),\"\",VLOOKUP(K1540,INVENTORYDATA,12,FALSE))","v":{"$error":"#N/A"}}]
[]
["Tested for key functions,R2/Ready for Resale",{"$nulls":5},"Tested for key functions,R2/Ready for Resale"]
["BIOS Lock","Caddy","Optical","WebCam","Battery",null,"BIOS Lock","Caddy","Optical","WebCam","Battery"]
[null,null,{"$f":"VLOOKUP(E1540,INVENTORY!$A$2:$N$144,7,FALSE)","v":{"$error":"#N/A"}},{"$f":"VLOOKUP(E1540,INVENTORY!$A$2:$N$144,8,FALSE)","v":{"$error":"#N/A"}},{"$f":"VLOOKUP(E1540,INVENTORY!$A$2:$N$144,9,FALSE)","v":{"$error":"#N/A"}},{"$nulls":3},{"$f":"VLOOKUP(K1540,INVENTORY!$A$2:$N$144,7,FALSE)","v":{"$error":"#N/A"}},{"$f":"VLOOKUP(K1540,INVENTORY!$A$2:$N$144,8,FALSE)","v":{"$error":"#N/A"}},{"$f":"VLOOKUP(K1540,INVENTORY!$A$2:$N$144,9,FALSE)","v":{"$error":"#N/A"}}]
[]
["CPU Cosmetics Defects:",null,{"$f":"\"Function Code: \"&VLOOKUP(E1540,INVENTORY!$A$2:$Q$144,14,FALSE)","v":{"$error":"#N/A"}},{"$nulls":3},"CPU Cosmetics Defects:",null,{"$f":"\"Function Code: \"&VLOOKUP(K1540,INVENTORY!$A$2:$Q$144,14,FALSE)","v":{"$error":"#N/A"}}]
[]
[null,null,{"$f":"\"Cosmetic Code: \"&VLOOKUP(E1540,INVENTORY!$A$2:$Q$144,15,FALSE)","v":{"$error":"#N/A"}},{"$nulls":5},{"$f":"\"Cosmetic Code: \"&VLOOKUP(K1540,INVENTORY!$A$2:$Q$144,15,FALSE)","v":{"$error":"#N/A"}}]
[]
["Casing","Plugs/Ports",{"$nulls":4},"Casing","Plugs/Ports"]
["Pass","Pass",{"$nulls":4},"Pass","Pass"]
["Fail","Fail",null,"TRRC#:L.T.R.",null,null,"Fail","Fail",null,"TRRC#:L.T.R."]
[]
["LAPTOP TESTING RECORD",{"$nulls":5},"LAPTOP TESTING RECORD"]
[]
[{"$nulls":3},"ITEM #",{"$f":"E1540+2","v":109},{"$nulls":4},"ITEM #",{"$f":"K1540+2","v":110}]
["Tester: ","RR","Date:",{"$f":"NOW()","v":"2026-01-06T11:13:00.960"},null,null,"Tester: ","RR","Date:",{"$f":"NOW()","v":"2026-01-06T11:13:00.960"}]
["Type: ","LAPTOP","SN:",{"$f":"VLOOKUP(E1569,INVENTORYDATA,10,FALSE)","v":{"$error":"#N/A"}},null,null,"Type: ","LAPTOP","SN:",{"$f":"VLOOKUP(K1569,INVENTORYDATA,10,FALSE)","v":{"$error":"#N/A"}}]
[{"$f":"\"Make: \"","v":"Make: "},{"$f":"VLOOKUP(E1569,INVENTORYDATA,2,FALSE)","v":{"$error":"#N/A"}},{"$f":"\"Model: \"","v":"Model: "},{"$f":"VLOOKUP(E1569,INVENTORYDATA,3,FALSE)","v":{"$error":"#N/A"}},null,null,{"$f":"\"Make: \"","v":"Make: "},{"$f":"VLOOKUP(K1569,INVENTORYDATA,2,FALSE)","v":{"$error":"#N/A"}},{"$f":"\"Model: \"","v":"Model: "},{"$f":"VLOOKUP(K1569,INVENTORYDATA,3,FALSE)","v":{"$error":"#N/A"}}]
[{"$f":"\"CPU/Speed: \"","v":"CPU/Speed: "},{"$f":"VLOOKUP(E1569,INVENTORYDATA,4,FALSE)&\" / \"&VLOOKUP(E1569,INVENTORYDATA,5,FALSE)&\"GHz\"","v":{"$error":"#N/A"}},null,{"$f":"\"Memory: \"","v":"Memory: "},{"$f":"VLOOKUP(E1569,INVENTORYDATA,6,FALSE)","v":{"$error":"#N/A"}},null,{"$f":"\"CPU/Speed: \"","v":"CPU/Speed: "},{"$f":"VLOOKUP(K1569,INVENTORYDATA,4,FALSE)&\" / \"&VLOOKUP(K1569,INVENTORYDATA,5,FALSE)&\"GHz\"","v":{"$error":"#N/A"}},null,{"$f":"\"Memory: \"","v":"Memory: "},{"$f":"VLOOKUP(K1569,INVENTORYDATA,6,FALSE)","v":{"$error":"#N/A"}}]
[]
["Key Function",null,"Pass","Fail ","Comments",null,"Key Function",null,"Pass","Fail ","Comments"]
["Hard Drive Removed",null,{"$f":"IF(ISBLANK(VLOOKUP(E1569,INVENTORYDATA,13,FALSE)),\"X\",\"\")","v":""},null,{"$f":"IF(ISBLANK(VLOOKUP(E1569,INVENTORYDATA,13,FALSE)),\"\",VLOOKUP(E1569,INVENTORYDATA,13,FALSE))","v":{"$error":"#N/A"}},null,"Hard Drive Removed",null,{"$f":"IF(ISBLANK(VLOOKUP(K1569,INVENTORYDATA,13,FALSE)),\"X\",\"\")","v":""},null,{"$f":"IF(ISBLANK(VLOOKUP(K1569,INVENTORYDATA,13,FALSE)),\"\",VLOOKUP(K1569,INVENTORYDATA,13,FALSE))","v":{"$error":"#N/A"}}]
["Install Memory",null,"X",{"$nulls":3},"Install Memory",null,"X"]
["Power ON",null,"X",{"$nulls":3},"Power ON",null,"X"]
["Record BIOS info",null,"X",{"$nulls":3},"Record BIOS info",null,"X"]
["Check Optical Drive",null,{"$f":"IF((VLOOKUP(E1569,INVENTORYDATA,7,FALSE))=\"YES\",\"X\",\"\")","v":{"$error":"#N/A"}},{"$f":"IF((VLOOKUP(E1569,INVENTORYDATA,7,FALSE))=\"NO\",\"X\",\"\")","v":{"$error":"#N/A"}},null,null,"Check Optical Drive",null,{"$f":"IF((VLOOKUP(K1569,INVENTORYDATA,7,FALSE))=\"YES\",\"X\",\"\")","v":{"$error":"#N/A"}},{"$f":"IF((VLOOKUP(K1569,INVENTORYDATA,7,FALSE))=\"NO\",\"X\",\"\")","v":{"$error":"#N/A"}}]
["Power Off",null,"X",{"$nulls":3},"Power Off",null,"X"]
["HDD Serial No.",null,{"$f":"IF(ISBLANK(VLOOKUP(E1569,INVENTORYDATA,12,FALSE)),\"\",VLOOKUP(E1569,INVENTORYDATA,12,FALSE))","v":{"$error":"#N/A"}},{"$nulls":3},"HDD Serial No.",null,{"$f":"IF(ISBLANK(VLOOKUP(K1569,INVENTORYDATA,12,FALSE)),\"\",VLOOKUP(K1569,INVENTORYDATA,12,FALSE))","v":{"$error":"#N/A"}}]
[]
["Tested for key functions,R2/Ready for Resale",{"$nulls":5},"Tested for key functions,R2/Ready for Resale"]
["BIOS Lock","Caddy","Optical","WebCam","Battery",null,"BIOS Lock","Caddy","Optical","WebCam","Battery"]
[null,null,{"$f":"VLOOKUP(E1569,INVENTORY!$A$2:$N$144,7,FALSE)","v":{"$error":"#N/A"}},{"$f":"VLOOKUP(E1569,INVENTORY!$A$2:$N$144,8,FALSE)","v":{"$error":"#N/A"}},{"$f":"VLOOKUP(E1569,INVENTORY!$A$2:$N$144,9,FALSE)","v":{"$error":"#N/A"}},{"$nulls":3},{"$f":"VLOOKUP(K1569,INVENTORY!$A$2:$N$144,7,FALSE)","v":{"$error":"#N/A"}},{"$f":"VLOOKUP(K1569,INVENTORY!$A$2:$N$144,8,FALSE)","v":{"$error":"#N/A"}},{"$f":"VLOOKUP(K1569,INVENTORY!$A$2:$N$144,9,FALSE)","v":{"$error":"#N/A"}}]
[]
["CPU Cosmetics Defects:",null,{"$f":"\"Function Code: \"&VLOOKUP(E1569,INVENTORY!$A$2:$Q$144,14,FALSE)","v":{"$error":"#N/A"}},{"$nulls":3},"CPU Cosmetics Defects:",null,{"$f":"\"Function Code: \"&VLOOKUP(K1569,INVENTORY!$A$2:$Q$144,14,FALSE)","v":{"$error":"#N/A"}}]
[]
[null,null,{"$f":"\"Cosmetic Code: \"&VLOOKUP(E1569,INVENTORY!$A$2:$Q$144,15,FALSE)","v":{"$error":"#N/A"}},{"$nulls":5},{"$f":"\"Cosmetic Code: \"&VLOOKUP(K1569,INVENTORY!$A$2:$Q$144,15,FALSE)","v":{"$error":"#N/A"}}]
[]
["Casing","Plugs/Ports",{"$nulls":4},"Casing","Plugs/Ports"]
["Pass","Pass",{"$nulls":4},"Pass","Pass"]
["Fail","Fail",null,"TRRC#:L.T.R.",null,null,"Fail","Fail",null,"TRRC#:L.T.R."]
[]
["LAPTOP TESTING RECORD",{"$nulls":5},"LAPTOP TESTING RECORD"]
[]
[{"$nulls":3},"ITEM #",{"$f":"E1569+2","v":111},{"$nulls":4},"ITEM #",{"$f":"K1569+2","v":112}]
["Tester: ","RR","Date:",{"$f":"NOW()","v":"2026-01-06T11:13:00.960"},null,null,"Tester: ","RR","Date:",{"$f":"NOW()","v":"2026-01-06T11:13:00.960"}]
["Type: ","LAPTOP","SN:",{"$f":"VLOOKUP(E1598,INVENTORYDATA,10,FALSE)","v":{"$error":"#N/A"}},null,null,"Type: ","LAPTOP","SN:",{"$f":"VLOOKUP(K1598,INVENTORYDATA,10,FALSE)","v":{"$error":"#N/A"}}]
[{"$f":"\"Make: \"","v":"Make: "},{"$f":"VLOOKUP(E1598,INVENTORYDATA,2,FALSE)","v":{"$error":"#N/A"}},{"$f":"\"Model: \"","v":"Model: "},{"$f":"VLOOKUP(E1598,INVENTORYDATA,3,FALSE)","v":{"$error":"#N/A"}},null,null,{"$f":"\"Make: \"","v":"Make: "},{"$f":"VLOOKUP(K1598,INVENTORYDATA,2,FALSE)","v":{"$error":"#N/A"}},{"$f":"\"Model: \"","v":"Model: "},{"$f":"VLOOKUP(K1598,INVENTORYDATA,3,FALSE)","v":{"$error":"#N/A"}}]
[{"$f":"\"CPU/Speed: \"","v":"CPU/Speed: "},{"$f":"VLOOKUP(E1598,INVENTORYDATA,4,FALSE)&\" / \"&VLOOKUP(E1598,INVENTORYDATA,5,FALSE)&\"GHz\"","v":{"$error":"#N/A"}},null,{"$f":"\"Memory: \"","v":"Memory: "},{"$f":"VLOOKUP(E1598,INVENTORYDATA,6,FALSE)","v":{"$error":"#N/A"}},null,{"$f":"\"CPU/Speed: \"","v":"CPU/Speed: "},{"$f":"VLOOKUP(K1598,INVENTORYDATA,4,FALSE)&\" / \"&VLOOKUP(K1598,INVENTORYDATA,5,FALSE)&\"GHz\"","v":{"$error":"#N/A"}},null,{"$f":"\"Memory: \"","v":"Memory: "},{"$f":"VLOOKUP(K1598,INVENTORYDATA,6,FALSE)","v":{"$error":"#N/A"}}]
[]
["Key Function",null,"Pass","Fail ","Comments",null,"Key Function",null,"Pass","Fail ","Comments"]
["Hard Drive Removed",null,{"$f":"IF(ISBLANK(VLOOKUP(E1598,INVENTORYDATA,13,FALSE)),\"X\",\"\")","v":""},null,{"$f":"IF(ISBLANK(VLOOKUP(E1598,INVENTORYDATA,13,FALSE)),\"\",VLOOKUP(E1598,INVENTORYDATA,13,FALSE))","v":{"$error":"#N/A"}},null,"Hard Drive Removed",null,{"$f":"IF(ISBLANK(VLOOKUP(K1598,INVENTORYDATA,13,FALSE)),\"X\",\"\")","v":""},null,{"$f":"IF(ISBLANK(VLOOKUP(K1598,INVENTORYDATA,13,FALSE)),\"\",VLOOKUP(K1598,INVENTORYDATA,13,FALSE))","v":{"$error":"#N/A"}}]
["Install Memory",null,"X",{"$nulls":3},"Install Memory",null,"X"]
["Power ON",null,"X",{"$nulls":3},"Power ON",null,"X"]
["Record BIOS info",null,"X",{"$nulls":3},"Record BIOS info",null,"X"]
["Check Optical Drive",null,{"$f":"IF((VLOOKUP(E1598,INVENTORYDATA,7,FALSE))=\"YES\",\"X\",\"\")","v":{"$error":"#N/A"}},{"$f":"IF((VLOOKUP(E1598,INVENTORYDATA,7,FALSE))=\"NO\",\"X\",\"\")","v":{"$error":"#N/A"}},null,null,"Check Optical Drive",null,{"$f":"IF((VLOOKUP(K1598,INVENTORYDATA,7,FALSE))=\"YES\",\"X\",\"\")","v":{"$error":"#N/A"}},{"$f":"IF((VLOOKUP(K1598,INVENTORYDATA,7,FALSE))=\"NO\",\"X\",\"\")","v":{"$error":"#N/A"}}]
["Power Off",null,"X",{"$nulls":3},"Power Off",null,"X"]
["HDD Serial No.",null,{"$f":"IF(ISBLANK(VLOOKUP(E1598,INVENTORYDATA,12,FALSE)),\"\",VLOOKUP(E1598,INVENTORYDATA,12,FALSE))","v":{"$error":"#N/A"}},{"$nulls":3},"HDD Serial No.",null,{"$f":"IF(ISBLANK(VLOOKUP(K1598,INVENTORYDATA,12,FALSE)),\"\",VLOOKUP(K1598,INVENTORYDATA,12,FALSE))","v":{"$error":"#N/A"}}]
[]
["Tested for key functions,R2/Ready for Resale",{"$nulls":5},"Tested for key functions,R2/Ready for Resale"]
["BIOS Lock","Caddy","Optical","WebCam","Battery",null,"BIOS Lock","Caddy","Optical","WebCam","Battery"]
[null,null,{"$f":"VLOOKUP(E1598,INVENTORY!$A$2:$N$144,7,FALSE)","v":{"$error":"#N/A"}},{"$f":"VLOOKUP(E1598,INVENTORY!$A$2:$N$144,8,FALSE)","v":{"$error":"#N/A"}},{"$f":"VLOOKUP(E1598,INVENTORY!$A$2:$N$144,9,FALSE)","v":{"$error":"#N/A"}},{"$nulls":3},{"$f":"VLOOKUP(K1598,INVENTORY!$A$2:$N$144,7,FALSE)","v":{"$error":"#N/A"}},{"$f":"VLOOKUP(K1598,INVENTORY!$A$2:$N$144,8,FALSE)","v":{"$error":"#N/A"}},{"$f":"VLOOKUP(K1598,INVENTORY!$A$2:$N$144,9,FALSE)","v":{"$error":"#N/A"}}]
[]
["CPU Cosmetics Defects:",null,{"$f":"\"Function Code: \"&VLOOKUP(E1598,INVENTORY!$A$2:$Q$144,14,FALSE)","v":{"$error":"#N/A"}},{"$nulls":3},"CPU Cosmetics Defects:",null,{"$f":"\"Function Code: \"&VLOOKUP(K1598,INVENTORY!$A$2:$Q$144,14,FALSE)","v":{"$error":"#N/A"}}]
[]
[null,null,{"$f":"\"Cosmetic Code: \"&VLOOKUP(E1598,INVENTORY!$A$2:$Q$144,15,FALSE)","v":{"$error":"#N/A"}},{"$nulls":5},{"$f":"\"Cosmetic Code: \"&VLOOKUP(K1598,INVENTORY!$A$2:$Q$144,15,FALSE)","v":{"$error":"#N/A"}}]
[]
["Casing","Plugs/Ports",{"$nulls":4},"Casing","Plugs/Ports"]
["Pass","Pass",{"$nulls":4},"Pass","Pass"]
["Fail","Fail",null,"TRRC#:L.T.R.",null,null,"Fail","Fail",null,"TRRC#:L.T.R."]
[]
["LAPTOP TESTING RECORD",{"$nulls":5},"LAPTOP TESTING RECORD"]
[]
[{"$nulls":3},"ITEM #",{"$f":"E1598+2","v":113},{"$nulls":4},"ITEM #",{"$f":"K1598+2","v":114}]
["Tester: ","RR","Date:",{"$f":"NOW()","v":"2026-01-06T11:13:00.960"},null,null,"Tester: ","RR","Date:",{"$f":"NOW()","v":"2026-01-06T11:13:00.960"}]
["Type: ","LAPTOP","SN:",{"$f":"VLOOKUP(E1627,INVENTORYDATA,10,FALSE)","v":{"$error":"#N/A"}},null,null,"Type: ","LAPTOP","SN:",{"$f":"VLOOKUP(K1627,INVENTORYDATA,10,FALSE)","v":{"$error":"#N/A"}}]
[{"$f":"\"Make: \"","v":"Make: "},{"$f":"VLOOKUP(E1627,INVENTORYDATA,2,FALSE)","v":{"$error":"#N/A"}},{"$f":"\"Model: \"","v":"Model: "},{"$f":"VLOOKUP(E1627,INVENTORYDATA,3,FALSE)","v":{"$error":"#N/A"}},null,null,{"$f":"\"Make: \"","v":"Make: "},{"$f":"VLOOKUP(K1627,INVENTORYDATA,2,FALSE)","v":{"$error":"#N/A"}},{"$f":"\"Model: \"","v":"Model: "},{"$f":"VLOOKUP(K1627,INVENTORYDATA,3,FALSE)","v":{"$error":"#N/A"}}]
[{"$f":"\"CPU/Speed: \"","v":"CPU/Speed: "},{"$f":"VLOOKUP(E1627,INVENTORYDATA,4,FALSE)&\" / \"&VLOOKUP(E1627,INVENTORYDATA,5,FALSE)&\"GHz\"","v":{"$error":"#N/A"}},null,{"$f":"\"Memory: \"","v":"Memory: "},{"$f":"VLOOKUP(E1627,INVENTORYDATA,6,FALSE)","v":{"$error":"#N/A"}},null,{"$f":"\"CPU/Speed: \"","v":"CPU/Speed: "},{"$f":"VLOOKUP(K1627,INVENTORYDATA,4,FALSE)&\" / \"&VLOOKUP(K1627,INVENTORYDATA,5,FALSE)&\"GHz\"","v":{"$error":"#N/A"}},null,{"$f":"\"Memory: \"","v":"Memory: "},{"$f":"VLOOKUP(K1627,INVENTORYDATA,6,FALSE)","v":{"$error":"#N/A"}}]
[]
["Key Function",null,"Pass","Fail ","Comments",null,"Key Function",null,"Pass","Fail ","Comments"]
["Hard Drive Removed",null,{"$f":"IF(ISBLANK(VLOOKUP(E1627,INVENTORYDATA,13,FALSE)),\"X\",\"\")","v":""},null,{"$f":"IF(ISBLANK(VLOOKUP(E1627,INVENTORYDATA,13,FALSE)),\"\",VLOOKUP(E1627,INVENTORYDATA,13,FALSE))","v":{"$error":"#N/A"}},null,"Hard Drive Removed",null,{"$f":"IF(ISBLANK(VLOOKUP(K1627,INVENTORYDATA,13,FALSE)),\"X\",\"\")","v":""},null,{"$f":"IF(ISBLANK(VLOOKUP(K1627,INVENTORYDATA,13,FALSE)),\"\",VLOOKUP(K1627,INVENTORYDATA,13,FALSE))","v":{"$error":"#N/A"}}]
["Install Memory",null,"X",{"$nulls":3},"Install Memory",null,"X"]
["Power ON",null,"X",{"$nulls":3},"Power ON",null,"X"]
["Record BIOS info",null,"X",{"$nulls":3},"Record BIOS info",null,"X"]
["Check Optical Drive",null,{"$f":"IF((VLOOKUP(E1627,INVENTORYDATA,7,FALSE))=\"YES\",\"X\",\"\")","v":{"$error":"#N/A"}},{"$f":"IF((VLOOKUP(E1627,INVENTORYDATA,7,FALSE))=\"NO\",\"X\",\"\")","v":{"$error":"#N/A"}},null,null,"Check Optical Drive",null,{"$f":"IF((VLOOKUP(K1627,INVENTORYDATA,7,FALSE))=\"YES\",\"X\",\"\")","v":{"$error":"#N/A"}},{"$f":"IF((VLOOKUP(K1627,INVENTORYDATA,7,FALSE))=\"NO\",\"X\",\"\")","v":{"$error":"#N/A"}}]
["Power Off",null,"X",{"$nulls":3},"Power Off",null,"X"]
["HDD Serial No.",null,{"$f":"IF(ISBLANK(VLOOKUP(E1627,INVENTORYDATA,12,FALSE)),\"\",VLOOKUP(E1627,INVENTORYDATA,12,FALSE))","v":{"$error":"#N/A"}},{"$nulls":3},"HDD Serial No.",null,{"$f":"IF(ISBLANK(VLOOKUP(K1627,INVENTORYDATA,12,FALSE)),\"\",VLOOKUP(K1627,INVENTORYDATA,12,FALSE))","v":{"$error":"#N/A"}}]
[]
["Tested for key functions,R2/Ready for Resale",{"$nulls":5},"Tested for key functions,R2/Ready for Resale"]
["BIOS Lock","Caddy","Optical","WebCam","Battery",null,"BIOS Lock","Caddy","Optical","WebCam","Battery"]
[null,null,{"$f":"VLOOKUP(E1627,INVENTORY!$A$2:$N$144,7,FALSE)","v":{"$error":"#N/A"}},{"$f":"VLOOKUP(E1627,INVENTORY!$A$2:$N$144,8,FALSE)","v":{"$error":"#N/A"}},{"$f":"VLOOKUP(E1627,INVENTORY!$A$2:$N$144,9,FALSE)","v":{"$error":"#N/A"}},{"$nulls":3},{"$f":"VLOOKUP(K1627,INVENTORY!$A$2:$N$144,7,FALSE)","v":{"$error":"#N/A"}},{"$f":"VLOOKUP(K1627,INVENTORY!$A$2:$N$144,8,FALSE)","v":{"$error":"#N/A"}},{"$f":"VLOOKUP(K1627,INVENTORY!$A$2:$N$144,9,FALSE)","v":{"$error":"#N/A"}}]
[]
["CPU Cosmetics Defects:",null,{"$f":"\"Function Code: \"&VLOOKUP(E1627,INVENTORY!$A$2:$Q$144,14,FALSE)","v":{"$error":"#N/A"}},{"$nulls":3},"CPU Cosmetics Defects:",null,{"$f":"\"Function Code: \"&VLOOKUP(K1627,INVENTORY!$A$2:$Q$144,14,FALSE)","v":{"$error":"#N/A"}}]
[]
[null,null,{"$f":"\"Cosmetic Code: \"&VLOOKUP(E1627,INVENTORY!$A$2:$Q$144,15,FALSE)","v":{"$error":"#N/A"}},{"$nulls":5},{"$f":"\"Cosmetic Code: \"&VLOOKUP(K1627,INVENTORY!$A$2:$Q$144,15,FALSE)","v":{"$error":"#N/A"}}]
[]
["Casing","Plugs/Ports",{"$nulls":4},"Casing","Plugs/Ports"]
["Pass","Pass",{"$nulls":4},"Pass","Pass"]
["Fail","Fail",null,"TRRC#:L.T.R.",null,null,"Fail","Fail",null,"TRRC#:L.T.R."]
[]
["LAPTOP TESTING RECORD",{"$nulls":5},"LAPTOP TESTING RECORD"]
[]
[{"$nulls":3},"ITEM #",{"$f":"E1627+2","v":115},{"$nulls":4},"ITEM #",{"$f":"K1627+2","v":116}]
["Tester: ","RR","Date:",{"$f":"NOW()","v":"2026-01-06T11:13:00.960"},null,null,"Tester: ","RR","Date:",{"$f":"NOW()","v":"2026-01-06T11:13:00.960"}]
["Type: ","LAPTOP","SN:",{"$f":"VLOOKUP(E1656,INVENTORYDATA,10,FALSE)","v":{"$error":"#N/A"}},null,null,"Type: ","LAPTOP","SN:",{"$f":"VLOOKUP(K1656,INVENTORYDATA,10,FALSE)","v":{"$error":"#N/A"}}]
[{"$f":"\"Make: \"","v":"Make: "},{"$f":"VLOOKUP(E1656,INVENTORYDATA,2,FALSE)","v":{"$error":"#N/A"}},{"$f":"\"Model: \"","v":"Model: "},{"$f":"VLOOKUP(E1656,INVENTORYDATA,3,FALSE)","v":{"$error":"#N/A"}},null,null,{"$f":"\"Make: \"","v":"Make: "},{"$f":"VLOOKUP(K1656,INVENTORYDATA,2,FALSE)","v":{"$error":"#N/A"}},{"$f":"\"Model: \"","v":"Model: "},{"$f":"VLOOKUP(K1656,INVENTORYDATA,3,FALSE)","v":{"$error":"#N/A"}}]
[{"$f":"\"CPU/Speed: \"","v":"CPU/Speed: "},{"$f":"VLOOKUP(E1656,INVENTORYDATA,4,FALSE)&\" / \"&VLOOKUP(E1656,INVENTORYDATA,5,FALSE)&\"GHz\"","v":{"$error":"#N/A"}},null,{"$f":"\"Memory: \"","v":"Memory: "},{"$f":"VLOOKUP(E1656,INVENTORYDATA,6,FALSE)","v":{"$error":"#N/A"}},null,{"$f":"\"CPU/Speed: \"","v":"CPU/Speed: "},{"$f":"VLOOKUP(K1656,INVENTORYDATA,4,FALSE)&\" / \"&VLOOKUP(K1656,INVENTORYDATA,5,FALSE)&\"GHz\"","v":{"$error":"#N/A"}},null,{"$f":"\"Memory: \"","v":"Memory: "},{"$f":"VLOOKUP(K1656,INVENTORYDATA,6,FALSE)","v":{"$error":"#N/A"}}]
[]
["Key Function",null,"Pass","Fail ","Comments",null,"Key Function",null,"Pass","Fail ","Comments"]
["Hard Drive Removed",null,{"$f":"IF(ISBLANK(VLOOKUP(E1656,INVENTORYDATA,13,FALSE)),\"X\",\"\")","v":""},null,{"$f":"IF(ISBLANK(VLOOKUP(E1656,INVENTORYDATA,13,FALSE)),\"\",VLOOKUP(E1656,INVENTORYDATA,13,FALSE))","v":{"$error":"#N/A"}},null,"Hard Drive Removed",null,{"$f":"IF(ISBLANK(VLOOKUP(K1656,INVENTORYDATA,13,FALSE)),\"X\",\"\")","v":""},null,{"$f":"IF(ISBLANK(VLOOKUP(K1656,INVENTORYDATA,13,FALSE)),\"\",VLOOKUP(K1656,INVENTORYDATA,13,FALSE))","v":{"$error":"#N/A"}}]
["Install Memory",null,"X",{"$nulls":3},"Install Memory",null,"X"]
["Power ON",null,"X",{"$nulls":3},"Power ON",null,"X"]
["Record BIOS info",null,"X",{"$nulls":3},"Record BIOS info",null,"X"]
["Check Optical Drive",null,{"$f":"IF((VLOOKUP(E1656,INVENTORYDATA,7,FALSE))=\"YES\",\"X\",\"\")","v":{"$error":"#N/A"}},{"$f":"IF((VLOOKUP(E1656,INVENTORYDATA,7,FALSE))=\"NO\",\"X\",\"\")","v":{"$error":"#N/A"}},null,null,"Check Optical Drive",null,{"$f":"IF((VLOOKUP(K1656,INVENTORYDATA,7,FALSE))=\"YES\",\"X\",\"\")","v":{"$error":"#N/A"}},{"$f":"IF((VLOOKUP(K1656,INVENTORYDATA,7,FALSE))=\"NO\",\"X\",\"\")","v":{"$error":"#N/A"}}]
["Power Off",null,"X",{"$nulls":3},"Power Off",null,"X"]
["HDD Serial No.",null,{"$f":"IF(ISBLANK(VLOOKUP(E1656,INVENTORYDATA,12,FALSE)),\"\",VLOOKUP(E1656,INVENTORYDATA,12,FALSE))","v":{"$error":"#N/A"}},{"$nulls":3},"HDD Serial No.",null,{"$f":"IF(ISBLANK(VLOOKUP(K1656,INVENTORYDATA,12,FALSE)),\"\",VLOOKUP(K1656,INVENTORYDATA,12,FALSE))","v":{"$error":"#N/A"}}]
[]
["Tested for key functions,R2/Ready for Resale",{"$nulls":5},"Tested for key functions,R2/Ready for Resale"]
["BIOS Lock","Caddy","Optical","WebCam","Battery",null,"BIOS Lock","Caddy","Optical","WebCam","Battery"]
[null,null,{"$f":"VLOOKUP(E1656,INVENTORY!$A$2:$N$144,7,FALSE)","v":{"$error":"#N/A"}},{"$f":"VLOOKUP(E1656,INVENTORY!$A$2:$N$144,8,FALSE)","v":{"$error":"#N/A"}},{"$f":"VLOOKUP(E1656,INVENTORY!$A$2:$N$144,9,FALSE)","v":{"$error":"#N/A"}},{"$nulls":3},{"$f":"VLOOKUP(K1656,INVENTORY!$A$2:$N$144,7,FALSE)","v":{"$error":"#N/A"}},{"$f":"VLOOKUP(K1656,INVENTORY!$A$2:$N$144,8,FALSE)","v":{"$error":"#N/A"}},{"$f":"VLOOKUP(K1656,INVENTORY!$A$2:$N$144,9,FALSE)","v":{"$error":"#N/A"}}]
[]
["CPU Cosmetics Defects:",null,{"$f":"\"Function Code: \"&VLOOKUP(E1656,INVENTORY!$A$2:$Q$144,14,FALSE)","v":{"$error":"#N/A"}},{"$nulls":3},"CPU Cosmetics Defects:",null,{"$f":"\"Function Code: \"&VLOOKUP(K1656,INVENTORY!$A$2:$Q$144,14,FALSE)","v":{"$error":"#N/A"}}]
[]
[null,null,{"$f":"\"Cosmetic Code: \"&VLOOKUP(E1656,INVENTORY!$A$2:$Q$144,15,FALSE)","v":{"$error":"#N/A"}},{"$nulls":5},{"$f":"\"Cosmetic Code: \"&VLOOKUP(K1656,INVENTORY!$A$2:$Q$144,15,FALSE)","v":{"$error":"#N/A"}}]
[]
["Casing","Plugs/Ports",{"$nulls":4},"Casing","Plugs/Ports"]
["Pass","Pass",{"$nulls":4},"Pass","Pass"]
["Fail","Fail",null,"TRRC#:L.T.R.",null,null,"Fail","Fail",null,"TRRC#:L.T.R."]
[]
["LAPTOP TESTING RECORD",{"$nulls":5},"LAPTOP TESTING RECORD"]
[]
[{"$nulls":3},"ITEM #",{"$f":"E1656+2","v":117},{"$nulls":4},"ITEM #",{"$f":"K1656+2","v":118}]
["Tester: ","RR","Date:",{"$f":"NOW()","v":"2026-01-06T11:13:00.960"},null,null,"Tester: ","RR","Date:",{"$f":"NOW()","v":"2026-01-06T11:13:00.960"}]
["Type: ","LAPTOP","SN:",{"$f":"VLOOKUP(E1685,INVENTORYDATA,10,FALSE)","v":{"$error":"#N/A"}},null,null,"Type: ","LAPTOP","SN:",{"$f":"VLOOKUP(K1685,INVENTORYDATA,10,FALSE)","v":{"$error":"#N/A"}}]
[{"$f":"\"Make: \"","v":"Make: "},{"$f":"VLOOKUP(E1685,INVENTORYDATA,2,FALSE)","v":{"$error":"#N/A"}},{"$f":"\"Model: \"","v":"Model: "},{"$f":"VLOOKUP(E1685,INVENTORYDATA,3,FALSE)","v":{"$error":"#N/A"}},null,null,{"$f":"\"Make: \"","v":"Make: "},{"$f":"VLOOKUP(K1685,INVENTORYDATA,2,FALSE)","v":{"$error":"#N/A"}},{"$f":"\"Model: \"","v":"Model: "},{"$f":"VLOOKUP(K1685,INVENTORYDATA,3,FALSE)","v":{"$error":"#N/A"}}]
[{"$f":"\"CPU/Speed: \"","v":"CPU/Speed: "},{"$f":"VLOOKUP(E1685,INVENTORYDATA,4,FALSE)&\" / \"&VLOOKUP(E1685,INVENTORYDATA,5,FALSE)&\"GHz\"","v":{"$error":"#N/A"}},null,{"$f":"\"Memory: \"","v":"Memory: "},{"$f":"VLOOKUP(E1685,INVENTORYDATA,6,FALSE)","v":{"$error":"#N/A"}},null,{"$f":"\"CPU/Speed: \"","v":"CPU/Speed: "},{"$f":"VLOOKUP(K1685,INVENTORYDATA,4,FALSE)&\" / \"&VLOOKUP(K1685,INVENTORYDATA,5,FALSE)&\"GHz\"","v":{"$error":"#N/A"}},null,{"$f":"\"Memory: \"","v":"Memory: "},{"$f":"VLOOKUP(K1685,INVENTORYDATA,6,FALSE)","v":{"$error":"#N/A"}}]
[]
["Key Function",null,"Pass","Fail ","Comments",null,"Key Function",null,"Pass","Fail ","Comments"]
["Hard Drive Removed",null,{"$f":"IF(ISBLANK(VLOOKUP(E1685,INVENTORYDATA,13,FALSE)),\"X\",\"\")","v":""},null,{"$f":"IF(ISBLANK(VLOOKUP(E1685,INVENTORYDATA,13,FALSE)),\"\",VLOOKUP(E1685,INVENTORYDATA,13,FALSE))","v":{"$error":"#N/A"}},null,"Hard Drive Removed",null,{"$f":"IF(ISBLANK(VLOOKUP(K1685,INVENTORYDATA,13,FALSE)),\"X\",\"\")","v":""},null,{"$f":"IF(ISBLANK(VLOOKUP(K1685,INVENTORYDATA,13,FALSE)),\"\",VLOOKUP(K1685,INVENTORYDATA,13,FALSE))","v":{"$error":"#N/A"}}]
["Install Memory",null,"X",{"$nulls":3},"Install Memory",null,"X"]
["Power ON",null,"X",{"$nulls":3},"Power ON",null,"X"]
["Record BIOS info",null,"X",{"$nulls":3},"Record BIOS info",null,"X"]
["Check Optical Drive",null,{"$f":"IF((VLOOKUP(E1685,INVENTORYDATA,7,FALSE))=\"YES\",\"X\",\"\")","v":{"$error":"#N/A"}},{"$f":"IF((VLOOKUP(E1685,INVENTORYDATA,7,FALSE))=\"NO\",\"X\",\"\")","v":{"$error":"#N/A"}},null,null,"Check Optical Drive",null,{"$f":"IF((VLOOKUP(K1685,INVENTORYDATA,7,FALSE))=\"YES\",\"X\",\"\")","v":{"$error":"#N/A"}},{"$f":"IF((VLOOKUP(K1685,INVENTORYDATA,7,FALSE))=\"NO\",\"X\",\"\")","v":{"$error":"#N/A"}}]
["Power Off",null,"X",{"$nulls":3},"Power Off",null,"X"]
["HDD Serial No.",null,{"$f":"IF(ISBLANK(VLOOKUP(E1685,INVENTORYDATA,12,FALSE)),\"\",VLOOKUP(E1685,INVENTORYDATA,12,FALSE))","v":{"$error":"#N/A"}},{"$nulls":3},"HDD Serial No.",null,{"$f":"IF(ISBLANK(VLOOKUP(K1685,INVENTORYDATA,12,FALSE)),\"\",VLOOKUP(K1685,INVENTORYDATA,12,FALSE))","v":{"$error":"#N/A"}}]
[]
["Tested for key functions,R2/Ready for Resale",{"$nulls":5},"Tested for key functions,R2/Ready for Resale"]
["BIOS Lock","Caddy","Optical","WebCam","Battery",null,"BIOS Lock","Caddy","Optical","WebCam","Battery"]
[null,null,{"$f":"VLOOKUP(E1685,INVENTORY!$A$2:$N$144,7,FALSE)","v":{"$error":"#N/A"}},{"$f":"VLOOKUP(E1685,INVENTORY!$A$2:$N$144,8,FALSE)","v":{"$error":"#N/A"}},{"$f":"VLOOKUP(E1685,INVENTORY!$A$2:$N$144,9,FALSE)","v":{"$error":"#N/A"}},{"$nulls":3},{"$f":"VLOOKUP(K1685,INVENTORY!$A$2:$N$144,7,FALSE)","v":{"$error":"#N/A"}},{"$f":"VLOOKUP(K1685,INVENTORY!$A$2:$N$144,8,FALSE)","v":{"$error":"#N/A"}},{"$f":"VLOOKUP(K1685,INVENTORY!$A$2:$N$144,9,FALSE)","v":{"$error":"#N/A"}}]
[]
["CPU Cosmetics Defects:",null,{"$f":"\"Function Code: \"&VLOOKUP(E1685,INVENTORY!$A$2:$Q$144,14,FALSE)","v":{"$error":"#N/A"}},{"$nulls":3},"CPU Cosmetics Defects:",null,{"$f":"\"Function Code: \"&VLOOKUP(K1685,INVENTORY!$A$2:$Q$144,14,FALSE)","v":{"$error":"#N/A"}}]
[]
[null,null,{"$f":"\"Cosmetic Code: \"&VLOOKUP(E1685,INVENTORY!$A$2:$Q$144,15,FALSE)","v":{"$error":"#N/A"}},{"$nulls":5},{"$f":"\"Cosmetic Code: \"&VLOOKUP(K1685,INVENTORY!$A$2:$Q$144,15,FALSE)","v":{"$error":"#N/A"}}]
[]
["Casing","Plugs/Ports",{"$nulls":4},"Casing","Plugs/Ports"]
["Pass","Pass",{"$nulls":4},"Pass","Pass"]
["Fail","Fail",null,"TRRC#:L.T.R.",null,null,"Fail","Fail",null,"TRRC#:L.T.R."]
[]
["LAPTOP TESTING RECORD",{"$nulls":5},"LAPTOP TESTING RECORD"]
[]
[{"$nulls":3},"ITEM #",{"$f":"E1685+2","v":119},{"$nulls":4},"ITEM #",{"$f":"K1685+2","v":120}]
["Tester: ","RR","Date:",{"$f":"NOW()","v":"2026-01-06T11:13:00.960"},null,null,"Tester: ","RR","Date:",{"$f":"NOW()","v":"2026-01-06T11:13:00.960"}]
["Type: ","LAPTOP","SN:",{"$f":"VLOOKUP(E1714,INVENTORYDATA,10,FALSE)","v":{"$error":"#N/A"}},null,null,"Type: ","LAPTOP","SN:",{"$f":"VLOOKUP(K1714,INVENTORYDATA,10,FALSE)","v":{"$error":"#N/A"}}]
[{"$f":"\"Make: \"","v":"Make: "},{"$f":"VLOOKUP(E1714,INVENTORYDATA,2,FALSE)","v":{"$error":"#N/A"}},{"$f":"\"Model: \"","v":"Model: "},{"$f":"VLOOKUP(E1714,INVENTORYDATA,3,FALSE)","v":{"$error":"#N/A"}},null,null,{"$f":"\"Make: \"","v":"Make: "},{"$f":"VLOOKUP(K1714,INVENTORYDATA,2,FALSE)","v":{"$error":"#N/A"}},{"$f":"\"Model: \"","v":"Model: "},{"$f":"VLOOKUP(K1714,INVENTORYDATA,3,FALSE)","v":{"$error":"#N/A"}}]
[{"$f":"\"CPU/Speed: \"","v":"CPU/Speed: "},{"$f":"VLOOKUP(E1714,INVENTORYDATA,4,FALSE)&\" / \"&VLOOKUP(E1714,INVENTORYDATA,5,FALSE)&\"GHz\"","v":{"$error":"#N/A"}},null,{"$f":"\"Memory: \"","v":"Memory: "},{"$f":"VLOOKUP(E1714,INVENTORYDATA,6,FALSE)","v":{"$error":"#N/A"}},null,{"$f":"\"CPU/Speed: \"","v":"CPU/Speed: "},{"$f":"VLOOKUP(K1714,INVENTORYDATA,4,FALSE)&\" / \"&VLOOKUP(K1714,INVENTORYDATA,5,FALSE)&\"GHz\"","v":{"$error":"#N/A"}},null,{"$f":"\"Memory: \"","v":"Memory: "},{"$f":"VLOOKUP(K1714,INVENTORYDATA,6,FALSE)","v":{"$error":"#N/A"}}]
[]
["Key Function",null,"Pass","Fail ","Comments",null,"Key Function",null,"Pass","Fail ","Comments"]
["Hard Drive Removed",null,{"$f":"IF(ISBLANK(VLOOKUP(E1714,INVENTORYDATA,13,FALSE)),\"X\",\"\")","v":""},null,{"$f":"IF(ISBLANK(VLOOKUP(E1714,INVENTORYDATA,13,FALSE)),\"\",VLOOKUP(E1714,INVENTORYDATA,13,FALSE))","v":{"$error":"#N/A"}},null,"Hard Drive Removed",null,{"$f":"IF(ISBLANK(VLOOKUP(K1714,INVENTORYDATA,13,FALSE)),\"X\",\"\")","v":""},null,{"$f":"IF(ISBLANK(VLOOKUP(K1714,INVENTORYDATA,13,FALSE)),\"\",VLOOKUP(K1714,INVENTORYDATA,13,FALSE))","v":{"$error":"#N/A"}}]
["Install Memory",null,"X",{"$nulls":3},"Install Memory",null,"X"]
["Power ON",null,"X",{"$nulls":3},"Power ON",null,"X"]
["Record BIOS info",null,"X",{"$nulls":3},"Record BIOS info",null,"X"]
["Check Optical Drive",null,{"$f":"IF((VLOOKUP(E1714,INVENTORYDATA,7,FALSE))=\"YES\",\"X\",\"\")","v":{"$error":"#N/A"}},{"$f":"IF((VLOOKUP(E1714,INVENTORYDATA,7,FALSE))=\"NO\",\"X\",\"\")","v":{"$error":"#N/A"}},null,null,"Check Optical Drive",null,{"$f":"IF((VLOOKUP(K1714,INVENTORYDATA,7,FALSE))=\"YES\",\"X\",\"\")","v":{"$error":"#N/A"}},{"$f":"IF((VLOOKUP(K1714,INVENTORYDATA,7,FALSE))=\"NO\",\"X\",\"\")","v":{"$error":"#N/A"}}]
["Power Off",null,"X",{"$nulls":3},"Power Off",null,"X"]
["HDD Serial No.",null,{"$f":"IF(ISBLANK(VLOOKUP(E1714,INVENTORYDATA,12,FALSE)),\"\",VLOOKUP(E1714,INVENTORYDATA,12,FALSE))","v":{"$error":"#N/A"}},{"$nulls":3},"HDD Serial No.",null,{"$f":"IF(ISBLANK(VLOOKUP(K1714,INVENTORYDATA,12,FALSE)),\"\",VLOOKUP(K1714,INVENTORYDATA,12,FALSE))","v":{"$error":"#N/A"}}]
[]
["Tested for key functions,R2/Ready for Resale",{"$nulls":5},"Tested for key functions,R2/Ready for Resale"]
["BIOS Lock","Caddy","Optical","WebCam","Battery",null,"BIOS Lock","Caddy","Optical","WebCam","Battery"]
[null,null,{"$f":"VLOOKUP(E1714,INVENTORY!$A$2:$N$144,7,FALSE)","v":{"$error":"#N/A"}},{"$f":"VLOOKUP(E1714,INVENTORY!$A$2:$N$144,8,FALSE)","v":{"$error":"#N/A"}},{"$f":"VLOOKUP(E1714,INVENTORY!$A$2:$N$144,9,FALSE)","v":{"$error":"#N/A"}},{"$nulls":3},{"$f":"VLOOKUP(K1714,INVENTORY!$A$2:$N$144,7,FALSE)","v":{"$error":"#N/A"}},{"$f":"VLOOKUP(K1714,INVENTORY!$A$2:$N$144,8,FALSE)","v":{"$error":"#N/A"}},{"$f":"VLOOKUP(K1714,INVENTORY!$A$2:$N$144,9,FALSE)","v":{"$error":"#N/A"}}]
[]
["CPU Cosmetics Defects:",null,{"$f":"\"Function Code: \"&VLOOKUP(E1714,INVENTORY!$A$2:$Q$144,14,FALSE)","v":{"$error":"#N/A"}},{"$nulls":3},"CPU Cosmetics Defects:",null,{"$f":"\"Function Code: \"&VLOOKUP(K1714,INVENTORY!$A$2:$Q$144,14,FALSE)","v":{"$error":"#N/A"}}]
[]
[null,null,{"$f":"\"Cosmetic Code: \"&VLOOKUP(E1714,INVENTORY!$A$2:$Q$144,15,FALSE)","v":{"$error":"#N/A"}},{"$nulls":5},{"$f":"\"Cosmetic Code: \"&VLOOKUP(K1714,INVENTORY!$A$2:$Q$144,15,FALSE)","v":{"$error":"#N/A"}}]
[]
["Casing","Plugs/Ports",{"$nulls":4},"Casing","Plugs/Ports"]
["Pass","Pass",{"$nulls":4},"Pass","Pass"]
["Fail","Fail",null,"TRRC#:L.T.R.",null,null,"Fail","Fail",null,"TRRC#:L.T.R."]
[]
["LAPTOP TESTING RECORD",{"$nulls":5},"LAPTOP TESTING RECORD"]
[]
[{"$nulls":3},"ITEM #",{"$f":"E1714+2","v":121},{"$nulls":4},"ITEM #",{"$f":"K1714+2","v":122}]
["Tester: ","RR","Date:",{"$f":"NOW()","v":"2026-01-06T11:13:00.960"},null,null,"Tester: ","RR","Date:",{"$f":"NOW()","v":"2026-01-06T11:13:00.960"}]
["Type: ","LAPTOP","SN:",{"$f":"VLOOKUP(E1743,INVENTORYDATA,10,FALSE)","v":{"$error":"#N/A"}},null,null,"Type: ","LAPTOP","SN:",{"$f":"VLOOKUP(K1743,INVENTORYDATA,10,FALSE)","v":{"$error":"#N/A"}}]
[{"$f":"\"Make: \"","v":"Make: "},{"$f":"VLOOKUP(E1743,INVENTORYDATA,2,FALSE)","v":{"$error":"#N/A"}},{"$f":"\"Model: \"","v":"Model: "},{"$f":"VLOOKUP(E1743,INVENTORYDATA,3,FALSE)","v":{"$error":"#N/A"}},null,null,{"$f":"\"Make: \"","v":"Make: "},{"$f":"VLOOKUP(K1743,INVENTORYDATA,2,FALSE)","v":{"$error":"#N/A"}},{"$f":"\"Model: \"","v":"Model: "},{"$f":"VLOOKUP(K1743,INVENTORYDATA,3,FALSE)","v":{"$error":"#N/A"}}]
[{"$f":"\"CPU/Speed: \"","v":"CPU/Speed: "},{"$f":"VLOOKUP(E1743,INVENTORYDATA,4,FALSE)&\" / \"&VLOOKUP(E1743,INVENTORYDATA,5,FALSE)&\"GHz\"","v":{"$error":"#N/A"}},null,{"$f":"\"Memory: \"","v":"Memory: "},{"$f":"VLOOKUP(E1743,INVENTORYDATA,6,FALSE)","v":{"$error":"#N/A"}},null,{"$f":"\"CPU/Speed: \"","v":"CPU/Speed: "},{"$f":"VLOOKUP(K1743,INVENTORYDATA,4,FALSE)&\" / \"&VLOOKUP(K1743,INVENTORYDATA,5,FALSE)&\"GHz\"","v":{"$error":"#N/A"}},null,{"$f":"\"Memory: \"","v":"Memory: "},{"$f":"VLOOKUP(K1743,INVENTORYDATA,6,FALSE)","v":{"$error":"#N/A"}}]
[]
["Key Function",null,"Pass","Fail ","Comments",null,"Key Function",null,"Pass","Fail ","Comments"]
["Hard Drive Removed",null,{"$f":"IF(ISBLANK(VLOOKUP(E1743,INVENTORYDATA,13,FALSE)),\"X\",\"\")","v":""},null,{"$f":"IF(ISBLANK(VLOOKUP(E1743,INVENTORYDATA,13,FALSE)),\"\",VLOOKUP(E1743,INVENTORYDATA,13,FALSE))","v":{"$error":"#N/A"}},null,"Hard Drive Removed",null,{"$f":"IF(ISBLANK(VLOOKUP(K1743,INVENTORYDATA,13,FALSE)),\"X\",\"\")","v":""},null,{"$f":"IF(ISBLANK(VLOOKUP(K1743,INVENTORYDATA,13,FALSE)),\"\",VLOOKUP(K1743,INVENTORYDATA,13,FALSE))","v":{"$error":"#N/A"}}]
["Install Memory",null,"X",{"$nulls":3},"Install Memory",null,"X"]
["Power ON",null,"X",{"$nulls":3},"Power ON",null,"X"]
["Record BIOS info",null,"X",{"$nulls":3},"Record BIOS info",null,"X"]
["Check Optical Drive",null,{"$f":"IF((VLOOKUP(E1743,INVENTORYDATA,7,FALSE))=\"YES\",\"X\",\"\")","v":{"$error":"#N/A"}},{"$f":"IF((VLOOKUP(E1743,INVENTORYDATA,7,FALSE))=\"NO\",\"X\",\"\")","v":{"$error":"#N/A"}},null,null,"Check Optical Drive",null,{"$f":"IF((VLOOKUP(K1743,INVENTORYDATA,7,FALSE))=\"YES\",\"X\",\"\")","v":{"$error":"#N/A"}},{"$f":"IF((VLOOKUP(K1743,INVENTORYDATA,7,FALSE))=\"NO\",\"X\",\"\")","v":{"$error":"#N/A"}}]
["Power Off",null,"X",{"$nulls":3},"Power Off",null,"X"]
["HDD Serial No.",null,{"$f":"IF(ISBLANK(VLOOKUP(E1743,INVENTORYDATA,12,FALSE)),\"\",VLOOKUP(E1743,INVENTORYDATA,12,FALSE))","v":{"$error":"#N/A"}},{"$nulls":3},"HDD Serial No.",null,{"$f":"IF(ISBLANK(VLOOKUP(K1743,INVENTORYDATA,12,FALSE)),\"\",VLOOKUP(K1743,INVENTORYDATA,12,FALSE))","v":{"$error":"#N/A"}}]
[]
["Tested for key functions,R2/Ready for Resale",{"$nulls":5},"Tested for key functions,R2/Ready for Resale"]
["BIOS Lock","Caddy","Optical","WebCam","Battery",null,"BIOS Lock","Caddy","Optical","WebCam","Battery"]
[null,null,{"$f":"VLOOKUP(E1743,INVENTORY!$A$2:$N$144,7,FALSE)","v":{"$error":"#N/A"}},{"$f":"VLOOKUP(E1743,INVENTORY!$A$2:$N$144,8,FALSE)","v":{"$error":"#N/A"}},{"$f":"VLOOKUP(E1743,INVENTORY!$A$2:$N$144,9,FALSE)","v":{"$error":"#N/A"}},{"$nulls":3},{"$f":"VLOOKUP(K1743,INVENTORY!$A$2:$N$144,7,FALSE)","v":{"$error":"#N/A"}},{"$f":"VLOOKUP(K1743,INVENTORY!$A$2:$N$144,8,FALSE)","v":{"$error":"#N/A"}},{"$f":"VLOOKUP(K1743,INVENTORY!$A$2:$N$144,9,FALSE)","v":{"$error":"#N/A"}}]
[]
["CPU Cosmetics Defects:",null,{"$f":"\"Function Code: \"&VLOOKUP(E1743,INVENTORY!$A$2:$Q$144,14,FALSE)","v":{"$error":"#N/A"}},{"$nulls":3},"CPU Cosmetics Defects:",null,{"$f":"\"Function Code: \"&VLOOKUP(K1743,INVENTORY!$A$2:$Q$144,14,FALSE)","v":{"$error":"#N/A"}}]
[]
[null,null,{"$f":"\"Cosmetic Code: \"&VLOOKUP(E1743,INVENTORY!$A$2:$Q$144,15,FALSE)","v":{"$error":"#N/A"}},{"$nulls":5},{"$f":"\"Cosmetic Code: \"&VLOOKUP(K1743,INVENTORY!$A$2:$Q$144,15,FALSE)","v":{"$error":"#N/A"}}]
[]
["Casing","Plugs/Ports",{"$nulls":4},"Casing","Plugs/Ports"]
["Pass","Pass",{"$nulls":4},"Pass","Pass"]
["Fail","Fail",null,"TRRC#:L.T.R.",null,null,"Fail","Fail",null,"TRRC#:L.T.R."]
[]
["LAPTOP TESTING RECORD",{"$nulls":5},"LAPTOP TESTING RECORD"]
[]
[{"$nulls":3},"ITEM #",{"$f":"E1743+2","v":123},{"$nulls":4},"ITEM #",{"$f":"K1743+2","v":124}]
["Tester: ","RR","Date:",{"$f":"NOW()","v":"2026-01-06T11:13:00.960"},null,null,"Tester: ","RR","Date:",{"$f":"NOW()","v":"2026-01-06T11:13:00.960"}]
["Type: ","LAPTOP","SN:",{"$f":"VLOOKUP(E1772,INVENTORYDATA,10,FALSE)","v":{"$error":"#N/A"}},null,null,"Type: ","LAPTOP","SN:",{"$f":"VLOOKUP(K1772,INVENTORYDATA,10,FALSE)","v":{"$error":"#N/A"}}]
[{"$f":"\"Make: \"","v":"Make: "},{"$f":"VLOOKUP(E1772,INVENTORYDATA,2,FALSE)","v":{"$error":"#N/A"}},{"$f":"\"Model: \"","v":"Model: "},{"$f":"VLOOKUP(E1772,INVENTORYDATA,3,FALSE)","v":{"$error":"#N/A"}},null,null,{"$f":"\"Make: \"","v":"Make: "},{"$f":"VLOOKUP(K1772,INVENTORYDATA,2,FALSE)","v":{"$error":"#N/A"}},{"$f":"\"Model: \"","v":"Model: "},{"$f":"VLOOKUP(K1772,INVENTORYDATA,3,FALSE)","v":{"$error":"#N/A"}}]
[{"$f":"\"CPU/Speed: \"","v":"CPU/Speed: "},{"$f":"VLOOKUP(E1772,INVENTORYDATA,4,FALSE)&\" / \"&VLOOKUP(E1772,INVENTORYDATA,5,FALSE)&\"GHz\"","v":{"$error":"#N/A"}},null,{"$f":"\"Memory: \"","v":"Memory: "},{"$f":"VLOOKUP(E1772,INVENTORYDATA,6,FALSE)","v":{"$error":"#N/A"}},null,{"$f":"\"CPU/Speed: \"","v":"CPU/Speed: "},{"$f":"VLOOKUP(K1772,INVENTORYDATA,4,FALSE)&\" / \"&VLOOKUP(K1772,INVENTORYDATA,5,FALSE)&\"GHz\"","v":{"$error":"#N/A"}},null,{"$f":"\"Memory: \"","v":"Memory: "},{"$f":"VLOOKUP(K1772,INVENTORYDATA,6,FALSE)","v":{"$error":"#N/A"}}]
[]
["Key Function",null,"Pass","Fail ","Comments",null,"Key Function",null,"Pass","Fail ","Comments"]
["Hard Drive Removed",null,{"$f":"IF(ISBLANK(VLOOKUP(E1772,INVENTORYDATA,13,FALSE)),\"X\",\"\")","v":""},null,{"$f":"IF(ISBLANK(VLOOKUP(E1772,INVENTORYDATA,13,FALSE)),\"\",VLOOKUP(E1772,INVENTORYDATA,13,FALSE))","v":{"$error":"#N/A"}},null,"Hard Drive Removed",null,{"$f":"IF(ISBLANK(VLOOKUP(K1772,INVENTORYDATA,13,FALSE)),\"X\",\"\")","v":""},null,{"$f":"IF(ISBLANK(VLOOKUP(K1772,INVENTORYDATA,13,FALSE)),\"\",VLOOKUP(K1772,INVENTORYDATA,13,FALSE))","v":{"$error":"#N/A"}}]
["Install Memory",null,"X",{"$nulls":3},"Install Memory",null,"X"]
["Power ON",null,"X",{"$nulls":3},"Power ON",null,"X"]
["Record BIOS info",null,"X",{"$nulls":3},"Record BIOS info",null,"X"]
["Check Optical Drive",null,{"$f":"IF((VLOOKUP(E1772,INVENTORYDATA,7,FALSE))=\"YES\",\"X\",\"\")","v":{"$error":"#N/A"}},{"$f":"IF((VLOOKUP(E1772,INVENTORYDATA,7,FALSE))=\"NO\",\"X\",\"\")","v":{"$error":"#N/A"}},null,null,"Check Optical Drive",null,{"$f":"IF((VLOOKUP(K1772,INVENTORYDATA,7,FALSE))=\"YES\",\"X\",\"\")","v":{"$error":"#N/A"}},{"$f":"IF((VLOOKUP(K1772,INVENTORYDATA,7,FALSE))=\"NO\",\"X\",\"\")","v":{"$error":"#N/A"}}]
["Power Off",null,"X",{"$nulls":3},"Power Off",null,"X"]
["HDD Serial No.",null,{"$f":"IF(ISBLANK(VLOOKUP(E1772,INVENTORYDATA,12,FALSE)),\"\",VLOOKUP(E1772,INVENTORYDATA,12,FALSE))","v":{"$error":"#N/A"}},{"$nulls":3},"HDD Serial No.",null,{"$f":"IF(ISBLANK(VLOOKUP(K1772,INVENTORYDATA,12,FALSE)),\"\",VLOOKUP(K1772,INVENTORYDATA,12,FALSE))","v":{"$error":"#N/A"}}]
[]
["Tested for key functions,R2/Ready for Resale",{"$nulls":5},"Tested for key functions,R2/Ready for Resale"]
["BIOS Lock","Caddy","Optical","WebCam","Battery",null,"BIOS Lock","Caddy","Optical","WebCam","Battery"]
[null,null,{"$f":"VLOOKUP(E1772,INVENTORY!$A$2:$N$144,7,FALSE)","v":{"$error":"#N/A"}},{"$f":"VLOOKUP(E1772,INVENTORY!$A$2:$N$144,8,FALSE)","v":{"$error":"#N/A"}},{"$f":"VLOOKUP(E1772,INVENTORY!$A$2:$N$144,9,FALSE)","v":{"$error":"#N/A"}},{"$nulls":3},{"$f":"VLOOKUP(K1772,INVENTORY!$A$2:$N$144,7,FALSE)","v":{"$error":"#N/A"}},{"$f":"VLOOKUP(K1772,INVENTORY!$A$2:$N$144,8,FALSE)","v":{"$error":"#N/A"}},{"$f":"VLOOKUP(K1772,INVENTORY!$A$2:$N$144,9,FALSE)","v":{"$error":"#N/A"}}]
[]
["CPU Cosmetics Defects:",null,{"$f":"\"Function Code: \"&VLOOKUP(E1772,INVENTORY!$A$2:$Q$144,14,FALSE)","v":{"$error":"#N/A"}},{"$nulls":3},"CPU Cosmetics Defects:",null,{"$f":"\"Function Code: \"&VLOOKUP(K1772,INVENTORY!$A$2:$Q$144,14,FALSE)","v":{"$error":"#N/A"}}]
[]
[null,null,{"$f":"\"Cosmetic Code: \"&VLOOKUP(E1772,INVENTORY!$A$2:$Q$144,15,FALSE)","v":{"$error":"#N/A"}},{"$nulls":5},{"$f":"\"Cosmetic Code: \"&VLOOKUP(K1772,INVENTORY!$A$2:$Q$144,15,FALSE)","v":{"$error":"#N/A"}}]
[]
["Casing","Plugs/Ports",{"$nulls":4},"Casing","Plugs/Ports"]
["Pass","Pass",{"$nulls":4},"Pass","Pass"]
["Fail","Fail",null,"TRRC#:L.T.R.",null,null,"Fail","Fail",null,"TRRC#:L.T.R."]
[]
["LAPTOP TESTING RECORD",{"$nulls":5},"LAPTOP TESTING RECORD"]
[]
[{"$nulls":3},"ITEM #",{"$f":"E1772+2","v":125},{"$nulls":4},"ITEM #",{"$f":"K1772+2","v":126}]
["Tester: ","RR","Date:",{"$f":"NOW()","v":"2026-01-06T11:13:00.960"},null,null,"Tester: ","RR","Date:",{"$f":"NOW()","v":"2026-01-06T11:13:00.960"}]
["Type: ","LAPTOP","SN:",{"$f":"VLOOKUP(E1801,INVENTORYDATA,10,FALSE)","v":{"$error":"#N/A"}},null,null,"Type: ","LAPTOP","SN:",{"$f":"VLOOKUP(K1801,INVENTORYDATA,10,FALSE)","v":{"$error":"#N/A"}}]
[{"$f":"\"Make: \"","v":"Make: "},{"$f":"VLOOKUP(E1801,INVENTORYDATA,2,FALSE)","v":{"$error":"#N/A"}},{"$f":"\"Model: \"","v":"Model: "},{"$f":"VLOOKUP(E1801,INVENTORYDATA,3,FALSE)","v":{"$error":"#N/A"}},null,null,{"$f":"\"Make: \"","v":"Make: "},{"$f":"VLOOKUP(K1801,INVENTORYDATA,2,FALSE)","v":{"$error":"#N/A"}},{"$f":"\"Model: \"","v":"Model: "},{"$f":"VLOOKUP(K1801,INVENTORYDATA,3,FALSE)","v":{"$error":"#N/A"}}]
[{"$f":"\"CPU/Speed: \"","v":"CPU/Speed: "},{"$f":"VLOOKUP(E1801,INVENTORYDATA,4,FALSE)&\" / \"&VLOOKUP(E1801,INVENTORYDATA,5,FALSE)&\"GHz\"","v":{"$error":"#N/A"}},null,{"$f":"\"Memory: \"","v":"Memory: "},{"$f":"VLOOKUP(E1801,INVENTORYDATA,6,FALSE)","v":{"$error":"#N/A"}},null,{"$f":"\"CPU/Speed: \"","v":"CPU/Speed: "},{"$f":"VLOOKUP(K1801,INVENTORYDATA,4,FALSE)&\" / \"&VLOOKUP(K1801,INVENTORYDATA,5,FALSE)&\"GHz\"","v":{"$error":"#N/A"}},null,{"$f":"\"Memory: \"","v":"Memory: "},{"$f":"VLOOKUP(K1801,INVENTORYDATA,6,FALSE)","v":{"$error":"#N/A"}}]
[]
["Key Function",null,"Pass","Fail ","Comments",null,"Key Function",null,"Pass","Fail ","Comments"]
["Hard Drive Removed",null,{"$f":"IF(ISBLANK(VLOOKUP(E1801,INVENTORYDATA,13,FALSE)),\"X\",\"\")","v":""},null,{"$f":"IF(ISBLANK(VLOOKUP(E1801,INVENTORYDATA,13,FALSE)),\"\",VLOOKUP(E1801,INVENTORYDATA,13,FALSE))","v":{"$error":"#N/A"}},null,"Hard Drive Removed",null,{"$f":"IF(ISBLANK(VLOOKUP(K1801,INVENTORYDATA,13,FALSE)),\"X\",\"\")","v":""},null,{"$f":"IF(ISBLANK(VLOOKUP(K1801,INVENTORYDATA,13,FALSE)),\"\",VLOOKUP(K1801,INVENTORYDATA,13,FALSE))","v":{"$error":"#N/A"}}]
["Install Memory",null,"X",{"$nulls":3},"Install Memory",null,"X"]
["Power ON",null,"X",{"$nulls":3},"Power ON",null,"X"]
["Record BIOS info",null,"X",{"$nulls":3},"Record BIOS info",null,"X"]
["Check Optical Drive",null,{"$f":"IF((VLOOKUP(E1801,INVENTORYDATA,7,FALSE))=\"YES\",\"X\",\"\")","v":{"$error":"#N/A"}},{"$f":"IF((VLOOKUP(E1801,INVENTORYDATA,7,FALSE))=\"NO\",\"X\",\"\")","v":{"$error":"#N/A"}},null,null,"Check Optical Drive",null,{"$f":"IF((VLOOKUP(K1801,INVENTORYDATA,7,FALSE))=\"YES\",\"X\",\"\")","v":{"$error":"#N/A"}},{"$f":"IF((VLOOKUP(K1801,INVENTORYDATA,7,FALSE))=\"NO\",\"X\",\"\")","v":{"$error":"#N/A"}}]
["Power Off",null,"X",{"$nulls":3},"Power Off",null,"X"]
["HDD Serial No.",null,{"$f":"IF(ISBLANK(VLOOKUP(E1801,INVENTORYDATA,12,FALSE)),\"\",VLOOKUP(E1801,INVENTORYDATA,12,FALSE))","v":{"$error":"#N/A"}},{"$nulls":3},"HDD Serial No.",null,{"$f":"IF(ISBLANK(VLOOKUP(K1801,INVENTORYDATA,12,FALSE)),\"\",VLOOKUP(K1801,INVENTORYDATA,12,FALSE))","v":{"$error":"#N/A"}}]
[]
["Tested for key functions,R2/Ready for Resale",{"$nulls":5},"Tested for key functions,R2/Ready for Resale"]
["BIOS Lock","Caddy","Optical","WebCam","Battery",null,"BIOS Lock","Caddy","Optical","WebCam","Battery"]
[null,null,{"$f":"VLOOKUP(E1801,INVENTORY!$A$2:$N$144,7,FALSE)","v":{"$error":"#N/A"}},{"$f":"VLOOKUP(E1801,INVENTORY!$A$2:$N$144,8,FALSE)","v":{"$error":"#N/A"}},{"$f":"VLOOKUP(E1801,INVENTORY!$A$2:$N$144,9,FALSE)","v":{"$error":"#N/A"}},{"$nulls":3},{"$f":"VLOOKUP(K1801,INVENTORY!$A$2:$N$144,7,FALSE)","v":{"$error":"#N/A"}},{"$f":"VLOOKUP(K1801,INVENTORY!$A$2:$N$144,8,FALSE)","v":{"$error":"#N/A"}},{"$f":"VLOOKUP(K1801,INVENTORY!$A$2:$N$144,9,FALSE)","v":{"$error":"#N/A"}}]
[]
["CPU Cosmetics Defects:",null,{"$f":"\"Function Code: \"&VLOOKUP(E1801,INVENTORY!$A$2:$Q$144,14,FALSE)","v":{"$error":"#N/A"}},{"$nulls":3},"CPU Cosmetics Defects:",null,{"$f":"\"Function Code: \"&VLOOKUP(K1801,INVENTORY!$A$2:$Q$144,14,FALSE)","v":{"$error":"#N/A"}}]
[]
[null,null,{"$f":"\"Cosmetic Code: \"&VLOOKUP(E1801,INVENTORY!$A$2:$Q$144,15,FALSE)","v":{"$error":"#N/A"}},{"$nulls":5},{"$f":"\"Cosmetic Code: \"&VLOOKUP(K1801,INVENTORY!$A$2:$Q$144,15,FALSE)","v":{"$error":"#N/A"}}]
[]
["Casing","Plugs/Ports",{"$nulls":4},"Casing","Plugs/Ports"]
["Pass","Pass",{"$nulls":4},"Pass","Pass"]
["Fail","Fail",null,"TRRC#:L.T.R.",null,null,"Fail","Fail",null,"TRRC#:L.T.R."]
[]
["LAPTOP TESTING RECORD",{"$nulls":5},"LAPTOP TESTING RECORD"]
[]
[{"$nulls":3},"ITEM #",{"$f":"E1801+2","v":127},{"$nulls":4},"ITEM #",{"$f":"K1801+2","v":128}]
["Tester: ","RR","Date:",{"$f":"NOW()","v":"2026-01-06T11:13:00.960"},null,null,"Tester: ","RR","Date:",{"$f":"NOW()","v":"2026-01-06T11:13:00.960"}]
["Type: ","LAPTOP","SN:",{"$f":"VLOOKUP(E1830,INVENTORYDATA,10,FALSE)","v":{"$error":"#N/A"}},null,null,"Type: ","LAPTOP","SN:",{"$f":"VLOOKUP(K1830,INVENTORYDATA,10,FALSE)","v":{"$error":"#N/A"}}]
[{"$f":"\"Make: \"","v":"Make: "},{"$f":"VLOOKUP(E1830,INVENTORYDATA,2,FALSE)","v":{"$error":"#N/A"}},{"$f":"\"Model: \"","v":"Model: "},{"$f":"VLOOKUP(E1830,INVENTORYDATA,3,FALSE)","v":{"$error":"#N/A"}},null,null,{"$f":"\"Make: \"","v":"Make: "},{"$f":"VLOOKUP(K1830,INVENTORYDATA,2,FALSE)","v":{"$error":"#N/A"}},{"$f":"\"Model: \"","v":"Model: "},{"$f":"VLOOKUP(K1830,INVENTORYDATA,3,FALSE)","v":{"$error":"#N/A"}}]
[{"$f":"\"CPU/Speed: \"","v":"CPU/Speed: "},{"$f":"VLOOKUP(E1830,INVENTORYDATA,4,FALSE)&\" / \"&VLOOKUP(E1830,INVENTORYDATA,5,FALSE)&\"GHz\"","v":{"$error":"#N/A"}},null,{"$f":"\"Memory: \"","v":"Memory: "},{"$f":"VLOOKUP(E1830,INVENTORYDATA,6,FALSE)","v":{"$error":"#N/A"}},null,{"$f":"\"CPU/Speed: \"","v":"CPU/Speed: "},{"$f":"VLOOKUP(K1830,INVENTORYDATA,4,FALSE)&\" / \"&VLOOKUP(K1830,INVENTORYDATA,5,FALSE)&\"GHz\"","v":{"$error":"#N/A"}},null,{"$f":"\"Memory: \"","v":"Memory: "},{"$f":"VLOOKUP(K1830,INVENTORYDATA,6,FALSE)","v":{"$error":"#N/A"}}]
[]
["Key Function",null,"Pass","Fail ","Comments",null,"Key Function",null,"Pass","Fail ","Comments"]
["Hard Drive Removed",null,{"$f":"IF(ISBLANK(VLOOKUP(E1830,INVENTORYDATA,13,FALSE)),\"X\",\"\")","v":""},null,{"$f":"IF(ISBLANK(VLOOKUP(E1830,INVENTORYDATA,13,FALSE)),\"\",VLOOKUP(E1830,INVENTORYDATA,13,FALSE))","v":{"$error":"#N/A"}},null,"Hard Drive Removed",null,{"$f":"IF(ISBLANK(VLOOKUP(K1830,INVENTORYDATA,13,FALSE)),\"X\",\"\")","v":""},null,{"$f":"IF(ISBLANK(VLOOKUP(K1830,INVENTORYDATA,13,FALSE)),\"\",VLOOKUP(K1830,INVENTORYDATA,13,FALSE))","v":{"$error":"#N/A"}}]
["Install Memory",null,"X",{"$nulls":3},"Install Memory",null,"X"]
["Power ON",null,"X",{"$nulls":3},"Power ON",null,"X"]
["Record BIOS info",null,"X",{"$nulls":3},"Record BIOS info",null,"X"]
["Check Optical Drive",null,{"$f":"IF((VLOOKUP(E1830,INVENTORYDATA,7,FALSE))=\"YES\",\"X\",\"\")","v":{"$error":"#N/A"}},{"$f":"IF((VLOOKUP(E1830,INVENTORYDATA,7,FALSE))=\"NO\",\"X\",\"\")","v":{"$error":"#N/A"}},null,null,"Check Optical Drive",null,{"$f":"IF((VLOOKUP(K1830,INVENTORYDATA,7,FALSE))=\"YES\",\"X\",\"\")","v":{"$error":"#N/A"}},{"$f":"IF((VLOOKUP(K1830,INVENTORYDATA,7,FALSE))=\"NO\",\"X\",\"\")","v":{"$error":"#N/A"}}]
["Power Off",null,"X",{"$nulls":3},"Power Off",null,"X"]
["HDD Serial No.",null,{"$f":"IF(ISBLANK(VLOOKUP(E1830,INVENTORYDATA,12,FALSE)),\"\",VLOOKUP(E1830,INVENTORYDATA,12,FALSE))","v":{"$error":"#N/A"}},{"$nulls":3},"HDD Serial No.",null,{"$f":"IF(ISBLANK(VLOOKUP(K1830,INVENTORYDATA,12,FALSE)),\"\",VLOOKUP(K1830,INVENTORYDATA,12,FALSE))","v":{"$error":"#N/A"}}]
[]
["Tested for key functions,R2/Ready for Resale",{"$nulls":5},"Tested for key functions,R2/Ready for Resale"]
["BIOS Lock","Caddy","Optical","WebCam","Battery",null,"BIOS Lock","Caddy","Optical","WebCam","Battery"]
[null,null,{"$f":"VLOOKUP(E1830,INVENTORY!$A$2:$N$144,7,FALSE)","v":{"$error":"#N/A"}},{"$f":"VLOOKUP(E1830,INVENTORY!$A$2:$N$144,8,FALSE)","v":{"$error":"#N/A"}},{"$f":"VLOOKUP(E1830,INVENTORY!$A$2:$N$144,9,FALSE)","v":{"$error":"#N/A"}},{"$nulls":3},{"$f":"VLOOKUP(K1830,INVENTORY!$A$2:$N$144,7,FALSE)","v":{"$error":"#N/A"}},{"$f":"VLOOKUP(K1830,INVENTORY!$A$2:$N$144,8,FALSE)","v":{"$error":"#N/A"}},{"$f":"VLOOKUP(K1830,INVENTORY!$A$2:$N$144,9,FALSE)","v":{"$error":"#N/A"}}]
[]
["CPU Cosmetics Defects:",null,{"$f":"\"Function Code: \"&VLOOKUP(E1830,INVENTORY!$A$2:$Q$144,14,FALSE)","v":{"$error":"#N/A"}},{"$nulls":3},"CPU Cosmetics Defects:",null,{"$f":"\"Function Code: \"&VLOOKUP(K1830,INVENTORY!$A$2:$Q$144,14,FALSE)","v":{"$error":"#N/A"}}]
[]
[null,null,{"$f":"\"Cosmetic Code: \"&VLOOKUP(E1830,INVENTORY!$A$2:$Q$144,15,FALSE)","v":{"$error":"#N/A"}},{"$nulls":5},{"$f":"\"Cosmetic Code: \"&VLOOKUP(K1830,INVENTORY!$A$2:$Q$144,15,FALSE)","v":{"$error":"#N/A"}}]
[]
["Casing","Plugs/Ports",{"$nulls":4},"Casing","Plugs/Ports"]
["Pass","Pass",{"$nulls":4},"Pass","Pass"]
["Fail","Fail",null,"TRRC#:L.T.R.",null,null,"Fail","Fail",null,"TRRC#:L.T.R."]
[]
["LAPTOP TESTING RECORD",{"$nulls":5},"LAPTOP TESTING RECORD"]
[]
[{"$nulls":3},"ITEM #",{"$f":"E1830+2","v":129},{"$nulls":4},"ITEM #",{"$f":"K1830+2","v":130}]
["Tester: ","RR","Date:",{"$f":"NOW()","v":"2026-01-06T11:13:00.960"},null,null,"Tester: ","RR","Date:",{"$f":"NOW()","v":"2026-01-06T11:13:00.960"}]
["Type: ","LAPTOP","SN:",{"$f":"VLOOKUP(E1859,INVENTORYDATA,10,FALSE)","v":{"$error":"#N/A"}},null,null,"Type: ","LAPTOP","SN:",{"$f":"VLOOKUP(K1859,INVENTORYDATA,10,FALSE)","v":{"$error":"#N/A"}}]
[{"$f":"\"Make: \"","v":"Make: "},{"$f":"VLOOKUP(E1859,INVENTORYDATA,2,FALSE)","v":{"$error":"#N/A"}},{"$f":"\"Model: \"","v":"Model: "},{"$f":"VLOOKUP(E1859,INVENTORYDATA,3,FALSE)","v":{"$error":"#N/A"}},null,null,{"$f":"\"Make: \"","v":"Make: "},{"$f":"VLOOKUP(K1859,INVENTORYDATA,2,FALSE)","v":{"$error":"#N/A"}},{"$f":"\"Model: \"","v":"Model: "},{"$f":"VLOOKUP(K1859,INVENTORYDATA,3,FALSE)","v":{"$error":"#N/A"}}]
[{"$f":"\"CPU/Speed: \"","v":"CPU/Speed: "},{"$f":"VLOOKUP(E1859,INVENTORYDATA,4,FALSE)&\" / \"&VLOOKUP(E1859,INVENTORYDATA,5,FALSE)&\"GHz\"","v":{"$error":"#N/A"}},null,{"$f":"\"Memory: \"","v":"Memory: "},{"$f":"VLOOKUP(E1859,INVENTORYDATA,6,FALSE)","v":{"$error":"#N/A"}},null,{"$f":"\"CPU/Speed: \"","v":"CPU/Speed: "},{"$f":"VLOOKUP(K1859,INVENTORYDATA,4,FALSE)&\" / \"&VLOOKUP(K1859,INVENTORYDATA,5,FALSE)&\"GHz\"","v":{"$error":"#N/A"}},null,{"$f":"\"Memory: \"","v":"Memory: "},{"$f":"VLOOKUP(K1859,INVENTORYDATA,6,FALSE)","v":{"$error":"#N/A"}}]
[]
["Key Function",null,"Pass","Fail ","Comments",null,"Key Function",null,"Pass","Fail ","Comments"]
["Hard Drive Removed",null,{"$f":"IF(ISBLANK(VLOOKUP(E1859,INVENTORYDATA,13,FALSE)),\"X\",\"\")","v":""},null,{"$f":"IF(ISBLANK(VLOOKUP(E1859,INVENTORYDATA,13,FALSE)),\"\",VLOOKUP(E1859,INVENTORYDATA,13,FALSE))","v":{"$error":"#N/A"}},null,"Hard Drive Removed",null,{"$f":"IF(ISBLANK(VLOOKUP(K1859,INVENTORYDATA,13,FALSE)),\"X\",\"\")","v":""},null,{"$f":"IF(ISBLANK(VLOOKUP(K1859,INVENTORYDATA,13,FALSE)),\"\",VLOOKUP(K1859,INVENTORYDATA,13,FALSE))","v":{"$error":"#N/A"}}]
["Install Memory",null,"X",{"$nulls":3},"Install Memory",null,"X"]
["Power ON",null,"X",{"$nulls":3},"Power ON",null,"X"]
["Record BIOS info",null,"X",{"$nulls":3},"Record BIOS info",null,"X"]
["Check Optical Drive",null,{"$f":"IF((VLOOKUP(E1859,INVENTORYDATA,7,FALSE))=\"YES\",\"X\",\"\")","v":{"$error":"#N/A"}},{"$f":"IF((VLOOKUP(E1859,INVENTORYDATA,7,FALSE))=\"NO\",\"X\",\"\")","v":{"$error":"#N/A"}},null,null,"Check Optical Drive",null,{"$f":"IF((VLOOKUP(K1859,INVENTORYDATA,7,FALSE))=\"YES\",\"X\",\"\")","v":{"$error":"#N/A"}},{"$f":"IF((VLOOKUP(K1859,INVENTORYDATA,7,FALSE))=\"NO\",\"X\",\"\")","v":{"$error":"#N/A"}}]
["Power Off",null,"X",{"$nulls":3},"Power Off",null,"X"]
["HDD Serial No.",null,{"$f":"IF(ISBLANK(VLOOKUP(E1859,INVENTORYDATA,12,FALSE)),\"\",VLOOKUP(E1859,INVENTORYDATA,12,FALSE))","v":{"$error":"#N/A"}},{"$nulls":3},"HDD Serial No.",null,{"$f":"IF(ISBLANK(VLOOKUP(K1859,INVENTORYDATA,12,FALSE)),\"\",VLOOKUP(K1859,INVENTORYDATA,12,FALSE))","v":{"$error":"#N/A"}}]
[]
["Tested for key functions,R2/Ready for Resale",{"$nulls":5},"Tested for key functions,R2/Ready for Resale"]
["BIOS Lock","Caddy","Optical","WebCam","Battery",null,"BIOS Lock","Caddy","Optical","WebCam","Battery"]
[null,null,{"$f":"VLOOKUP(E1859,INVENTORY!$A$2:$N$144,7,FALSE)","v":{"$error":"#N/A"}},{"$f":"VLOOKUP(E1859,INVENTORY!$A$2:$N$144,8,FALSE)","v":{"$error":"#N/A"}},{"$f":"VLOOKUP(E1859,INVENTORY!$A$2:$N$144,9,FALSE)","v":{"$error":"#N/A"}},{"$nulls":3},{"$f":"VLOOKUP(K1859,INVENTORY!$A$2:$N$144,7,FALSE)","v":{"$error":"#N/A"}},{"$f":"VLOOKUP(K1859,INVENTORY!$A$2:$N$144,8,FALSE)","v":{"$error":"#N/A"}},{"$f":"VLOOKUP(K1859,INVENTORY!$A$2:$N$144,9,FALSE)","v":{"$error":"#N/A"}}]
[]
["CPU Cosmetics Defects:",null,{"$f":"\"Function Code: \"&VLOOKUP(E1859,INVENTORY!$A$2:$Q$144,14,FALSE)","v":{"$error":"#N/A"}},{"$nulls":3},"CPU Cosmetics Defects:",null,{"$f":"\"Function Code: \"&VLOOKUP(K1859,INVENTORY!$A$2:$Q$144,14,FALSE)","v":{"$error":"#N/A"}}]
[]
[null,null,{"$f":"\"Cosmetic Code: \"&VLOOKUP(E1859,INVENTORY!$A$2:$Q$144,15,FALSE)","v":{"$error":"#N/A"}},{"$nulls":5},{"$f":"\"Cosmetic Code: \"&VLOOKUP(K1859,INVENTORY!$A$2:$Q$144,15,FALSE)","v":{"$error":"#N/A"}}]
[]
["Casing","Plugs/Ports",{"$nulls":4},"Casing","Plugs/Ports"]
["Pass","Pass",{"$nulls":4},"Pass","Pass"]
["Fail","Fail",null,"TRRC#:L.T.R.",null,null,"Fail","Fail",null,"TRRC#:L.T.R."]
[]
["LAPTOP TESTING RECORD",{"$nulls":5},"LAPTOP TESTING RECORD"]
[]
[{"$nulls":3},"ITEM #",{"$f":"E1859+2","v":131},{"$nulls":4},"ITEM #",{"$f":"K1859+2","v":132}]
["Tester: ","RR","Date:",{"$f":"NOW()","v":"2026-01-06T11:13:00.960"},null,null,"Tester: ","RR","Date:",{"$f":"NOW()","v":"2026-01-06T11:13:00.960"}]
["Type: ","LAPTOP","SN:",{"$f":"VLOOKUP(E1888,INVENTORYDATA,10,FALSE)","v":{"$error":"#N/A"}},null,null,"Type: ","LAPTOP","SN:",{"$f":"VLOOKUP(K1888,INVENTORYDATA,10,FALSE)","v":{"$error":"#N/A"}}]
[{"$f":"\"Make: \"","v":"Make: "},{"$f":"VLOOKUP(E1888,INVENTORYDATA,2,FALSE)","v":{"$error":"#N/A"}},{"$f":"\"Model: \"","v":"Model: "},{"$f":"VLOOKUP(E1888,INVENTORYDATA,3,FALSE)","v":{"$error":"#N/A"}},null,null,{"$f":"\"Make: \"","v":"Make: "},{"$f":"VLOOKUP(K1888,INVENTORYDATA,2,FALSE)","v":{"$error":"#N/A"}},{"$f":"\"Model: \"","v":"Model: "},{"$f":"VLOOKUP(K1888,INVENTORYDATA,3,FALSE)","v":{"$error":"#N/A"}}]
[{"$f":"\"CPU/Speed: \"","v":"CPU/Speed: "},{"$f":"VLOOKUP(E1888,INVENTORYDATA,4,FALSE)&\" / \"&VLOOKUP(E1888,INVENTORYDATA,5,FALSE)&\"GHz\"","v":{"$error":"#N/A"}},null,{"$f":"\"Memory: \"","v":"Memory: "},{"$f":"VLOOKUP(E1888,INVENTORYDATA,6,FALSE)","v":{"$error":"#N/A"}},null,{"$f":"\"CPU/Speed: \"","v":"CPU/Speed: "},{"$f":"VLOOKUP(K1888,INVENTORYDATA,4,FALSE)&\" / \"&VLOOKUP(K1888,INVENTORYDATA,5,FALSE)&\"GHz\"","v":{"$error":"#N/A"}},null,{"$f":"\"Memory: \"","v":"Memory: "},{"$f":"VLOOKUP(K1888,INVENTORYDATA,6,FALSE)","v":{"$error":"#N/A"}}]
[]
["Key Function",null,"Pass","Fail ","Comments",null,"Key Function",null,"Pass","Fail ","Comments"]
["Hard Drive Removed",null,{"$f":"IF(ISBLANK(VLOOKUP(E1888,INVENTORYDATA,13,FALSE)),\"X\",\"\")","v":""},null,{"$f":"IF(ISBLANK(VLOOKUP(E1888,INVENTORYDATA,13,FALSE)),\"\",VLOOKUP(E1888,INVENTORYDATA,13,FALSE))","v":{"$error":"#N/A"}},null,"Hard Drive Removed",null,{"$f":"IF(ISBLANK(VLOOKUP(K1888,INVENTORYDATA,13,FALSE)),\"X\",\"\")","v":""},null,{"$f":"IF(ISBLANK(VLOOKUP(K1888,INVENTORYDATA,13,FALSE)),\"\",VLOOKUP(K1888,INVENTORYDATA,13,FALSE))","v":{"$error":"#N/A"}}]
["Install Memory",null,"X",{"$nulls":3},"Install Memory",null,"X"]
["Power ON",null,"X",{"$nulls":3},"Power ON",null,"X"]
["Record BIOS info",null,"X",{"$nulls":3},"Record BIOS info",null,"X"]
["Check Optical Drive",null,{"$f":"IF((VLOOKUP(E1888,INVENTORYDATA,7,FALSE))=\"YES\",\"X\",\"\")","v":{"$error":"#N/A"}},{"$f":"IF((VLOOKUP(E1888,INVENTORYDATA,7,FALSE))=\"NO\",\"X\",\"\")","v":{"$error":"#N/A"}},null,null,"Check Optical Drive",null,{"$f":"IF((VLOOKUP(K1888,INVENTORYDATA,7,FALSE))=\"YES\",\"X\",\"\")","v":{"$error":"#N/A"}},{"$f":"IF((VLOOKUP(K1888,INVENTORYDATA,7,FALSE))=\"NO\",\"X\",\"\")","v":{"$error":"#N/A"}}]
["Power Off",null,"X",{"$nulls":3},"Power Off",null,"X"]
["HDD Serial No.",null,{"$f":"IF(ISBLANK(VLOOKUP(E1888,INVENTORYDATA,12,FALSE)),\"\",VLOOKUP(E1888,INVENTORYDATA,12,FALSE))","v":{"$error":"#N/A"}},{"$nulls":3},"HDD Serial No.",null,{"$f":"IF(ISBLANK(VLOOKUP(K1888,INVENTORYDATA,12,FALSE)),\"\",VLOOKUP(K1888,INVENTORYDATA,12,FALSE))","v":{"$error":"#N/A"}}]
[]
["Tested for key functions,R2/Ready for Resale",{"$nulls":5},"Tested for key functions,R2/Ready for Resale"]
["BIOS Lock","Caddy","Optical","WebCam","Battery",null,"BIOS Lock","Caddy","Optical","WebCam","Battery"]
[null,null,{"$f":"VLOOKUP(E1888,INVENTORY!$A$2:$N$144,7,FALSE)","v":{"$error":"#N/A"}},{"$f":"VLOOKUP(E1888,INVENTORY!$A$2:$N$144,8,FALSE)","v":{"$error":"#N/A"}},{"$f":"VLOOKUP(E1888,INVENTORY!$A$2:$N$144,9,FALSE)","v":{"$error":"#N/A"}},{"$nulls":3},{"$f":"VLOOKUP(K1888,INVENTORY!$A$2:$N$144,7,FALSE)","v":{"$error":"#N/A"}},{"$f":"VLOOKUP(K1888,INVENTORY!$A$2:$N$144,8,FALSE)","v":{"$error":"#N/A"}},{"$f":"VLOOKUP(K1888,INVENTORY!$A$2:$N$144,9,FALSE)","v":{"$error":"#N/A"}}]
[]
["CPU Cosmetics Defects:",null,{"$f":"\"Function Code: \"&VLOOKUP(E1888,INVENTORY!$A$2:$Q$144,14,FALSE)","v":{"$error":"#N/A"}},{"$nulls":3},"CPU Cosmetics Defects:",null,{"$f":"\"Function Code: \"&VLOOKUP(K1888,INVENTORY!$A$2:$Q$144,14,FALSE)","v":{"$error":"#N/A"}}]
[]
[null,null,{"$f":"\"Cosmetic Code: \"&VLOOKUP(E1888,INVENTORY!$A$2:$Q$144,15,FALSE)","v":{"$error":"#N/A"}},{"$nulls":5},{"$f":"\"Cosmetic Code: \"&VLOOKUP(K1888,INVENTORY!$A$2:$Q$144,15,FALSE)","v":{"$error":"#N/A"}}]
[]
["Casing","Plugs/Ports",{"$nulls":4},"Casing","Plugs/Ports"]
["Pass","Pass",{"$nulls":4},"Pass","Pass"]
["Fail","Fail",null,"TRRC#:L.T.R.",null,null,"Fail","Fail",null,"TRRC#:L.T.R."]
[]
["LAPTOP TESTING RECORD",{"$nulls":5},"LAPTOP TESTING RECORD"]
[]
[{"$nulls":3},"ITEM #",{"$f":"E1888+2","v":133},{"$nulls":4},"ITEM #",{"$f":"K1888+2","v":134}]
["Tester: ","RR","Date:",{"$f":"NOW()","v":"2026-01-06T11:13:00.960"},null,null,"Tester: ","RR","Date:",{"$f":"NOW()","v":"2026-01-06T11:13:00.960"}]
["Type: ","LAPTOP","SN:",{"$f":"VLOOKUP(E1917,INVENTORYDATA,10,FALSE)","v":{"$error":"#N/A"}},null,null,"Type: ","LAPTOP","SN:",{"$f":"VLOOKUP(K1917,INVENTORYDATA,10,FALSE)","v":{"$error":"#N/A"}}]
[{"$f":"\"Make: \"","v":"Make: "},{"$f":"VLOOKUP(E1917,INVENTORYDATA,2,FALSE)","v":{"$error":"#N/A"}},{"$f":"\"Model: \"","v":"Model: "},{"$f":"VLOOKUP(E1917,INVENTORYDATA,3,FALSE)","v":{"$error":"#N/A"}},null,null,{"$f":"\"Make: \"","v":"Make: "},{"$f":"VLOOKUP(K1917,INVENTORYDATA,2,FALSE)","v":{"$error":"#N/A"}},{"$f":"\"Model: \"","v":"Model: "},{"$f":"VLOOKUP(K1917,INVENTORYDATA,3,FALSE)","v":{"$error":"#N/A"}}]
[{"$f":"\"CPU/Speed: \"","v":"CPU/Speed: "},{"$f":"VLOOKUP(E1917,INVENTORYDATA,4,FALSE)&\" / \"&VLOOKUP(E1917,INVENTORYDATA,5,FALSE)&\"GHz\"","v":{"$error":"#N/A"}},null,{"$f":"\"Memory: \"","v":"Memory: "},{"$f":"VLOOKUP(E1917,INVENTORYDATA,6,FALSE)","v":{"$error":"#N/A"}},null,{"$f":"\"CPU/Speed: \"","v":"CPU/Speed: "},{"$f":"VLOOKUP(K1917,INVENTORYDATA,4,FALSE)&\" / \"&VLOOKUP(K1917,INVENTORYDATA,5,FALSE)&\"GHz\"","v":{"$error":"#N/A"}},null,{"$f":"\"Memory: \"","v":"Memory: "},{"$f":"VLOOKUP(K1917,INVENTORYDATA,6,FALSE)","v":{"$error":"#N/A"}}]
[]
["Key Function",null,"Pass","Fail ","Comments",null,"Key Function",null,"Pass","Fail ","Comments"]
["Hard Drive Removed",null,{"$f":"IF(ISBLANK(VLOOKUP(E1917,INVENTORYDATA,13,FALSE)),\"X\",\"\")","v":""},null,{"$f":"IF(ISBLANK(VLOOKUP(E1917,INVENTORYDATA,13,FALSE)),\"\",VLOOKUP(E1917,INVENTORYDATA,13,FALSE))","v":{"$error":"#N/A"}},null,"Hard Drive Removed",null,{"$f":"IF(ISBLANK(VLOOKUP(K1917,INVENTORYDATA,13,FALSE)),\"X\",\"\")","v":""},null,{"$f":"IF(ISBLANK(VLOOKUP(K1917,INVENTORYDATA,13,FALSE)),\"\",VLOOKUP(K1917,INVENTORYDATA,13,FALSE))","v":{"$error":"#N/A"}}]
["Install Memory",null,"X",{"$nulls":3},"Install Memory",null,"X"]
["Power ON",null,"X",{"$nulls":3},"Power ON",null,"X"]
["Record BIOS info",null,"X",{"$nulls":3},"Record BIOS info",null,"X"]
["Check Optical Drive",null,{"$f":"IF((VLOOKUP(E1917,INVENTORYDATA,7,FALSE))=\"YES\",\"X\",\"\")","v":{"$error":"#N/A"}},{"$f":"IF((VLOOKUP(E1917,INVENTORYDATA,7,FALSE))=\"NO\",\"X\",\"\")","v":{"$error":"#N/A"}},null,null,"Check Optical Drive",null,{"$f":"IF((VLOOKUP(K1917,INVENTORYDATA,7,FALSE))=\"YES\",\"X\",\"\")","v":{"$error":"#N/A"}},{"$f":"IF((VLOOKUP(K1917,INVENTORYDATA,7,FALSE))=\"NO\",\"X\",\"\")","v":{"$error":"#N/A"}}]
["Power Off",null,"X",{"$nulls":3},"Power Off",null,"X"]
["HDD Serial No.",null,{"$f":"IF(ISBLANK(VLOOKUP(E1917,INVENTORYDATA,12,FALSE)),\"\",VLOOKUP(E1917,INVENTORYDATA,12,FALSE))","v":{"$error":"#N/A"}},{"$nulls":3},"HDD Serial No.",null,{"$f":"IF(ISBLANK(VLOOKUP(K1917,INVENTORYDATA,12,FALSE)),\"\",VLOOKUP(K1917,INVENTORYDATA,12,FALSE))","v":{"$error":"#N/A"}}]
[]
["Tested for key functions,R2/Ready for Resale",{"$nulls":5},"Tested for key functions,R2/Ready for Resale"]
["BIOS Lock","Caddy","Optical","WebCam","Battery",null,"BIOS Lock","Caddy","Optical","WebCam","Battery"]
[null,null,{"$f":"VLOOKUP(E1917,INVENTORY!$A$2:$N$144,7,FALSE)","v":{"$error":"#N/A"}},{"$f":"VLOOKUP(E1917,INVENTORY!$A$2:$N$144,8,FALSE)","v":{"$error":"#N/A"}},{"$f":"VLOOKUP(E1917,INVENTORY!$A$2:$N$144,9,FALSE)","v":{"$error":"#N/A"}},{"$nulls":3},{"$f":"VLOOKUP(K1917,INVENTORY!$A$2:$N$144,7,FALSE)","v":{"$error":"#N/A"}},{"$f":"VLOOKUP(K1917,INVENTORY!$A$2:$N$144,8,FALSE)","v":{"$error":"#N/A"}},{"$f":"VLOOKUP(K1917,INVENTORY!$A$2:$N$144,9,FALSE)","v":{"$error":"#N/A"}}]
[]
["CPU Cosmetics Defects:",null,{"$f":"\"Function Code: \"&VLOOKUP(E1917,INVENTORY!$A$2:$Q$144,14,FALSE)","v":{"$error":"#N/A"}},{"$nulls":3},"CPU Cosmetics Defects:",null,{"$f":"\"Function Code: \"&VLOOKUP(K1917,INVENTORY!$A$2:$Q$144,14,FALSE)","v":{"$error":"#N/A"}}]
[]
[null,null,{"$f":"\"Cosmetic Code: \"&VLOOKUP(E1917,INVENTORY!$A$2:$Q$144,15,FALSE)","v":{"$error":"#N/A"}},{"$nulls":5},{"$f":"\"Cosmetic Code: \"&VLOOKUP(K1917,INVENTORY!$A$2:$Q$144,15,FALSE)","v":{"$error":"#N/A"}}]
[]
["Casing","Plugs/Ports",{"$nulls":4},"Casing","Plugs/Ports"]
["Pass","Pass",{"$nulls":4},"Pass","Pass"]
["Fail","Fail",null,"TRRC#:L.T.R.",null,null,"Fail","Fail",null,"TRRC#:L.T.R."]
[]
["LAPTOP TESTING RECORD",{"$nulls":5},"LAPTOP TESTING RECORD"]
[]
[{"$nulls":3},"ITEM #",{"$f":"E1917+2","v":135},{"$nulls":4},"ITEM #",{"$f":"K1917+2","v":136}]
["Tester: ","RR","Date:",{"$f":"NOW()","v":"2026-01-06T11:13:00.960"},null,null,"Tester: ","RR","Date:",{"$f":"NOW()","v":"2026-01-06T11:13:00.960"}]
["Type: ","LAPTOP","SN:",{"$f":"VLOOKUP(E1946,INVENTORYDATA,10,FALSE)","v":{"$error":"#N/A"}},null,null,"Type: ","LAPTOP","SN:",{"$f":"VLOOKUP(K1946,INVENTORYDATA,10,FALSE)","v":{"$error":"#N/A"}}]
[{"$f":"\"Make: \"","v":"Make: "},{"$f":"VLOOKUP(E1946,INVENTORYDATA,2,FALSE)","v":{"$error":"#N/A"}},{"$f":"\"Model: \"","v":"Model: "},{"$f":"VLOOKUP(E1946,INVENTORYDATA,3,FALSE)","v":{"$error":"#N/A"}},null,null,{"$f":"\"Make: \"","v":"Make: "},{"$f":"VLOOKUP(K1946,INVENTORYDATA,2,FALSE)","v":{"$error":"#N/A"}},{"$f":"\"Model: \"","v":"Model: "},{"$f":"VLOOKUP(K1946,INVENTORYDATA,3,FALSE)","v":{"$error":"#N/A"}}]
[{"$f":"\"CPU/Speed: \"","v":"CPU/Speed: "},{"$f":"VLOOKUP(E1946,INVENTORYDATA,4,FALSE)&\" / \"&VLOOKUP(E1946,INVENTORYDATA,5,FALSE)&\"GHz\"","v":{"$error":"#N/A"}},null,{"$f":"\"Memory: \"","v":"Memory: "},{"$f":"VLOOKUP(E1946,INVENTORYDATA,6,FALSE)","v":{"$error":"#N/A"}},null,{"$f":"\"CPU/Speed: \"","v":"CPU/Speed: "},{"$f":"VLOOKUP(K1946,INVENTORYDATA,4,FALSE)&\" / \"&VLOOKUP(K1946,INVENTORYDATA,5,FALSE)&\"GHz\"","v":{"$error":"#N/A"}},null,{"$f":"\"Memory: \"","v":"Memory: "},{"$f":"VLOOKUP(K1946,INVENTORYDATA,6,FALSE)","v":{"$error":"#N/A"}}]
[]
["Key Function",null,"Pass","Fail ","Comments",null,"Key Function",null,"Pass","Fail ","Comments"]
["Hard Drive Removed",null,{"$f":"IF(ISBLANK(VLOOKUP(E1946,INVENTORYDATA,13,FALSE)),\"X\",\"\")","v":""},null,{"$f":"IF(ISBLANK(VLOOKUP(E1946,INVENTORYDATA,13,FALSE)),\"\",VLOOKUP(E1946,INVENTORYDATA,13,FALSE))","v":{"$error":"#N/A"}},null,"Hard Drive Removed",null,{"$f":"IF(ISBLANK(VLOOKUP(K1946,INVENTORYDATA,13,FALSE)),\"X\",\"\")","v":""},null,{"$f":"IF(ISBLANK(VLOOKUP(K1946,INVENTORYDATA,13,FALSE)),\"\",VLOOKUP(K1946,INVENTORYDATA,13,FALSE))","v":{"$error":"#N/A"}}]
["Install Memory",null,"X",{"$nulls":3},"Install Memory",null,"X"]
["Power ON",null,"X",{"$nulls":3},"Power ON",null,"X"]
["Record BIOS info",null,"X",{"$nulls":3},"Record BIOS info",null,"X"]
["Check Optical Drive",null,{"$f":"IF((VLOOKUP(E1946,INVENTORYDATA,7,FALSE))=\"YES\",\"X\",\"\")","v":{"$error":"#N/A"}},{"$f":"IF((VLOOKUP(E1946,INVENTORYDATA,7,FALSE))=\"NO\",\"X\",\"\")","v":{"$error":"#N/A"}},null,null,"Check Optical Drive",null,{"$f":"IF((VLOOKUP(K1946,INVENTORYDATA,7,FALSE))=\"YES\",\"X\",\"\")","v":{"$error":"#N/A"}},{"$f":"IF((VLOOKUP(K1946,INVENTORYDATA,7,FALSE))=\"NO\",\"X\",\"\")","v":{"$error":"#N/A"}}]
["Power Off",null,"X",{"$nulls":3},"Power Off",null,"X"]
["HDD Serial No.",null,{"$f":"IF(ISBLANK(VLOOKUP(E1946,INVENTORYDATA,12,FALSE)),\"\",VLOOKUP(E1946,INVENTORYDATA,12,FALSE))","v":{"$error":"#N/A"}},{"$nulls":3},"HDD Serial No.",null,{"$f":"IF(ISBLANK(VLOOKUP(K1946,INVENTORYDATA,12,FALSE)),\"\",VLOOKUP(K1946,INVENTORYDATA,12,FALSE))","v":{"$error":"#N/A"}}]
[]
["Tested for key functions,R2/Ready for Resale",{"$nulls":5},"Tested for key functions,R2/Ready for Resale"]
["BIOS Lock","Caddy","Optical","WebCam","Battery",null,"BIOS Lock","Caddy","Optical","WebCam","Battery"]
[null,null,{"$f":"VLOOKUP(E1946,INVENTORY!$A$2:$N$144,7,FALSE)","v":{"$error":"#N/A"}},{"$f":"VLOOKUP(E1946,INVENTORY!$A$2:$N$144,8,FALSE)","v":{"$error":"#N/A"}},{"$f":"VLOOKUP(E1946,INVENTORY!$A$2:$N$144,9,FALSE)","v":{"$error":"#N/A"}},{"$nulls":3},{"$f":"VLOOKUP(K1946,INVENTORY!$A$2:$N$144,7,FALSE)","v":{"$error":"#N/A"}},{"$f":"VLOOKUP(K1946,INVENTORY!$A$2:$N$144,8,FALSE)","v":{"$error":"#N/A"}},{"$f":"VLOOKUP(K1946,INVENTORY!$A$2:$N$144,9,FALSE)","v":{"$error":"#N/A"}}]
[]
["CPU Cosmetics Defects:",null,{"$f":"\"Function Code: \"&VLOOKUP(E1946,INVENTORY!$A$2:$Q$144,14,FALSE)","v":{"$error":"#N/A"}},{"$nulls":3},"CPU Cosmetics Defects:",null,{"$f":"\"Function Code: \"&VLOOKUP(K1946,INVENTORY!$A$2:$Q$144,14,FALSE)","v":{"$error":"#N/A"}}]
[]
[null,null,{"$f":"\"Cosmetic Code: \"&VLOOKUP(E1946,INVENTORY!$A$2:$Q$144,15,FALSE)","v":{"$error":"#N/A"}},{"$nulls":5},{"$f":"\"Cosmetic Code: \"&VLOOKUP(K1946,INVENTORY!$A$2:$Q$144,15,FALSE)","v":{"$error":"#N/A"}}]
[]
["Casing","Plugs/Ports",{"$nulls":4},"Casing","Plugs/Ports"]
["Pass","Pass",{"$nulls":4},"Pass","Pass"]
["Fail","Fail",null,"TRRC#:L.T.R.",null,null,"Fail","Fail",null,"TRRC#:L.T.R."]
[]
["LAPTOP TESTING RECORD",{"$nulls":5},"LAPTOP TESTING RECORD"]
[]
[{"$nulls":3},"ITEM #",{"$f":"E1946+2","v":137},{"$nulls":4},"ITEM #",{"$f":"K1946+2","v":138}]
["Tester: ","RR","Date:",{"$f":"NOW()","v":"2026-01-06T11:13:00.960"},null,null,"Tester: ","RR","Date:",{"$f":"NOW()","v":"2026-01-06T11:13:00.960"}]
["Type: ","LAPTOP","SN:",{"$f":"VLOOKUP(E1975,INVENTORYDATA,10,FALSE)","v":{"$error":"#N/A"}},null,null,"Type: ","LAPTOP","SN:",{"$f":"VLOOKUP(K1975,INVENTORYDATA,10,FALSE)","v":{"$error":"#N/A"}}]
[{"$f":"\"Make: \"","v":"Make: "},{"$f":"VLOOKUP(E1975,INVENTORYDATA,2,FALSE)","v":{"$error":"#N/A"}},{"$f":"\"Model: \"","v":"Model: "},{"$f":"VLOOKUP(E1975,INVENTORYDATA,3,FALSE)","v":{"$error":"#N/A"}},null,null,{"$f":"\"Make: \"","v":"Make: "},{"$f":"VLOOKUP(K1975,INVENTORYDATA,2,FALSE)","v":{"$error":"#N/A"}},{"$f":"\"Model: \"","v":"Model: "},{"$f":"VLOOKUP(K1975,INVENTORYDATA,3,FALSE)","v":{"$error":"#N/A"}}]
[{"$f":"\"CPU/Speed: \"","v":"CPU/Speed: "},{"$f":"VLOOKUP(E1975,INVENTORYDATA,4,FALSE)&\" / \"&VLOOKUP(E1975,INVENTORYDATA,5,FALSE)&\"GHz\"","v":{"$error":"#N/A"}},null,{"$f":"\"Memory: \"","v":"Memory: "},{"$f":"VLOOKUP(E1975,INVENTORYDATA,6,FALSE)","v":{"$error":"#N/A"}},null,{"$f":"\"CPU/Speed: \"","v":"CPU/Speed: "},{"$f":"VLOOKUP(K1975,INVENTORYDATA,4,FALSE)&\" / \"&VLOOKUP(K1975,INVENTORYDATA,5,FALSE)&\"GHz\"","v":{"$error":"#N/A"}},null,{"$f":"\"Memory: \"","v":"Memory: "},{"$f":"VLOOKUP(K1975,INVENTORYDATA,6,FALSE)","v":{"$error":"#N/A"}}]
[]
["Key Function",null,"Pass","Fail ","Comments",null,"Key Function",null,"Pass","Fail ","Comments"]
["Hard Drive Removed",null,{"$f":"IF(ISBLANK(VLOOKUP(E1975,INVENTORYDATA,13,FALSE)),\"X\",\"\")","v":""},null,{"$f":"IF(ISBLANK(VLOOKUP(E1975,INVENTORYDATA,13,FALSE)),\"\",VLOOKUP(E1975,INVENTORYDATA,13,FALSE))","v":{"$error":"#N/A"}},null,"Hard Drive Removed",null,{"$f":"IF(ISBLANK(VLOOKUP(K1975,INVENTORYDATA,13,FALSE)),\"X\",\"\")","v":""},null,{"$f":"IF(ISBLANK(VLOOKUP(K1975,INVENTORYDATA,13,FALSE)),\"\",VLOOKUP(K1975,INVENTORYDATA,13,FALSE))","v":{"$error":"#N/A"}}]
["Install Memory",null,"X",{"$nulls":3},"Install Memory",null,"X"]
["Power ON",null,"X",{"$nulls":3},"Power ON",null,"X"]
["Record BIOS info",null,"X",{"$nulls":3},"Record BIOS info",null,"X"]
["Check Optical Drive",null,{"$f":"IF((VLOOKUP(E1975,INVENTORYDATA,7,FALSE))=\"YES\",\"X\",\"\")","v":{"$error":"#N/A"}},{"$f":"IF((VLOOKUP(E1975,INVENTORYDATA,7,FALSE))=\"NO\",\"X\",\"\")","v":{"$error":"#N/A"}},null,null,"Check Optical Drive",null,{"$f":"IF((VLOOKUP(K1975,INVENTORYDATA,7,FALSE))=\"YES\",\"X\",\"\")","v":{"$error":"#N/A"}},{"$f":"IF((VLOOKUP(K1975,INVENTORYDATA,7,FALSE))=\"NO\",\"X\",\"\")","v":{"$error":"#N/A"}}]
["Power Off",null,"X",{"$nulls":3},"Power Off",null,"X"]
["HDD Serial No.",null,{"$f":"IF(ISBLANK(VLOOKUP(E1975,INVENTORYDATA,12,FALSE)),\"\",VLOOKUP(E1975,INVENTORYDATA,12,FALSE))","v":{"$error":"#N/A"}},{"$nulls":3},"HDD Serial No.",null,{"$f":"IF(ISBLANK(VLOOKUP(K1975,INVENTORYDATA,12,FALSE)),\"\",VLOOKUP(K1975,INVENTORYDATA,12,FALSE))","v":{"$error":"#N/A"}}]
[]
["Tested for key functions,R2/Ready for Resale",{"$nulls":5},"Tested for key functions,R2/Ready for Resale"]
["BIOS Lock","Caddy","Optical","WebCam","Battery",null,"BIOS Lock","Caddy","Optical","WebCam","Battery"]
[null,null,{"$f":"VLOOKUP(E1975,INVENTORY!$A$2:$N$144,7,FALSE)","v":{"$error":"#N/A"}},{"$f":"VLOOKUP(E1975,INVENTORY!$A$2:$N$144,8,FALSE)","v":{"$error":"#N/A"}},{"$f":"VLOOKUP(E1975,INVENTORY!$A$2:$N$144,9,FALSE)","v":{"$error":"#N/A"}},{"$nulls":3},{"$f":"VLOOKUP(K1975,INVENTORY!$A$2:$N$144,7,FALSE)","v":{"$error":"#N/A"}},{"$f":"VLOOKUP(K1975,INVENTORY!$A$2:$N$144,8,FALSE)","v":{"$error":"#N/A"}},{"$f":"VLOOKUP(K1975,INVENTORY!$A$2:$N$144,9,FALSE)","v":{"$error":"#N/A"}}]
[]
["CPU Cosmetics Defects:",null,{"$f":"\"Function Code: \"&VLOOKUP(E1975,INVENTORY!$A$2:$Q$144,14,FALSE)","v":{"$error":"#N/A"}},{"$nulls":3},"CPU Cosmetics Defects:",null,{"$f":"\"Function Code: \"&VLOOKUP(K1975,INVENTORY!$A$2:$Q$144,14,FALSE)","v":{"$error":"#N/A"}}]
[]
[null,null,{"$f":"\"Cosmetic Code: \"&VLOOKUP(E1975,INVENTORY!$A$2:$Q$144,15,FALSE)","v":{"$error":"#N/A"}},{"$nulls":5},{"$f":"\"Cosmetic Code: \"&VLOOKUP(K1975,INVENTORY!$A$2:$Q$144,15,FALSE)","v":{"$error":"#N/A"}}]
[]
["Casing","Plugs/Ports",{"$nulls":4},"Casing","Plugs/Ports"]
["Pass","Pass",{"$nulls":4},"Pass","Pass"]
["Fail","Fail",null,"TRRC#:L.T.R.",null,null,"Fail","Fail",null,"TRRC#:L.T.R."]
[]
["LAPTOP TESTING RECORD",{"$nulls":5},"LAPTOP TESTING RECORD"]
[]
[{"$nulls":3},"ITEM #",{"$f":"E1975+2","v":139},{"$nulls":4},"ITEM #",{"$f":"K1975+2","v":140}]
["Tester: ","RR","Date:",{"$f":"NOW()","v":"2026-01-06T11:13:00.960"},null,null,"Tester: ","RR","Date:",{"$f":"NOW()","v":"2026-01-06T11:13:00.960"}]
["Type: ","LAPTOP","SN:",{"$f":"VLOOKUP(E2004,INVENTORYDATA,10,FALSE)","v":{"$error":"#N/A"}},null,null,"Type: ","LAPTOP","SN:",{"$f":"VLOOKUP(K2004,INVENTORYDATA,10,FALSE)","v":{"$error":"#N/A"}}]
[{"$f":"\"Make: \"","v":"Make: "},{"$f":"VLOOKUP(E2004,INVENTORYDATA,2,FALSE)","v":{"$error":"#N/A"}},{"$f":"\"Model: \"","v":"Model: "},{"$f":"VLOOKUP(E2004,INVENTORYDATA,3,FALSE)","v":{"$error":"#N/A"}},null,null,{"$f":"\"Make: \"","v":"Make: "},{"$f":"VLOOKUP(K2004,INVENTORYDATA,2,FALSE)","v":{"$error":"#N/A"}},{"$f":"\"Model: \"","v":"Model: "},{"$f":"VLOOKUP(K2004,INVENTORYDATA,3,FALSE)","v":{"$error":"#N/A"}}]
[{"$f":"\"CPU/Speed: \"","v":"CPU/Speed: "},{"$f":"VLOOKUP(E2004,INVENTORYDATA,4,FALSE)&\" / \"&VLOOKUP(E2004,INVENTORYDATA,5,FALSE)&\"GHz\"","v":{"$error":"#N/A"}},null,{"$f":"\"Memory: \"","v":"Memory: "},{"$f":"VLOOKUP(E2004,INVENTORYDATA,6,FALSE)","v":{"$error":"#N/A"}},null,{"$f":"\"CPU/Speed: \"","v":"CPU/Speed: "},{"$f":"VLOOKUP(K2004,INVENTORYDATA,4,FALSE)&\" / \"&VLOOKUP(K2004,INVENTORYDATA,5,FALSE)&\"GHz\"","v":{"$error":"#N/A"}},null,{"$f":"\"Memory: \"","v":"Memory: "},{"$f":"VLOOKUP(K2004,INVENTORYDATA,6,FALSE)","v":{"$error":"#N/A"}}]
[]
["Key Function",null,"Pass","Fail ","Comments",null,"Key Function",null,"Pass","Fail ","Comments"]
["Hard Drive Removed",null,{"$f":"IF(ISBLANK(VLOOKUP(E2004,INVENTORYDATA,13,FALSE)),\"X\",\"\")","v":""},null,{"$f":"IF(ISBLANK(VLOOKUP(E2004,INVENTORYDATA,13,FALSE)),\"\",VLOOKUP(E2004,INVENTORYDATA,13,FALSE))","v":{"$error":"#N/A"}},null,"Hard Drive Removed",null,{"$f":"IF(ISBLANK(VLOOKUP(K2004,INVENTORYDATA,13,FALSE)),\"X\",\"\")","v":""},null,{"$f":"IF(ISBLANK(VLOOKUP(K2004,INVENTORYDATA,13,FALSE)),\"\",VLOOKUP(K2004,INVENTORYDATA,13,FALSE))","v":{"$error":"#N/A"}}]
["Install Memory",null,"X",{"$nulls":3},"Install Memory",null,"X"]
["Power ON",null,"X",{"$nulls":3},"Power ON",null,"X"]
["Record BIOS info",null,"X",{"$nulls":3},"Record BIOS info",null,"X"]
["Check Optical Drive",null,{"$f":"IF((VLOOKUP(E2004,INVENTORYDATA,7,FALSE))=\"YES\",\"X\",\"\")","v":{"$error":"#N/A"}},{"$f":"IF((VLOOKUP(E2004,INVENTORYDATA,7,FALSE))=\"NO\",\"X\",\"\")","v":{"$error":"#N/A"}},null,null,"Check Optical Drive",null,{"$f":"IF((VLOOKUP(K2004,INVENTORYDATA,7,FALSE))=\"YES\",\"X\",\"\")","v":{"$error":"#N/A"}},{"$f":"IF((VLOOKUP(K2004,INVENTORYDATA,7,FALSE))=\"NO\",\"X\",\"\")","v":{"$error":"#N/A"}}]
["Power Off",null,"X",{"$nulls":3},"Power Off",null,"X"]
["HDD Serial No.",null,{"$f":"IF(ISBLANK(VLOOKUP(E2004,INVENTORYDATA,12,FALSE)),\"\",VLOOKUP(E2004,INVENTORYDATA,12,FALSE))","v":{"$error":"#N/A"}},{"$nulls":3},"HDD Serial No.",null,{"$f":"IF(ISBLANK(VLOOKUP(K2004,INVENTORYDATA,12,FALSE)),\"\",VLOOKUP(K2004,INVENTORYDATA,12,FALSE))","v":{"$error":"#N/A"}}]
[]
["Tested for key functions,R2/Ready for Resale",{"$nulls":5},"Tested for key functions,R2/Ready for Resale"]
["BIOS Lock","Caddy","Optical","WebCam","Battery",null,"BIOS Lock","Caddy","Optical","WebCam","Battery"]
[null,null,{"$f":"VLOOKUP(E2004,INVENTORY!$A$2:$N$144,7,FALSE)","v":{"$error":"#N/A"}},{"$f":"VLOOKUP(E2004,INVENTORY!$A$2:$N$144,8,FALSE)","v":{"$error":"#N/A"}},{"$f":"VLOOKUP(E2004,INVENTORY!$A$2:$N$144,9,FALSE)","v":{"$error":"#N/A"}},{"$nulls":3},{"$f":"VLOOKUP(K2004,INVENTORY!$A$2:$N$144,7,FALSE)","v":{"$error":"#N/A"}},{"$f":"VLOOKUP(K2004,INVENTORY!$A$2:$N$144,8,FALSE)","v":{"$error":"#N/A"}},{"$f":"VLOOKUP(K2004,INVENTORY!$A$2:$N$144,9,FALSE)","v":{"$error":"#N/A"}}]
[]
["CPU Cosmetics Defects:",null,{"$f":"\"Function Code: \"&VLOOKUP(E2004,INVENTORY!$A$2:$Q$144,14,FALSE)","v":{"$error":"#N/A"}},{"$nulls":3},"CPU Cosmetics Defects:",null,{"$f":"\"Function Code: \"&VLOOKUP(K2004,INVENTORY!$A$2:$Q$144,14,FALSE)","v":{"$error":"#N/A"}}]
[]
[null,null,{"$f":"\"Cosmetic Code: \"&VLOOKUP(E2004,INVENTORY!$A$2:$Q$144,15,FALSE)","v":{"$error":"#N/A"}},{"$nulls":5},{"$f":"\"Cosmetic Code: \"&VLOOKUP(K2004,INVENTORY!$A$2:$Q$144,15,FALSE)","v":{"$error":"#N/A"}}]
[]
["Casing","Plugs/Ports",{"$nulls":4},"Casing","Plugs/Ports"]
["Pass","Pass",{"$nulls":4},"Pass","Pass"]
["Fail","Fail",null,"TRRC#:L.T.R.",null,null,"Fail","Fail",null,"TRRC#:L.T.R."]
[]
["LAPTOP TESTING RECORD",{"$nulls":5},"LAPTOP TESTING RECORD"]
[]
[{"$nulls":3},"ITEM #",{"$f":"E2004+2","v":141},{"$nulls":4},"ITEM #",{"$f":"K2004+2","v":142}]
["Tester: ","RR","Date:",{"$f":"NOW()","v":"2026-01-06T11:13:00.960"},null,null,"Tester: ","RR","Date:",{"$f":"NOW()","v":"2026-01-06T11:13:00.960"}]
["Type: ","LAPTOP","SN:",{"$f":"VLOOKUP(E2033,INVENTORYDATA,10,FALSE)","v":{"$error":"#N/A"}},null,null,"Type: ","LAPTOP","SN:",{"$f":"VLOOKUP(K2033,INVENTORYDATA,10,FALSE)","v":{"$error":"#N/A"}}]
[{"$f":"\"Make: \"","v":"Make: "},{"$f":"VLOOKUP(E2033,INVENTORYDATA,2,FALSE)","v":{"$error":"#N/A"}},{"$f":"\"Model: \"","v":"Model: "},{"$f":"VLOOKUP(E2033,INVENTORYDATA,3,FALSE)","v":{"$error":"#N/A"}},null,null,{"$f":"\"Make: \"","v":"Make: "},{"$f":"VLOOKUP(K2033,INVENTORYDATA,2,FALSE)","v":{"$error":"#N/A"}},{"$f":"\"Model: \"","v":"Model: "},{"$f":"VLOOKUP(K2033,INVENTORYDATA,3,FALSE)","v":{"$error":"#N/A"}}]
[{"$f":"\"CPU/Speed: \"","v":"CPU/Speed: "},{"$f":"VLOOKUP(E2033,INVENTORYDATA,4,FALSE)&\" / \"&VLOOKUP(E2033,INVENTORYDATA,5,FALSE)&\"GHz\"","v":{"$error":"#N/A"}},null,{"$f":"\"Memory: \"","v":"Memory: "},{"$f":"VLOOKUP(E2033,INVENTORYDATA,6,FALSE)","v":{"$error":"#N/A"}},null,{"$f":"\"CPU/Speed: \"","v":"CPU/Speed: "},{"$f":"VLOOKUP(K2033,INVENTORYDATA,4,FALSE)&\" / \"&VLOOKUP(K2033,INVENTORYDATA,5,FALSE)&\"GHz\"","v":{"$error":"#N/A"}},null,{"$f":"\"Memory: \"","v":"Memory: "},{"$f":"VLOOKUP(K2033,INVENTORYDATA,6,FALSE)","v":{"$error":"#N/A"}}]
[]
["Key Function",null,"Pass","Fail ","Comments",null,"Key Function",null,"Pass","Fail ","Comments"]
["Hard Drive Removed",null,{"$f":"IF(ISBLANK(VLOOKUP(E2033,INVENTORYDATA,13,FALSE)),\"X\",\"\")","v":""},null,{"$f":"IF(ISBLANK(VLOOKUP(E2033,INVENTORYDATA,13,FALSE)),\"\",VLOOKUP(E2033,INVENTORYDATA,13,FALSE))","v":{"$error":"#N/A"}},null,"Hard Drive Removed",null,{"$f":"IF(ISBLANK(VLOOKUP(K2033,INVENTORYDATA,13,FALSE)),\"X\",\"\")","v":""},null,{"$f":"IF(ISBLANK(VLOOKUP(K2033,INVENTORYDATA,13,FALSE)),\"\",VLOOKUP(K2033,INVENTORYDATA,13,FALSE))","v":{"$error":"#N/A"}}]
["Install Memory",null,"X",{"$nulls":3},"Install Memory",null,"X"]
["Power ON",null,"X",{"$nulls":3},"Power ON",null,"X"]
["Record BIOS info",null,"X",{"$nulls":3},"Record BIOS info",null,"X"]
["Check Optical Drive",null,{"$f":"IF((VLOOKUP(E2033,INVENTORYDATA,7,FALSE))=\"YES\",\"X\",\"\")","v":{"$error":"#N/A"}},{"$f":"IF((VLOOKUP(E2033,INVENTORYDATA,7,FALSE))=\"NO\",\"X\",\"\")","v":{"$error":"#N/A"}},null,null,"Check Optical Drive",null,{"$f":"IF((VLOOKUP(K2033,INVENTORYDATA,7,FALSE))=\"YES\",\"X\",\"\")","v":{"$error":"#N/A"}},{"$f":"IF((VLOOKUP(K2033,INVENTORYDATA,7,FALSE))=\"NO\",\"X\",\"\")","v":{"$error":"#N/A"}}]
["Power Off",null,"X",{"$nulls":3},"Power Off",null,"X"]
["HDD Serial No.",null,{"$f":"IF(ISBLANK(VLOOKUP(E2033,INVENTORYDATA,12,FALSE)),\"\",VLOOKUP(E2033,INVENTORYDATA,12,FALSE))","v":{"$error":"#N/A"}},{"$nulls":3},"HDD Serial No.",null,{"$f":"IF(ISBLANK(VLOOKUP(K2033,INVENTORYDATA,12,FALSE)),\"\",VLOOKUP(K2033,INVENTORYDATA,12,FALSE))","v":{"$error":"#N/A"}}]
[]
["Tested for key functions,R2/Ready for Resale",{"$nulls":5},"Tested for key functions,R2/Ready for Resale"]
["BIOS Lock","Caddy","Optical","WebCam","Battery",null,"BIOS Lock","Caddy","Optical","WebCam","Battery"]
[null,null,{"$f":"VLOOKUP(E2033,INVENTORY!$A$2:$N$144,7,FALSE)","v":{"$error":"#N/A"}},{"$f":"VLOOKUP(E2033,INVENTORY!$A$2:$N$144,8,FALSE)","v":{"$error":"#N/A"}},{"$f":"VLOOKUP(E2033,INVENTORY!$A$2:$N$144,9,FALSE)","v":{"$error":"#N/A"}},{"$nulls":3},{"$f":"VLOOKUP(K2033,INVENTORY!$A$2:$N$144,7,FALSE)","v":{"$error":"#N/A"}},{"$f":"VLOOKUP(K2033,INVENTORY!$A$2:$N$144,8,FALSE)","v":{"$error":"#N/A"}},{"$f":"VLOOKUP(K2033,INVENTORY!$A$2:$N$144,9,FALSE)","v":{"$error":"#N/A"}}]
[]
["CPU Cosmetics Defects:",null,{"$f":"\"Function Code: \"&VLOOKUP(E2033,INVENTORY!$A$2:$Q$144,14,FALSE)","v":{"$error":"#N/A"}},{"$nulls":3},"CPU Cosmetics Defects:",null,{"$f":"\"Function Code: \"&VLOOKUP(K2033,INVENTORY!$A$2:$Q$144,14,FALSE)","v":{"$error":"#N/A"}}]
[]
[null,null,{"$f":"\"Cosmetic Code: \"&VLOOKUP(E2033,INVENTORY!$A$2:$Q$144,15,FALSE)","v":{"$error":"#N/A"}},{"$nulls":5},{"$f":"\"Cosmetic Code: \"&VLOOKUP(K2033,INVENTORY!$A$2:$Q$144,15,FALSE)","v":{"$error":"#N/A"}}]
[]
["Casing","Plugs/Ports",{"$nulls":4},"Casing","Plugs/Ports"]
["Pass","Pass",{"$nulls":4},"Pass","Pass"]
["Fail","Fail",null,"TRRC#:L.T.R.",null,null,"Fail","Fail",null,"TRRC#:L.T.R."]
[]
["LAPTOP TESTING RECORD",{"$nulls":5},"LAPTOP TESTING RECORD"]
[]
[{"$nulls":3},"ITEM #",{"$f":"E2033+2","v":143},{"$nulls":4},"ITEM #",{"$f":"K2033+2","v":144}]
["Tester: ","RR","Date:",{"$f":"NOW()","v":"2026-01-06T11:13:00.960"},null,null,"Tester: ","RR","Date:",{"$f":"NOW()","v":"2026-01-06T11:13:00.960"}]
["Type: ","LAPTOP","SN:",{"$f":"VLOOKUP(E2062,INVENTORYDATA,10,FALSE)","v":{"$error":"#N/A"}},null,null,"Type: ","LAPTOP","SN:",{"$f":"VLOOKUP(K2062,INVENTORYDATA,10,FALSE)","v":{"$error":"#N/A"}}]
[{"$f":"\"Make: \"","v":"Make: "},{"$f":"VLOOKUP(E2062,INVENTORYDATA,2,FALSE)","v":{"$error":"#N/A"}},{"$f":"\"Model: \"","v":"Model: "},{"$f":"VLOOKUP(E2062,INVENTORYDATA,3,FALSE)","v":{"$error":"#N/A"}},null,null,{"$f":"\"Make: \"","v":"Make: "},{"$f":"VLOOKUP(K2062,INVENTORYDATA,2,FALSE)","v":{"$error":"#N/A"}},{"$f":"\"Model: \"","v":"Model: "},{"$f":"VLOOKUP(K2062,INVENTORYDATA,3,FALSE)","v":{"$error":"#N/A"}}]
[{"$f":"\"CPU/Speed: \"","v":"CPU/Speed: "},{"$f":"VLOOKUP(E2062,INVENTORYDATA,4,FALSE)&\" / \"&VLOOKUP(E2062,INVENTORYDATA,5,FALSE)&\"GHz\"","v":{"$error":"#N/A"}},null,{"$f":"\"Memory: \"","v":"Memory: "},{"$f":"VLOOKUP(E2062,INVENTORYDATA,6,FALSE)","v":{"$error":"#N/A"}},null,{"$f":"\"CPU/Speed: \"","v":"CPU/Speed: "},{"$f":"VLOOKUP(K2062,INVENTORYDATA,4,FALSE)&\" / \"&VLOOKUP(K2062,INVENTORYDATA,5,FALSE)&\"GHz\"","v":{"$error":"#N/A"}},null,{"$f":"\"Memory: \"","v":"Memory: "},{"$f":"VLOOKUP(K2062,INVENTORYDATA,6,FALSE)","v":{"$error":"#N/A"}}]
[]
["Key Function",null,"Pass","Fail ","Comments",null,"Key Function",null,"Pass","Fail ","Comments"]
["Hard Drive Removed",null,{"$f":"IF(ISBLANK(VLOOKUP(E2062,INVENTORYDATA,13,FALSE)),\"X\",\"\")","v":""},null,{"$f":"IF(ISBLANK(VLOOKUP(E2062,INVENTORYDATA,13,FALSE)),\"\",VLOOKUP(E2062,INVENTORYDATA,13,FALSE))","v":{"$error":"#N/A"}},null,"Hard Drive Removed",null,{"$f":"IF(ISBLANK(VLOOKUP(K2062,INVENTORYDATA,13,FALSE)),\"X\",\"\")","v":""},null,{"$f":"IF(ISBLANK(VLOOKUP(K2062,INVENTORYDATA,13,FALSE)),\"\",VLOOKUP(K2062,INVENTORYDATA,13,FALSE))","v":{"$error":"#N/A"}}]
["Install Memory",null,"X",{"$nulls":3},"Install Memory",null,"X"]
["Power ON",null,"X",{"$nulls":3},"Power ON",null,"X"]
["Record BIOS info",null,"X",{"$nulls":3},"Record BIOS info",null,"X"]
["Check Optical Drive",null,{"$f":"IF((VLOOKUP(E2062,INVENTORYDATA,7,FALSE))=\"YES\",\"X\",\"\")","v":{"$error":"#N/A"}},{"$f":"IF((VLOOKUP(E2062,INVENTORYDATA,7,FALSE))=\"NO\",\"X\",\"\")","v":{"$error":"#N/A"}},null,null,"Check Optical Drive",null,{"$f":"IF((VLOOKUP(K2062,INVENTORYDATA,7,FALSE))=\"YES\",\"X\",\"\")","v":{"$error":"#N/A"}},{"$f":"IF((VLOOKUP(K2062,INVENTORYDATA,7,FALSE))=\"NO\",\"X\",\"\")","v":{"$error":"#N/A"}}]
["Power Off",null,"X",{"$nulls":3},"Power Off",null,"X"]
["HDD Serial No.",null,{"$f":"IF(ISBLANK(VLOOKUP(E2062,INVENTORYDATA,12,FALSE)),\"\",VLOOKUP(E2062,INVENTORYDATA,12,FALSE))","v":{"$error":"#N/A"}},{"$nulls":3},"HDD Serial No.",null,{"$f":"IF(ISBLANK(VLOOKUP(K2062,INVENTORYDATA,12,FALSE)),\"\",VLOOKUP(K2062,INVENTORYDATA,12,FALSE))","v":{"$error":"#N/A"}}]
[]
["Tested for key functions,R2/Ready for Resale",{"$nulls":5},"Tested for key functions,R2/Ready for Resale"]
["BIOS Lock","Caddy","Optical","WebCam","Battery",null,"BIOS Lock","Caddy","Optical","WebCam","Battery"]
[null,null,{"$f":"VLOOKUP(E2062,INVENTORY!$A$2:$N$144,7,FALSE)","v":{"$error":"#N/A"}},{"$f":"VLOOKUP(E2062,INVENTORY!$A$2:$N$144,8,FALSE)","v":{"$error":"#N/A"}},{"$f":"VLOOKUP(E2062,INVENTORY!$A$2:$N$144,9,FALSE)","v":{"$error":"#N/A"}},{"$nulls":3},{"$f":"VLOOKUP(K2062,INVENTORY!$A$2:$N$144,7,FALSE)","v":{"$error":"#N/A"}},{"$f":"VLOOKUP(K2062,INVENTORY!$A$2:$N$144,8,FALSE)","v":{"$error":"#N/A"}},{"$f":"VLOOKUP(K2062,INVENTORY!$A$2:$N$144,9,FALSE)","v":{"$error":"#N/A"}}]
[]
["CPU Cosmetics Defects:",null,{"$f":"\"Function Code: \"&VLOOKUP(E2062,INVENTORY!$A$2:$Q$144,14,FALSE)","v":{"$error":"#N/A"}},{"$nulls":3},"CPU Cosmetics Defects:",null,{"$f":"\"Function Code: \"&VLOOKUP(K2062,INVENTORY!$A$2:$Q$144,14,FALSE)","v":{"$error":"#N/A"}}]
[]
[null,null,{"$f":"\"Cosmetic Code: \"&VLOOKUP(E2062,INVENTORY!$A$2:$Q$144,15,FALSE)","v":{"$error":"#N/A"}},{"$nulls":5},{"$f":"\"Cosmetic Code: \"&VLOOKUP(K2062,INVENTORY!$A$2:$Q$144,15,FALSE)","v":{"$error":"#N/A"}}]
[]
["Casing","Plugs/Ports",{"$nulls":4},"Casing","Plugs/Ports"]
["Pass","Pass",{"$nulls":4},"Pass","Pass"]
["Fail","Fail",null,"TRRC#:L.T.R.",null,null,"Fail","Fail",null,"TRRC#:L.T.R."]
[]
["LAPTOP TESTING RECORD",{"$nulls":5},"LAPTOP TESTING RECORD"]
[]
[{"$nulls":3},"ITEM #",{"$f":"E2062+2","v":145},{"$nulls":4},"ITEM #",{"$f":"K2062+2","v":146}]
["Tester: ","RR","Date:",{"$f":"NOW()","v":"2026-01-06T11:13:00.960"},null,null,"Tester: ","RR","Date:",{"$f":"NOW()","v":"2026-01-06T11:13:00.960"}]
["Type: ","LAPTOP","SN:",{"$f":"VLOOKUP(E2091,INVENTORYDATA,10,FALSE)","v":{"$error":"#N/A"}},null,null,"Type: ","LAPTOP","SN:",{"$f":"VLOOKUP(K2091,INVENTORYDATA,10,FALSE)","v":{"$error":"#N/A"}}]
[{"$f":"\"Make: \"","v":"Make: "},{"$f":"VLOOKUP(E2091,INVENTORYDATA,2,FALSE)","v":{"$error":"#N/A"}},{"$f":"\"Model: \"","v":"Model: "},{"$f":"VLOOKUP(E2091,INVENTORYDATA,3,FALSE)","v":{"$error":"#N/A"}},null,null,{"$f":"\"Make: \"","v":"Make: "},{"$f":"VLOOKUP(K2091,INVENTORYDATA,2,FALSE)","v":{"$error":"#N/A"}},{"$f":"\"Model: \"","v":"Model: "},{"$f":"VLOOKUP(K2091,INVENTORYDATA,3,FALSE)","v":{"$error":"#N/A"}}]
[{"$f":"\"CPU/Speed: \"","v":"CPU/Speed: "},{"$f":"VLOOKUP(E2091,INVENTORYDATA,4,FALSE)&\" / \"&VLOOKUP(E2091,INVENTORYDATA,5,FALSE)&\"GHz\"","v":{"$error":"#N/A"}},null,{"$f":"\"Memory: \"","v":"Memory: "},{"$f":"VLOOKUP(E2091,INVENTORYDATA,6,FALSE)","v":{"$error":"#N/A"}},null,{"$f":"\"CPU/Speed: \"","v":"CPU/Speed: "},{"$f":"VLOOKUP(K2091,INVENTORYDATA,4,FALSE)&\" / \"&VLOOKUP(K2091,INVENTORYDATA,5,FALSE)&\"GHz\"","v":{"$error":"#N/A"}},null,{"$f":"\"Memory: \"","v":"Memory: "},{"$f":"VLOOKUP(K2091,INVENTORYDATA,6,FALSE)","v":{"$error":"#N/A"}}]
[]
["Key Function",null,"Pass","Fail ","Comments",null,"Key Function",null,"Pass","Fail ","Comments"]
["Hard Drive Removed",null,{"$f":"IF(ISBLANK(VLOOKUP(E2091,INVENTORYDATA,13,FALSE)),\"X\",\"\")","v":""},null,{"$f":"IF(ISBLANK(VLOOKUP(E2091,INVENTORYDATA,13,FALSE)),\"\",VLOOKUP(E2091,INVENTORYDATA,13,FALSE))","v":{"$error":"#N/A"}},null,"Hard Drive Removed",null,{"$f":"IF(ISBLANK(VLOOKUP(K2091,INVENTORYDATA,13,FALSE)),\"X\",\"\")","v":""},null,{"$f":"IF(ISBLANK(VLOOKUP(K2091,INVENTORYDATA,13,FALSE)),\"\",VLOOKUP(K2091,INVENTORYDATA,13,FALSE))","v":{"$error":"#N/A"}}]
["Install Memory",null,"X",{"$nulls":3},"Install Memory",null,"X"]
["Power ON",null,"X",{"$nulls":3},"Power ON",null,"X"]
["Record BIOS info",null,"X",{"$nulls":3},"Record BIOS info",null,"X"]
["Check Optical Drive",null,{"$f":"IF((VLOOKUP(E2091,INVENTORYDATA,7,FALSE))=\"YES\",\"X\",\"\")","v":{"$error":"#N/A"}},{"$f":"IF((VLOOKUP(E2091,INVENTORYDATA,7,FALSE))=\"NO\",\"X\",\"\")","v":{"$error":"#N/A"}},null,null,"Check Optical Drive",null,{"$f":"IF((VLOOKUP(K2091,INVENTORYDATA,7,FALSE))=\"YES\",\"X\",\"\")","v":{"$error":"#N/A"}},{"$f":"IF((VLOOKUP(K2091,INVENTORYDATA,7,FALSE))=\"NO\",\"X\",\"\")","v":{"$error":"#N/A"}}]
["Power Off",null,"X",{"$nulls":3},"Power Off",null,"X"]
["HDD Serial No.",null,{"$f":"IF(ISBLANK(VLOOKUP(E2091,INVENTORYDATA,12,FALSE)),\"\",VLOOKUP(E2091,INVENTORYDATA,12,FALSE))","v":{"$error":"#N/A"}},{"$nulls":3},"HDD Serial No.",null,{"$f":"IF(ISBLANK(VLOOKUP(K2091,INVENTORYDATA,12,FALSE)),\"\",VLOOKUP(K2091,INVENTORYDATA,12,FALSE))","v":{"$error":"#N/A"}}]
[]
["Tested for key functions,R2/Ready for Resale",{"$nulls":5},"Tested for key functions,R2/Ready for Resale"]
["BIOS Lock","Caddy","Optical","WebCam","Battery",null,"BIOS Lock","Caddy","Optical","WebCam","Battery"]
[null,null,{"$f":"VLOOKUP(E2091,INVENTORY!$A$2:$N$144,7,FALSE)","v":{"$error":"#N/A"}},{"$f":"VLOOKUP(E2091,INVENTORY!$A$2:$N$144,8,FALSE)","v":{"$error":"#N/A"}},{"$f":"VLOOKUP(E2091,INVENTORY!$A$2:$N$144,9,FALSE)","v":{"$error":"#N/A"}},{"$nulls":3},{"$f":"VLOOKUP(K2091,INVENTORY!$A$2:$N$144,7,FALSE)","v":{"$error":"#N/A"}},{"$f":"VLOOKUP(K2091,INVENTORY!$A$2:$N$144,8,FALSE)","v":{"$error":"#N/A"}},{"$f":"VLOOKUP(K2091,INVENTORY!$A$2:$N$144,9,FALSE)","v":{"$error":"#N/A"}}]
[]
["CPU Cosmetics Defects:",null,{"$f":"\"Function Code: \"&VLOOKUP(E2091,INVENTORY!$A$2:$Q$144,14,FALSE)","v":{"$error":"#N/A"}},{"$nulls":3},"CPU Cosmetics Defects:",null,{"$f":"\"Function Code: \"&VLOOKUP(K2091,INVENTORY!$A$2:$Q$144,14,FALSE)","v":{"$error":"#N/A"}}]
[]
[null,null,{"$f":"\"Cosmetic Code: \"&VLOOKUP(E2091,INVENTORY!$A$2:$Q$144,15,FALSE)","v":{"$error":"#N/A"}},{"$nulls":5},{"$f":"\"Cosmetic Code: \"&VLOOKUP(K2091,INVENTORY!$A$2:$Q$144,15,FALSE)","v":{"$error":"#N/A"}}]
[]
["Casing","Plugs/Ports",{"$nulls":4},"Casing","Plugs/Ports"]
["Pass","Pass",{"$nulls":4},"Pass","Pass"]
["Fail","Fail",null,"TRRC#:L.T.R.",null,null,"Fail","Fail",null,"TRRC#:L.T.R."]
[]
["LAPTOP TESTING RECORD",{"$nulls":5},"LAPTOP TESTING RECORD"]
[]
[{"$nulls":3},"ITEM #",{"$f":"E2091+2","v":147},{"$nulls":4},"ITEM #",{"$f":"K2091+2","v":148}]
["Tester: ","RR","Date:",{"$f":"NOW()","v":"2026-01-06T11:13:00.960"},null,null,"Tester: ","RR","Date:",{"$f":"NOW()","v":"2026-01-06T11:13:00.960"}]
["Type: ","LAPTOP","SN:",{"$f":"VLOOKUP(E2120,INVENTORYDATA,10,FALSE)","v":{"$error":"#N/A"}},null,null,"Type: ","LAPTOP","SN:",{"$f":"VLOOKUP(K2120,INVENTORYDATA,10,FALSE)","v":{"$error":"#N/A"}}]
[{"$f":"\"Make: \"","v":"Make: "},{"$f":"VLOOKUP(E2120,INVENTORYDATA,2,FALSE)","v":{"$error":"#N/A"}},{"$f":"\"Model: \"","v":"Model: "},{"$f":"VLOOKUP(E2120,INVENTORYDATA,3,FALSE)","v":{"$error":"#N/A"}},null,null,{"$f":"\"Make: \"","v":"Make: "},{"$f":"VLOOKUP(K2120,INVENTORYDATA,2,FALSE)","v":{"$error":"#N/A"}},{"$f":"\"Model: \"","v":"Model: "},{"$f":"VLOOKUP(K2120,INVENTORYDATA,3,FALSE)","v":{"$error":"#N/A"}}]
[{"$f":"\"CPU/Speed: \"","v":"CPU/Speed: "},{"$f":"VLOOKUP(E2120,INVENTORYDATA,4,FALSE)&\" / \"&VLOOKUP(E2120,INVENTORYDATA,5,FALSE)&\"GHz\"","v":{"$error":"#N/A"}},null,{"$f":"\"Memory: \"","v":"Memory: "},{"$f":"VLOOKUP(E2120,INVENTORYDATA,6,FALSE)","v":{"$error":"#N/A"}},null,{"$f":"\"CPU/Speed: \"","v":"CPU/Speed: "},{"$f":"VLOOKUP(K2120,INVENTORYDATA,4,FALSE)&\" / \"&VLOOKUP(K2120,INVENTORYDATA,5,FALSE)&\"GHz\"","v":{"$error":"#N/A"}},null,{"$f":"\"Memory: \"","v":"Memory: "},{"$f":"VLOOKUP(K2120,INVENTORYDATA,6,FALSE)","v":{"$error":"#N/A"}}]
[]
["Key Function",null,"Pass","Fail ","Comments",null,"Key Function",null,"Pass","Fail ","Comments"]
["Hard Drive Removed",null,{"$f":"IF(ISBLANK(VLOOKUP(E2120,INVENTORYDATA,13,FALSE)),\"X\",\"\")","v":""},null,{"$f":"IF(ISBLANK(VLOOKUP(E2120,INVENTORYDATA,13,FALSE)),\"\",VLOOKUP(E2120,INVENTORYDATA,13,FALSE))","v":{"$error":"#N/A"}},null,"Hard Drive Removed",null,{"$f":"IF(ISBLANK(VLOOKUP(K2120,INVENTORYDATA,13,FALSE)),\"X\",\"\")","v":""},null,{"$f":"IF(ISBLANK(VLOOKUP(K2120,INVENTORYDATA,13,FALSE)),\"\",VLOOKUP(K2120,INVENTORYDATA,13,FALSE))","v":{"$error":"#N/A"}}]
["Install Memory",null,"X",{"$nulls":3},"Install Memory",null,"X"]
["Power ON",null,"X",{"$nulls":3},"Power ON",null,"X"]
["Record BIOS info",null,"X",{"$nulls":3},"Record BIOS info",null,"X"]
["Check Optical Drive",null,{"$f":"IF((VLOOKUP(E2120,INVENTORYDATA,7,FALSE))=\"YES\",\"X\",\"\")","v":{"$error":"#N/A"}},{"$f":"IF((VLOOKUP(E2120,INVENTORYDATA,7,FALSE))=\"NO\",\"X\",\"\")","v":{"$error":"#N/A"}},null,null,"Check Optical Drive",null,{"$f":"IF((VLOOKUP(K2120,INVENTORYDATA,7,FALSE))=\"YES\",\"X\",\"\")","v":{"$error":"#N/A"}},{"$f":"IF((VLOOKUP(K2120,INVENTORYDATA,7,FALSE))=\"NO\",\"X\",\"\")","v":{"$error":"#N/A"}}]
["Power Off",null,"X",{"$nulls":3},"Power Off",null,"X"]
["HDD Serial No.",null,{"$f":"IF(ISBLANK(VLOOKUP(E2120,INVENTORYDATA,12,FALSE)),\"\",VLOOKUP(E2120,INVENTORYDATA,12,FALSE))","v":{"$error":"#N/A"}},{"$nulls":3},"HDD Serial No.",null,{"$f":"IF(ISBLANK(VLOOKUP(K2120,INVENTORYDATA,12,FALSE)),\"\",VLOOKUP(K2120,INVENTORYDATA,12,FALSE))","v":{"$error":"#N/A"}}]
[]
["Tested for key functions,R2/Ready for Resale",{"$nulls":5},"Tested for key functions,R2/Ready for Resale"]
["BIOS Lock","Caddy","Optical","WebCam","Battery",null,"BIOS Lock","Caddy","Optical","WebCam","Battery"]
[null,null,{"$f":"VLOOKUP(E2120,INVENTORY!$A$2:$N$144,7,FALSE)","v":{"$error":"#N/A"}},{"$f":"VLOOKUP(E2120,INVENTORY!$A$2:$N$144,8,FALSE)","v":{"$error":"#N/A"}},{"$f":"VLOOKUP(E2120,INVENTORY!$A$2:$N$144,9,FALSE)","v":{"$error":"#N/A"}},{"$nulls":3},{"$f":"VLOOKUP(K2120,INVENTORY!$A$2:$N$144,7,FALSE)","v":{"$error":"#N/A"}},{"$f":"VLOOKUP(K2120,INVENTORY!$A$2:$N$144,8,FALSE)","v":{"$error":"#N/A"}},{"$f":"VLOOKUP(K2120,INVENTORY!$A$2:$N$144,9,FALSE)","v":{"$error":"#N/A"}}]
[]
["CPU Cosmetics Defects:",null,{"$f":"\"Function Code: \"&VLOOKUP(E2120,INVENTORY!$A$2:$Q$144,14,FALSE)","v":{"$error":"#N/A"}},{"$nulls":3},"CPU Cosmetics Defects:",null,{"$f":"\"Function Code: \"&VLOOKUP(K2120,INVENTORY!$A$2:$Q$144,14,FALSE)","v":{"$error":"#N/A"}}]
[]
[null,null,{"$f":"\"Cosmetic Code: \"&VLOOKUP(E2120,INVENTORY!$A$2:$Q$144,15,FALSE)","v":{"$error":"#N/A"}},{"$nulls":5},{"$f":"\"Cosmetic Code: \"&VLOOKUP(K2120,INVENTORY!$A$2:$Q$144,15,FALSE)","v":{"$error":"#N/A"}}]
[]
["Casing","Plugs/Ports",{"$nulls":4},"Casing","Plugs/Ports"]
["Pass","Pass",{"$nulls":4},"Pass","Pass"]
["Fail","Fail",null,"TRRC#:L.T.R.",null,null,"Fail","Fail",null,"TRRC#:L.T.R."]
[]
["LAPTOP TESTING RECORD",{"$nulls":5},"LAPTOP TESTING RECORD"]
[]
[{"$nulls":3},"ITEM #",{"$f":"E2120+2","v":149},{"$nulls":4},"ITEM #",{"$f":"K2120+2","v":150}]
["Tester: ","RR","Date:",{"$f":"NOW()","v":"2026-01-06T11:13:00.960"},null,null,"Tester: ","RR","Date:",{"$f":"NOW()","v":"2026-01-06T11:13:00.960"}]
["Type: ","LAPTOP","SN:",{"$f":"VLOOKUP(E2149,INVENTORYDATA,10,FALSE)","v":{"$error":"#N/A"}},null,null,"Type: ","LAPTOP","SN:",{"$f":"VLOOKUP(K2149,INVENTORYDATA,10,FALSE)","v":{"$error":"#N/A"}}]
[{"$f":"\"Make: \"","v":"Make: "},{"$f":"VLOOKUP(E2149,INVENTORYDATA,2,FALSE)","v":{"$error":"#N/A"}},{"$f":"\"Model: \"","v":"Model: "},{"$f":"VLOOKUP(E2149,INVENTORYDATA,3,FALSE)","v":{"$error":"#N/A"}},null,null,{"$f":"\"Make: \"","v":"Make: "},{"$f":"VLOOKUP(K2149,INVENTORYDATA,2,FALSE)","v":{"$error":"#N/A"}},{"$f":"\"Model: \"","v":"Model: "},{"$f":"VLOOKUP(K2149,INVENTORYDATA,3,FALSE)","v":{"$error":"#N/A"}}]
[{"$f":"\"CPU/Speed: \"","v":"CPU/Speed: "},{"$f":"VLOOKUP(E2149,INVENTORYDATA,4,FALSE)&\" / \"&VLOOKUP(E2149,INVENTORYDATA,5,FALSE)&\"GHz\"","v":{"$error":"#N/A"}},null,{"$f":"\"Memory: \"","v":"Memory: "},{"$f":"VLOOKUP(E2149,INVENTORYDATA,6,FALSE)","v":{"$error":"#N/A"}},null,{"$f":"\"CPU/Speed: \"","v":"CPU/Speed: "},{"$f":"VLOOKUP(K2149,INVENTORYDATA,4,FALSE)&\" / \"&VLOOKUP(K2149,INVENTORYDATA,5,FALSE)&\"GHz\"","v":{"$error":"#N/A"}},null,{"$f":"\"Memory: \"","v":"Memory: "},{"$f":"VLOOKUP(K2149,INVENTORYDATA,6,FALSE)","v":{"$error":"#N/A"}}]
[]
["Key Function",null,"Pass","Fail ","Comments",null,"Key Function",null,"Pass","Fail ","Comments"]
["Hard Drive Removed",null,{"$f":"IF(ISBLANK(VLOOKUP(E2149,INVENTORYDATA,13,FALSE)),\"X\",\"\")","v":""},null,{"$f":"IF(ISBLANK(VLOOKUP(E2149,INVENTORYDATA,13,FALSE)),\"\",VLOOKUP(E2149,INVENTORYDATA,13,FALSE))","v":{"$error":"#N/A"}},null,"Hard Drive Removed",null,{"$f":"IF(ISBLANK(VLOOKUP(K2149,INVENTORYDATA,13,FALSE)),\"X\",\"\")","v":""},null,{"$f":"IF(ISBLANK(VLOOKUP(K2149,INVENTORYDATA,13,FALSE)),\"\",VLOOKUP(K2149,INVENTORYDATA,13,FALSE))","v":{"$error":"#N/A"}}]
["Install Memory",null,"X",{"$nulls":3},"Install Memory",null,"X"]
["Power ON",null,"X",{"$nulls":3},"Power ON",null,"X"]
["Record BIOS info",null,"X",{"$nulls":3},"Record BIOS info",null,"X"]
["Check Optical Drive",null,{"$f":"IF((VLOOKUP(E2149,INVENTORYDATA,7,FALSE))=\"YES\",\"X\",\"\")","v":{"$error":"#N/A"}},{"$f":"IF((VLOOKUP(E2149,INVENTORYDATA,7,FALSE))=\"NO\",\"X\",\"\")","v":{"$error":"#N/A"}},null,null,"Check Optical Drive",null,{"$f":"IF((VLOOKUP(K2149,INVENTORYDATA,7,FALSE))=\"YES\",\"X\",\"\")","v":{"$error":"#N/A"}},{"$f":"IF((VLOOKUP(K2149,INVENTORYDATA,7,FALSE))=\"NO\",\"X\",\"\")","v":{"$error":"#N/A"}}]
["Power Off",null,"X",{"$nulls":3},"Power Off",null,"X"]
["HDD Serial No.",null,{"$f":"IF(ISBLANK(VLOOKUP(E2149,INVENTORYDATA,12,FALSE)),\"\",VLOOKUP(E2149,INVENTORYDATA,12,FALSE))","v":{"$error":"#N/A"}},{"$nulls":3},"HDD Serial No.",null,{"$f":"IF(ISBLANK(VLOOKUP(K2149,INVENTORYDATA,12,FALSE)),\"\",VLOOKUP(K2149,INVENTORYDATA,12,FALSE))","v":{"$error":"#N/A"}}]
[]
["Tested for key functions,R2/Ready for Resale",{"$nulls":5},"Tested for key functions,R2/Ready for Resale"]
["BIOS Lock","Caddy","Optical","WebCam","Battery",null,"BIOS Lock","Caddy","Optical","WebCam","Battery"]
[null,null,{"$f":"VLOOKUP(E2149,INVENTORY!$A$2:$N$144,7,FALSE)","v":{"$error":"#N/A"}},{"$f":"VLOOKUP(E2149,INVENTORY!$A$2:$N$144,8,FALSE)","v":{"$error":"#N/A"}},{"$f":"VLOOKUP(E2149,INVENTORY!$A$2:$N$144,9,FALSE)","v":{"$error":"#N/A"}},{"$nulls":3},{"$f":"VLOOKUP(K2149,INVENTORY!$A$2:$N$144,7,FALSE)","v":{"$error":"#N/A"}},{"$f":"VLOOKUP(K2149,INVENTORY!$A$2:$N$144,8,FALSE)","v":{"$error":"#N/A"}},{"$f":"VLOOKUP(K2149,INVENTORY!$A$2:$N$144,9,FALSE)","v":{"$error":"#N/A"}}]
[]
["CPU Cosmetics Defects:",null,{"$f":"\"Function Code: \"&VLOOKUP(E2149,INVENTORY!$A$2:$Q$144,14,FALSE)","v":{"$error":"#N/A"}},{"$nulls":3},"CPU Cosmetics Defects:",null,{"$f":"\"Function Code: \"&VLOOKUP(K2149,INVENTORY!$A$2:$Q$144,14,FALSE)","v":{"$error":"#N/A"}}]
[]
[null,null,{"$f":"\"Cosmetic Code: \"&VLOOKUP(E2149,INVENTORY!$A$2:$Q$144,15,FALSE)","v":{"$error":"#N/A"}},{"$nulls":5},{"$f":"\"Cosmetic Code: \"&VLOOKUP(K2149,INVENTORY!$A$2:$Q$144,15,FALSE)","v":{"$error":"#N/A"}}]
[]
["Casing","Plugs/Ports",{"$nulls":4},"Casing","Plugs/Ports"]
["Pass","Pass",{"$nulls":4},"Pass","Pass"]
["Fail","Fail",null,"TRRC#:L.T.R.",null,null,"Fail","Fail",null,"TRRC#:L.T.R."]
[]
["LAPTOP TESTING RECORD",{"$nulls":5},"LAPTOP TESTING RECORD"]
[]
[{"$nulls":3},"ITEM #",{"$f":"E2149+2","v":151},{"$nulls":4},"ITEM #",{"$f":"K2149+2","v":152}]
["Tester: ","RR","Date:",{"$f":"NOW()","v":"2026-01-06T11:13:00.960"},null,null,"Tester: ","RR","Date:",{"$f":"NOW()","v":"2026-01-06T11:13:00.960"}]
["Type: ","LAPTOP","SN:",{"$f":"VLOOKUP(E2178,INVENTORYDATA,10,FALSE)","v":{"$error":"#N/A"}},null,null,"Type: ","LAPTOP","SN:",{"$f":"VLOOKUP(K2178,INVENTORYDATA,10,FALSE)","v":{"$error":"#N/A"}}]
[{"$f":"\"Make: \"","v":"Make: "},{"$f":"VLOOKUP(E2178,INVENTORYDATA,2,FALSE)","v":{"$error":"#N/A"}},{"$f":"\"Model: \"","v":"Model: "},{"$f":"VLOOKUP(E2178,INVENTORYDATA,3,FALSE)","v":{"$error":"#N/A"}},null,null,{"$f":"\"Make: \"","v":"Make: "},{"$f":"VLOOKUP(K2178,INVENTORYDATA,2,FALSE)","v":{"$error":"#N/A"}},{"$f":"\"Model: \"","v":"Model: "},{"$f":"VLOOKUP(K2178,INVENTORYDATA,3,FALSE)","v":{"$error":"#N/A"}}]
[{"$f":"\"CPU/Speed: \"","v":"CPU/Speed: "},{"$f":"VLOOKUP(E2178,INVENTORYDATA,4,FALSE)&\" / \"&VLOOKUP(E2178,INVENTORYDATA,5,FALSE)&\"GHz\"","v":{"$error":"#N/A"}},null,{"$f":"\"Memory: \"","v":"Memory: "},{"$f":"VLOOKUP(E2178,INVENTORYDATA,6,FALSE)","v":{"$error":"#N/A"}},null,{"$f":"\"CPU/Speed: \"","v":"CPU/Speed: "},{"$f":"VLOOKUP(K2178,INVENTORYDATA,4,FALSE)&\" / \"&VLOOKUP(K2178,INVENTORYDATA,5,FALSE)&\"GHz\"","v":{"$error":"#N/A"}},null,{"$f":"\"Memory: \"","v":"Memory: "},{"$f":"VLOOKUP(K2178,INVENTORYDATA,6,FALSE)","v":{"$error":"#N/A"}}]
[]
["Key Function",null,"Pass","Fail ","Comments",null,"Key Function",null,"Pass","Fail ","Comments"]
["Hard Drive Removed",null,{"$f":"IF(ISBLANK(VLOOKUP(E2178,INVENTORYDATA,13,FALSE)),\"X\",\"\")","v":""},null,{"$f":"IF(ISBLANK(VLOOKUP(E2178,INVENTORYDATA,13,FALSE)),\"\",VLOOKUP(E2178,INVENTORYDATA,13,FALSE))","v":{"$error":"#N/A"}},null,"Hard Drive Removed",null,{"$f":"IF(ISBLANK(VLOOKUP(K2178,INVENTORYDATA,13,FALSE)),\"X\",\"\")","v":""},null,{"$f":"IF(ISBLANK(VLOOKUP(K2178,INVENTORYDATA,13,FALSE)),\"\",VLOOKUP(K2178,INVENTORYDATA,13,FALSE))","v":{"$error":"#N/A"}}]
["Install Memory",null,"X",{"$nulls":3},"Install Memory",null,"X"]
["Power ON",null,"X",{"$nulls":3},"Power ON",null,"X"]
["Record BIOS info",null,"X",{"$nulls":3},"Record BIOS info",null,"X"]
["Check Optical Drive",null,{"$f":"IF((VLOOKUP(E2178,INVENTORYDATA,7,FALSE))=\"YES\",\"X\",\"\")","v":{"$error":"#N/A"}},{"$f":"IF((VLOOKUP(E2178,INVENTORYDATA,7,FALSE))=\"NO\",\"X\",\"\")","v":{"$error":"#N/A"}},null,null,"Check Optical Drive",null,{"$f":"IF((VLOOKUP(K2178,INVENTORYDATA,7,FALSE))=\"YES\",\"X\",\"\")","v":{"$error":"#N/A"}},{"$f":"IF((VLOOKUP(K2178,INVENTORYDATA,7,FALSE))=\"NO\",\"X\",\"\")","v":{"$error":"#N/A"}}]
["Power Off",null,"X",{"$nulls":3},"Power Off",null,"X"]
["HDD Serial No.",null,{"$f":"IF(ISBLANK(VLOOKUP(E2178,INVENTORYDATA,12,FALSE)),\"\",VLOOKUP(E2178,INVENTORYDATA,12,FALSE))","v":{"$error":"#N/A"}},{"$nulls":3},"HDD Serial No.",null,{"$f":"IF(ISBLANK(VLOOKUP(K2178,INVENTORYDATA,12,FALSE)),\"\",VLOOKUP(K2178,INVENTORYDATA,12,FALSE))","v":{"$error":"#N/A"}}]
[]
["Tested for key functions,R2/Ready for Resale",{"$nulls":5},"Tested for key functions,R2/Ready for Resale"]
["BIOS Lock","Caddy","Optical","WebCam","Battery",null,"BIOS Lock","Caddy","Optical","WebCam","Battery"]
[null,null,{"$f":"VLOOKUP(E2178,INVENTORY!$A$2:$N$144,7,FALSE)","v":{"$error":"#N/A"}},{"$f":"VLOOKUP(E2178,INVENTORY!$A$2:$N$144,8,FALSE)","v":{"$error":"#N/A"}},{"$f":"VLOOKUP(E2178,INVENTORY!$A$2:$N$144,9,FALSE)","v":{"$error":"#N/A"}},{"$nulls":3},{"$f":"VLOOKUP(K2178,INVENTORY!$A$2:$N$144,7,FALSE)","v":{"$error":"#N/A"}},{"$f":"VLOOKUP(K2178,INVENTORY!$A$2:$N$144,8,FALSE)","v":{"$error":"#N/A"}},{"$f":"VLOOKUP(K2178,INVENTORY!$A$2:$N$144,9,FALSE)","v":{"$error":"#N/A"}}]
[]
["CPU Cosmetics Defects:",null,{"$f":"\"Function Code: \"&VLOOKUP(E2178,INVENTORY!$A$2:$Q$144,14,FALSE)","v":{"$error":"#N/A"}},{"$nulls":3},"CPU Cosmetics Defects:",null,{"$f":"\"Function Code: \"&VLOOKUP(K2178,INVENTORY!$A$2:$Q$144,14,FALSE)","v":{"$error":"#N/A"}}]
[]
[null,null,{"$f":"\"Cosmetic Code: \"&VLOOKUP(E2178,INVENTORY!$A$2:$Q$144,15,FALSE)","v":{"$error":"#N/A"}},{"$nulls":5},{"$f":"\"Cosmetic Code: \"&VLOOKUP(K2178,INVENTORY!$A$2:$Q$144,15,FALSE)","v":{"$error":"#N/A"}}]
[]
["Casing","Plugs/Ports",{"$nulls":4},"Casing","Plugs/Ports"]
["Pass","Pass",{"$nulls":4},"Pass","Pass"]
["Fail","Fail",null,"TRRC#:L.T.R.",null,null,"Fail","Fail",null,"TRRC#:L.T.R."]
[]
["LAPTOP TESTING RECORD",{"$nulls":5},"LAPTOP TESTING RECORD"]
[]
[{"$nulls":3},"ITEM #",{"$f":"E2178+2","v":153},{"$nulls":4},"ITEM #",{"$f":"K2178+2","v":154}]
["Tester: ","RR","Date:",{"$f":"NOW()","v":"2026-01-06T11:13:00.960"},null,null,"Tester: ","RR","Date:",{"$f":"NOW()","v":"2026-01-06T11:13:00.960"}]
["Type: ","LAPTOP","SN:",{"$f":"VLOOKUP(E2207,INVENTORYDATA,10,FALSE)","v":{"$error":"#N/A"}},null,null,"Type: ","LAPTOP","SN:",{"$f":"VLOOKUP(K2207,INVENTORYDATA,10,FALSE)","v":{"$error":"#N/A"}}]
[{"$f":"\"Make: \"","v":"Make: "},{"$f":"VLOOKUP(E2207,INVENTORYDATA,2,FALSE)","v":{"$error":"#N/A"}},{"$f":"\"Model: \"","v":"Model: "},{"$f":"VLOOKUP(E2207,INVENTORYDATA,3,FALSE)","v":{"$error":"#N/A"}},null,null,{"$f":"\"Make: \"","v":"Make: "},{"$f":"VLOOKUP(K2207,INVENTORYDATA,2,FALSE)","v":{"$error":"#N/A"}},{"$f":"\"Model: \"","v":"Model: "},{"$f":"VLOOKUP(K2207,INVENTORYDATA,3,FALSE)","v":{"$error":"#N/A"}}]
[{"$f":"\"CPU/Speed: \"","v":"CPU/Speed: "},{"$f":"VLOOKUP(E2207,INVENTORYDATA,4,FALSE)&\" / \"&VLOOKUP(E2207,INVENTORYDATA,5,FALSE)&\"GHz\"","v":{"$error":"#N/A"}},null,{"$f":"\"Memory: \"","v":"Memory: "},{"$f":"VLOOKUP(E2207,INVENTORYDATA,6,FALSE)","v":{"$error":"#N/A"}},null,{"$f":"\"CPU/Speed: \"","v":"CPU/Speed: "},{"$f":"VLOOKUP(K2207,INVENTORYDATA,4,FALSE)&\" / \"&VLOOKUP(K2207,INVENTORYDATA,5,FALSE)&\"GHz\"","v":{"$error":"#N/A"}},null,{"$f":"\"Memory: \"","v":"Memory: "},{"$f":"VLOOKUP(K2207,INVENTORYDATA,6,FALSE)","v":{"$error":"#N/A"}}]
[]
["Key Function",null,"Pass","Fail ","Comments",null,"Key Function",null,"Pass","Fail ","Comments"]
["Hard Drive Removed",null,{"$f":"IF(ISBLANK(VLOOKUP(E2207,INVENTORYDATA,13,FALSE)),\"X\",\"\")","v":""},null,{"$f":"IF(ISBLANK(VLOOKUP(E2207,INVENTORYDATA,13,FALSE)),\"\",VLOOKUP(E2207,INVENTORYDATA,13,FALSE))","v":{"$error":"#N/A"}},null,"Hard Drive Removed",null,{"$f":"IF(ISBLANK(VLOOKUP(K2207,INVENTORYDATA,13,FALSE)),\"X\",\"\")","v":""},null,{"$f":"IF(ISBLANK(VLOOKUP(K2207,INVENTORYDATA,13,FALSE)),\"\",VLOOKUP(K2207,INVENTORYDATA,13,FALSE))","v":{"$error":"#N/A"}}]
["Install Memory",null,"X",{"$nulls":3},"Install Memory",null,"X"]
["Power ON",null,"X",{"$nulls":3},"Power ON",null,"X"]
["Record BIOS info",null,"X",{"$nulls":3},"Record BIOS info",null,"X"]
["Check Optical Drive",null,{"$f":"IF((VLOOKUP(E2207,INVENTORYDATA,7,FALSE))=\"YES\",\"X\",\"\")","v":{"$error":"#N/A"}},{"$f":"IF((VLOOKUP(E2207,INVENTORYDATA,7,FALSE))=\"NO\",\"X\",\"\")","v":{"$error":"#N/A"}},null,null,"Check Optical Drive",null,{"$f":"IF((VLOOKUP(K2207,INVENTORYDATA,7,FALSE))=\"YES\",\"X\",\"\")","v":{"$error":"#N/A"}},{"$f":"IF((VLOOKUP(K2207,INVENTORYDATA,7,FALSE))=\"NO\",\"X\",\"\")","v":{"$error":"#N/A"}}]
["Power Off",null,"X",{"$nulls":3},"Power Off",null,"X"]
["HDD Serial No.",null,{"$f":"IF(ISBLANK(VLOOKUP(E2207,INVENTORYDATA,12,FALSE)),\"\",VLOOKUP(E2207,INVENTORYDATA,12,FALSE))","v":{"$error":"#N/A"}},{"$nulls":3},"HDD Serial No.",null,{"$f":"IF(ISBLANK(VLOOKUP(K2207,INVENTORYDATA,12,FALSE)),\"\",VLOOKUP(K2207,INVENTORYDATA,12,FALSE))","v":{"$error":"#N/A"}}]
[]
["Tested for key functions,R2/Ready for Resale",{"$nulls":5},"Tested for key functions,R2/Ready for Resale"]
["BIOS Lock","Caddy","Optical","WebCam","Battery",null,"BIOS Lock","Caddy","Optical","WebCam","Battery"]
[null,null,{"$f":"VLOOKUP(E2207,INVENTORY!$A$2:$N$144,7,FALSE)","v":{"$error":"#N/A"}},{"$f":"VLOOKUP(E2207,INVENTORY!$A$2:$N$144,8,FALSE)","v":{"$error":"#N/A"}},{"$f":"VLOOKUP(E2207,INVENTORY!$A$2:$N$144,9,FALSE)","v":{"$error":"#N/A"}},{"$nulls":3},{"$f":"VLOOKUP(K2207,INVENTORY!$A$2:$N$144,7,FALSE)","v":{"$error":"#N/A"}},{"$f":"VLOOKUP(K2207,INVENTORY!$A$2:$N$144,8,FALSE)","v":{"$error":"#N/A"}},{"$f":"VLOOKUP(K2207,INVENTORY!$A$2:$N$144,9,FALSE)","v":{"$error":"#N/A"}}]
[]
["CPU Cosmetics Defects:",null,{"$f":"\"Function Code: \"&VLOOKUP(E2207,INVENTORY!$A$2:$Q$144,14,FALSE)","v":{"$error":"#N/A"}},{"$nulls":3},"CPU Cosmetics Defects:",null,{"$f":"\"Function Code: \"&VLOOKUP(K2207,INVENTORY!$A$2:$Q$144,14,FALSE)","v":{"$error":"#N/A"}}]
[]
[null,null,{"$f":"\"Cosmetic Code: \"&VLOOKUP(E2207,INVENTORY!$A$2:$Q$144,15,FALSE)","v":{"$error":"#N/A"}},{"$nulls":5},{"$f":"\"Cosmetic Code: \"&VLOOKUP(K2207,INVENTORY!$A$2:$Q$144,15,FALSE)","v":{"$error":"#N/A"}}]
[]
["Casing","Plugs/Ports",{"$nulls":4},"Casing","Plugs/Ports"]
["Pass","Pass",{"$nulls":4},"Pass","Pass"]
["Fail","Fail",null,"TRRC#:L.T.R.",null,null,"Fail","Fail",null,"TRRC#:L.T.R."]
[]
["LAPTOP TESTING RECORD",{"$nulls":5},"LAPTOP TESTING RECORD"]
[]
[{"$nulls":3},"ITEM #",{"$f":"E2207+2","v":155},{"$nulls":4},"ITEM #",{"$f":"K2207+2","v":156}]
["Tester: ","RR","Date:",{"$f":"NOW()","v":"2026-01-06T11:13:00.960"},null,null,"Tester: ","RR","Date:",{"$f":"NOW()","v":"2026-01-06T11:13:00.960"}]
["Type: ","LAPTOP","SN:",{"$f":"VLOOKUP(E2236,INVENTORYDATA,10,FALSE)","v":{"$error":"#N/A"}},null,null,"Type: ","LAPTOP","SN:",{"$f":"VLOOKUP(K2236,INVENTORYDATA,10,FALSE)","v":{"$error":"#N/A"}}]
[{"$f":"\"Make: \"","v":"Make: "},{"$f":"VLOOKUP(E2236,INVENTORYDATA,2,FALSE)","v":{"$error":"#N/A"}},{"$f":"\"Model: \"","v":"Model: "},{"$f":"VLOOKUP(E2236,INVENTORYDATA,3,FALSE)","v":{"$error":"#N/A"}},null,null,{"$f":"\"Make: \"","v":"Make: "},{"$f":"VLOOKUP(K2236,INVENTORYDATA,2,FALSE)","v":{"$error":"#N/A"}},{"$f":"\"Model: \"","v":"Model: "},{"$f":"VLOOKUP(K2236,INVENTORYDATA,3,FALSE)","v":{"$error":"#N/A"}}]
[{"$f":"\"CPU/Speed: \"","v":"CPU/Speed: "},{"$f":"VLOOKUP(E2236,INVENTORYDATA,4,FALSE)&\" / \"&VLOOKUP(E2236,INVENTORYDATA,5,FALSE)&\"GHz\"","v":{"$error":"#N/A"}},null,{"$f":"\"Memory: \"","v":"Memory: "},{"$f":"VLOOKUP(E2236,INVENTORYDATA,6,FALSE)","v":{"$error":"#N/A"}},null,{"$f":"\"CPU/Speed: \"","v":"CPU/Speed: "},{"$f":"VLOOKUP(K2236,INVENTORYDATA,4,FALSE)&\" / \"&VLOOKUP(K2236,INVENTORYDATA,5,FALSE)&\"GHz\"","v":{"$error":"#N/A"}},null,{"$f":"\"Memory: \"","v":"Memory: "},{"$f":"VLOOKUP(K2236,INVENTORYDATA,6,FALSE)","v":{"$error":"#N/A"}}]
[]
["Key Function",null,"Pass","Fail ","Comments",null,"Key Function",null,"Pass","Fail ","Comments"]
["Hard Drive Removed",null,{"$f":"IF(ISBLANK(VLOOKUP(E2236,INVENTORYDATA,13,FALSE)),\"X\",\"\")","v":""},null,{"$f":"IF(ISBLANK(VLOOKUP(E2236,INVENTORYDATA,13,FALSE)),\"\",VLOOKUP(E2236,INVENTORYDATA,13,FALSE))","v":{"$error":"#N/A"}},null,"Hard Drive Removed",null,{"$f":"IF(ISBLANK(VLOOKUP(K2236,INVENTORYDATA,13,FALSE)),\"X\",\"\")","v":""},null,{"$f":"IF(ISBLANK(VLOOKUP(K2236,INVENTORYDATA,13,FALSE)),\"\",VLOOKUP(K2236,INVENTORYDATA,13,FALSE))","v":{"$error":"#N/A"}}]
["Install Memory",null,"X",{"$nulls":3},"Install Memory",null,"X"]
["Power ON",null,"X",{"$nulls":3},"Power ON",null,"X"]
["Record BIOS info",null,"X",{"$nulls":3},"Record BIOS info",null,"X"]
["Check Optical Drive",null,{"$f":"IF((VLOOKUP(E2236,INVENTORYDATA,7,FALSE))=\"YES\",\"X\",\"\")","v":{"$error":"#N/A"}},{"$f":"IF((VLOOKUP(E2236,INVENTORYDATA,7,FALSE))=\"NO\",\"X\",\"\")","v":{"$error":"#N/A"}},null,null,"Check Optical Drive",null,{"$f":"IF((VLOOKUP(K2236,INVENTORYDATA,7,FALSE))=\"YES\",\"X\",\"\")","v":{"$error":"#N/A"}},{"$f":"IF((VLOOKUP(K2236,INVENTORYDATA,7,FALSE))=\"NO\",\"X\",\"\")","v":{"$error":"#N/A"}}]
["Power Off",null,"X",{"$nulls":3},"Power Off",null,"X"]
["HDD Serial No.",null,{"$f":"IF(ISBLANK(VLOOKUP(E2236,INVENTORYDATA,12,FALSE)),\"\",VLOOKUP(E2236,INVENTORYDATA,12,FALSE))","v":{"$error":"#N/A"}},{"$nulls":3},"HDD Serial No.",null,{"$f":"IF(ISBLANK(VLOOKUP(K2236,INVENTORYDATA,12,FALSE)),\"\",VLOOKUP(K2236,INVENTORYDATA,12,FALSE))","v":{"$error":"#N/A"}}]
[]
["Tested for key functions,R2/Ready for Resale",{"$nulls":5},"Tested for key functions,R2/Ready for Resale"]
["BIOS Lock","Caddy","Optical","WebCam","Battery",null,"BIOS Lock","Caddy","Optical","WebCam","Battery"]
[null,null,{"$f":"VLOOKUP(E2236,INVENTORY!$A$2:$N$144,7,FALSE)","v":{"$error":"#N/A"}},{"$f":"VLOOKUP(E2236,INVENTORY!$A$2:$N$144,8,FALSE)","v":{"$error":"#N/A"}},{"$f":"VLOOKUP(E2236,INVENTORY!$A$2:$N$144,9,FALSE)","v":{"$error":"#N/A"}},{"$nulls":3},{"$f":"VLOOKUP(K2236,INVENTORY!$A$2:$N$144,7,FALSE)","v":{"$error":"#N/A"}},{"$f":"VLOOKUP(K2236,INVENTORY!$A$2:$N$144,8,FALSE)","v":{"$error":"#N/A"}},{"$f":"VLOOKUP(K2236,INVENTORY!$A$2:$N$144,9,FALSE)","v":{"$error":"#N/A"}}]
[]
["CPU Cosmetics Defects:",null,{"$f":"\"Function Code: \"&VLOOKUP(E2236,INVENTORY!$A$2:$Q$144,14,FALSE)","v":{"$error":"#N/A"}},{"$nulls":3},"CPU Cosmetics Defects:",null,{"$f":"\"Function Code: \"&VLOOKUP(K2236,INVENTORY!$A$2:$Q$144,14,FALSE)","v":{"$error":"#N/A"}}]
[]
[null,null,{"$f":"\"Cosmetic Code: \"&VLOOKUP(E2236,INVENTORY!$A$2:$Q$144,15,FALSE)","v":{"$error":"#N/A"}},{"$nulls":5},{"$f":"\"Cosmetic Code: \"&VLOOKUP(K2236,INVENTORY!$A$2:$Q$144,15,FALSE)","v":{"$error":"#N/A"}}]
[]
["Casing","Plugs/Ports",{"$nulls":4},"Casing","Plugs/Ports"]
["Pass","Pass",{"$nulls":4},"Pass","Pass"]
["Fail","Fail",null,"TRRC#:L.T.R.",null,null,"Fail","Fail",null,"TRRC#:L.T.R."]
[]
["LAPTOP TESTING RECORD",{"$nulls":5},"LAPTOP TESTING RECORD"]
[]
[{"$nulls":3},"ITEM #",{"$f":"E2236+2","v":157},{"$nulls":4},"ITEM #",{"$f":"K2236+2","v":158}]
["Tester: ","RR","Date:",{"$f":"NOW()","v":"2026-01-06T11:13:00.960"},null,null,"Tester: ","RR","Date:",{"$f":"NOW()","v":"2026-01-06T11:13:00.960"}]
["Type: ","LAPTOP","SN:",{"$f":"VLOOKUP(E2265,INVENTORYDATA,10,FALSE)","v":{"$error":"#N/A"}},null,null,"Type: ","LAPTOP","SN:",{"$f":"VLOOKUP(K2265,INVENTORYDATA,10,FALSE)","v":{"$error":"#N/A"}}]
[{"$f":"\"Make: \"","v":"Make: "},{"$f":"VLOOKUP(E2265,INVENTORYDATA,2,FALSE)","v":{"$error":"#N/A"}},{"$f":"\"Model: \"","v":"Model: "},{"$f":"VLOOKUP(E2265,INVENTORYDATA,3,FALSE)","v":{"$error":"#N/A"}},null,null,{"$f":"\"Make: \"","v":"Make: "},{"$f":"VLOOKUP(K2265,INVENTORYDATA,2,FALSE)","v":{"$error":"#N/A"}},{"$f":"\"Model: \"","v":"Model: "},{"$f":"VLOOKUP(K2265,INVENTORYDATA,3,FALSE)","v":{"$error":"#N/A"}}]
[{"$f":"\"CPU/Speed: \"","v":"CPU/Speed: "},{"$f":"VLOOKUP(E2265,INVENTORYDATA,4,FALSE)&\" / \"&VLOOKUP(E2265,INVENTORYDATA,5,FALSE)&\"GHz\"","v":{"$error":"#N/A"}},null,{"$f":"\"Memory: \"","v":"Memory: "},{"$f":"VLOOKUP(E2265,INVENTORYDATA,6,FALSE)","v":{"$error":"#N/A"}},null,{"$f":"\"CPU/Speed: \"","v":"CPU/Speed: "},{"$f":"VLOOKUP(K2265,INVENTORYDATA,4,FALSE)&\" / \"&VLOOKUP(K2265,INVENTORYDATA,5,FALSE)&\"GHz\"","v":{"$error":"#N/A"}},null,{"$f":"\"Memory: \"","v":"Memory: "},{"$f":"VLOOKUP(K2265,INVENTORYDATA,6,FALSE)","v":{"$error":"#N/A"}}]
[]
["Key Function",null,"Pass","Fail ","Comments",null,"Key Function",null,"Pass","Fail ","Comments"]
["Hard Drive Removed",null,{"$f":"IF(ISBLANK(VLOOKUP(E2265,INVENTORYDATA,13,FALSE)),\"X\",\"\")","v":""},null,{"$f":"IF(ISBLANK(VLOOKUP(E2265,INVENTORYDATA,13,FALSE)),\"\",VLOOKUP(E2265,INVENTORYDATA,13,FALSE))","v":{"$error":"#N/A"}},null,"Hard Drive Removed",null,{"$f":"IF(ISBLANK(VLOOKUP(K2265,INVENTORYDATA,13,FALSE)),\"X\",\"\")","v":""},null,{"$f":"IF(ISBLANK(VLOOKUP(K2265,INVENTORYDATA,13,FALSE)),\"\",VLOOKUP(K2265,INVENTORYDATA,13,FALSE))","v":{"$error":"#N/A"}}]
["Install Memory",null,"X",{"$nulls":3},"Install Memory",null,"X"]
["Power ON",null,"X",{"$nulls":3},"Power ON",null,"X"]
["Record BIOS info",null,"X",{"$nulls":3},"Record BIOS info",null,"X"]
["Check Optical Drive",null,{"$f":"IF((VLOOKUP(E2265,INVENTORYDATA,7,FALSE))=\"YES\",\"X\",\"\")","v":{"$error":"#N/A"}},{"$f":"IF((VLOOKUP(E2265,INVENTORYDATA,7,FALSE))=\"NO\",\"X\",\"\")","v":{"$error":"#N/A"}},null,null,"Check Optical Drive",null,{"$f":"IF((VLOOKUP(K2265,INVENTORYDATA,7,FALSE))=\"YES\",\"X\",\"\")","v":{"$error":"#N/A"}},{"$f":"IF((VLOOKUP(K2265,INVENTORYDATA,7,FALSE))=\"NO\",\"X\",\"\")","v":{"$error":"#N/A"}}]
["Power Off",null,"X",{"$nulls":3},"Power Off",null,"X"]
["HDD Serial No.",null,{"$f":"IF(ISBLANK(VLOOKUP(E2265,INVENTORYDATA,12,FALSE)),\"\",VLOOKUP(E2265,INVENTORYDATA,12,FALSE))","v":{"$error":"#N/A"}},{"$nulls":3},"HDD Serial No.",null,{"$f":"IF(ISBLANK(VLOOKUP(K2265,INVENTORYDATA,12,FALSE)),\"\",VLOOKUP(K2265,INVENTORYDATA,12,FALSE))","v":{"$error":"#N/A"}}]
[]
["Tested for key functions,R2/Ready for Resale",{"$nulls":5},"Tested for key functions,R2/Ready for Resale"]
["BIOS Lock","Caddy","Optical","WebCam","Battery",null,"BIOS Lock","Caddy","Optical","WebCam","Battery"]
[null,null,{"$f":"VLOOKUP(E2265,INVENTORY!$A$2:$N$144,7,FALSE)","v":{"$error":"#N/A"}},{"$f":"VLOOKUP(E2265,INVENTORY!$A$2:$N$144,8,FALSE)","v":{"$error":"#N/A"}},{"$f":"VLOOKUP(E2265,INVENTORY!$A$2:$N$144,9,FALSE)","v":{"$error":"#N/A"}},{"$nulls":3},{"$f":"VLOOKUP(K2265,INVENTORY!$A$2:$N$144,7,FALSE)","v":{"$error":"#N/A"}},{"$f":"VLOOKUP(K2265,INVENTORY!$A$2:$N$144,8,FALSE)","v":{"$error":"#N/A"}},{"$f":"VLOOKUP(K2265,INVENTORY!$A$2:$N$144,9,FALSE)","v":{"$error":"#N/A"}}]
[]
["CPU Cosmetics Defects:",null,{"$f":"\"Function Code: \"&VLOOKUP(E2265,INVENTORY!$A$2:$Q$144,14,FALSE)","v":{"$error":"#N/A"}},{"$nulls":3},"CPU Cosmetics Defects:",null,{"$f":"\"Function Code: \"&VLOOKUP(K2265,INVENTORY!$A$2:$Q$144,14,FALSE)","v":{"$error":"#N/A"}}]
[]
[null,null,{"$f":"\"Cosmetic Code: \"&VLOOKUP(E2265,INVENTORY!$A$2:$Q$144,15,FALSE)","v":{"$error":"#N/A"}},{"$nulls":5},{"$f":"\"Cosmetic Code: \"&VLOOKUP(K2265,INVENTORY!$A$2:$Q$144,15,FALSE)","v":{"$error":"#N/A"}}]
[]
["Casing","Plugs/Ports",{"$nulls":4},"Casing","Plugs/Ports"]
["Pass","Pass",{"$nulls":4},"Pass","Pass"]
["Fail","Fail",null,"TRRC#:L.T.R.",null,null,"Fail","Fail",null,"TRRC#:L.T.R."]
[]
["LAPTOP TESTING RECORD",{"$nulls":5},"LAPTOP TESTING RECORD"]
[]
[{"$nulls":3},"ITEM #",{"$f":"E2265+2","v":159},{"$nulls":4},"ITEM #",{"$f":"K2265+2","v":160}]
["Tester: ","RR","Date:",{"$f":"NOW()","v":"2026-01-06T11:13:00.960"},null,null,"Tester: ","RR","Date:",{"$f":"NOW()","v":"2026-01-06T11:13:00.960"}]
["Type: ","LAPTOP","SN:",{"$f":"VLOOKUP(E2294,INVENTORYDATA,10,FALSE)","v":{"$error":"#N/A"}},null,null,"Type: ","LAPTOP","SN:",{"$f":"VLOOKUP(K2294,INVENTORYDATA,10,FALSE)","v":{"$error":"#N/A"}}]
[{"$f":"\"Make: \"","v":"Make: "},{"$f":"VLOOKUP(E2294,INVENTORYDATA,2,FALSE)","v":{"$error":"#N/A"}},{"$f":"\"Model: \"","v":"Model: "},{"$f":"VLOOKUP(E2294,INVENTORYDATA,3,FALSE)","v":{"$error":"#N/A"}},null,null,{"$f":"\"Make: \"","v":"Make: "},{"$f":"VLOOKUP(K2294,INVENTORYDATA,2,FALSE)","v":{"$error":"#N/A"}},{"$f":"\"Model: \"","v":"Model: "},{"$f":"VLOOKUP(K2294,INVENTORYDATA,3,FALSE)","v":{"$error":"#N/A"}}]
[{"$f":"\"CPU/Speed: \"","v":"CPU/Speed: "},{"$f":"VLOOKUP(E2294,INVENTORYDATA,4,FALSE)&\" / \"&VLOOKUP(E2294,INVENTORYDATA,5,FALSE)&\"GHz\"","v":{"$error":"#N/A"}},null,{"$f":"\"Memory: \"","v":"Memory: "},{"$f":"VLOOKUP(E2294,INVENTORYDATA,6,FALSE)","v":{"$error":"#N/A"}},null,{"$f":"\"CPU/Speed: \"","v":"CPU/Speed: "},{"$f":"VLOOKUP(K2294,INVENTORYDATA,4,FALSE)&\" / \"&VLOOKUP(K2294,INVENTORYDATA,5,FALSE)&\"GHz\"","v":{"$error":"#N/A"}},null,{"$f":"\"Memory: \"","v":"Memory: "},{"$f":"VLOOKUP(K2294,INVENTORYDATA,6,FALSE)","v":{"$error":"#N/A"}}]
[]
["Key Function",null,"Pass","Fail ","Comments",null,"Key Function",null,"Pass","Fail ","Comments"]
["Hard Drive Removed",null,{"$f":"IF(ISBLANK(VLOOKUP(E2294,INVENTORYDATA,13,FALSE)),\"X\",\"\")","v":""},null,{"$f":"IF(ISBLANK(VLOOKUP(E2294,INVENTORYDATA,13,FALSE)),\"\",VLOOKUP(E2294,INVENTORYDATA,13,FALSE))","v":{"$error":"#N/A"}},null,"Hard Drive Removed",null,{"$f":"IF(ISBLANK(VLOOKUP(K2294,INVENTORYDATA,13,FALSE)),\"X\",\"\")","v":""},null,{"$f":"IF(ISBLANK(VLOOKUP(K2294,INVENTORYDATA,13,FALSE)),\"\",VLOOKUP(K2294,INVENTORYDATA,13,FALSE))","v":{"$error":"#N/A"}}]
["Install Memory",null,"X",{"$nulls":3},"Install Memory",null,"X"]
["Power ON",null,"X",{"$nulls":3},"Power ON",null,"X"]
["Record BIOS info",null,"X",{"$nulls":3},"Record BIOS info",null,"X"]
["Check Optical Drive",null,{"$f":"IF((VLOOKUP(E2294,INVENTORYDATA,7,FALSE))=\"YES\",\"X\",\"\")","v":{"$error":"#N/A"}},{"$f":"IF((VLOOKUP(E2294,INVENTORYDATA,7,FALSE))=\"NO\",\"X\",\"\")","v":{"$error":"#N/A"}},null,null,"Check Optical Drive",null,{"$f":"IF((VLOOKUP(K2294,INVENTORYDATA,7,FALSE))=\"YES\",\"X\",\"\")","v":{"$error":"#N/A"}},{"$f":"IF((VLOOKUP(K2294,INVENTORYDATA,7,FALSE))=\"NO\",\"X\",\"\")","v":{"$error":"#N/A"}}]
["Power Off",null,"X",{"$nulls":3},"Power Off",null,"X"]
["HDD Serial No.",null,{"$f":"IF(ISBLANK(VLOOKUP(E2294,INVENTORYDATA,12,FALSE)),\"\",VLOOKUP(E2294,INVENTORYDATA,12,FALSE))","v":{"$error":"#N/A"}},{"$nulls":3},"HDD Serial No.",null,{"$f":"IF(ISBLANK(VLOOKUP(K2294,INVENTORYDATA,12,FALSE)),\"\",VLOOKUP(K2294,INVENTORYDATA,12,FALSE))","v":{"$error":"#N/A"}}]
[]
["Tested for key functions,R2/Ready for Resale",{"$nulls":5},"Tested for key functions,R2/Ready for Resale"]
["BIOS Lock","Caddy","Optical","WebCam","Battery",null,"BIOS Lock","Caddy","Optical","WebCam","Battery"]
[null,null,{"$f":"VLOOKUP(E2294,INVENTORY!$A$2:$N$144,7,FALSE)","v":{"$error":"#N/A"}},{"$f":"VLOOKUP(E2294,INVENTORY!$A$2:$N$144,8,FALSE)","v":{"$error":"#N/A"}},{"$f":"VLOOKUP(E2294,INVENTORY!$A$2:$N$144,9,FALSE)","v":{"$error":"#N/A"}},{"$nulls":3},{"$f":"VLOOKUP(K2294,INVENTORY!$A$2:$N$144,7,FALSE)","v":{"$error":"#N/A"}},{"$f":"VLOOKUP(K2294,INVENTORY!$A$2:$N$144,8,FALSE)","v":{"$error":"#N/A"}},{"$f":"VLOOKUP(K2294,INVENTORY!$A$2:$N$144,9,FALSE)","v":{"$error":"#N/A"}}]
[]
["CPU Cosmetics Defects:",null,{"$f":"\"Function Code: \"&VLOOKUP(E2294,INVENTORY!$A$2:$Q$144,14,FALSE)","v":{"$error":"#N/A"}},{"$nulls":3},"CPU Cosmetics Defects:",null,{"$f":"\"Function Code: \"&VLOOKUP(K2294,INVENTORY!$A$2:$Q$144,14,FALSE)","v":{"$error":"#N/A"}}]
[]
[null,null,{"$f":"\"Cosmetic Code: \"&VLOOKUP(E2294,INVENTORY!$A$2:$Q$144,15,FALSE)","v":{"$error":"#N/A"}},{"$nulls":5},{"$f":"\"Cosmetic Code: \"&VLOOKUP(K2294,INVENTORY!$A$2:$Q$144,15,FALSE)","v":{"$error":"#N/A"}}]
[]
["Casing","Plugs/Ports",{"$nulls":4},"Casing","Plugs/Ports"]
["Pass","Pass",{"$nulls":4},"Pass","Pass"]
["Fail","Fail",null,"TRRC#:L.T.R.",null,null,"Fail","Fail",null,"TRRC#:L.T.R."]
[]
["LAPTOP TESTING RECORD",{"$nulls":5},"LAPTOP TESTING RECORD"]
[]
[{"$nulls":3},"ITEM #",{"$f":"E2294+2","v":161},{"$nulls":4},"ITEM #",{"$f":"K2294+2","v":162}]
["Tester: ","RR","Date:",{"$f":"NOW()","v":"2026-01-06T11:13:00.960"},null,null,"Tester: ","RR","Date:",{"$f":"NOW()","v":"2026-01-06T11:13:00.960"}]
["Type: ","LAPTOP","SN:",{"$f":"VLOOKUP(E2323,INVENTORYDATA,10,FALSE)","v":{"$error":"#N/A"}},null,null,"Type: ","LAPTOP","SN:",{"$f":"VLOOKUP(K2323,INVENTORYDATA,10,FALSE)","v":{"$error":"#N/A"}}]
[{"$f":"\"Make: \"","v":"Make: "},{"$f":"VLOOKUP(E2323,INVENTORYDATA,2,FALSE)","v":{"$error":"#N/A"}},{"$f":"\"Model: \"","v":"Model: "},{"$f":"VLOOKUP(E2323,INVENTORYDATA,3,FALSE)","v":{"$error":"#N/A"}},null,null,{"$f":"\"Make: \"","v":"Make: "},{"$f":"VLOOKUP(K2323,INVENTORYDATA,2,FALSE)","v":{"$error":"#N/A"}},{"$f":"\"Model: \"","v":"Model: "},{"$f":"VLOOKUP(K2323,INVENTORYDATA,3,FALSE)","v":{"$error":"#N/A"}}]
[{"$f":"\"CPU/Speed: \"","v":"CPU/Speed: "},{"$f":"VLOOKUP(E2323,INVENTORYDATA,4,FALSE)&\" / \"&VLOOKUP(E2323,INVENTORYDATA,5,FALSE)&\"GHz\"","v":{"$error":"#N/A"}},null,{"$f":"\"Memory: \"","v":"Memory: "},{"$f":"VLOOKUP(E2323,INVENTORYDATA,6,FALSE)","v":{"$error":"#N/A"}},null,{"$f":"\"CPU/Speed: \"","v":"CPU/Speed: "},{"$f":"VLOOKUP(K2323,INVENTORYDATA,4,FALSE)&\" / \"&VLOOKUP(K2323,INVENTORYDATA,5,FALSE)&\"GHz\"","v":{"$error":"#N/A"}},null,{"$f":"\"Memory: \"","v":"Memory: "},{"$f":"VLOOKUP(K2323,INVENTORYDATA,6,FALSE)","v":{"$error":"#N/A"}}]
[]
["Key Function",null,"Pass","Fail ","Comments",null,"Key Function",null,"Pass","Fail ","Comments"]
["Hard Drive Removed",null,{"$f":"IF(ISBLANK(VLOOKUP(E2323,INVENTORYDATA,13,FALSE)),\"X\",\"\")","v":""},null,{"$f":"IF(ISBLANK(VLOOKUP(E2323,INVENTORYDATA,13,FALSE)),\"\",VLOOKUP(E2323,INVENTORYDATA,13,FALSE))","v":{"$error":"#N/A"}},null,"Hard Drive Removed",null,{"$f":"IF(ISBLANK(VLOOKUP(K2323,INVENTORYDATA,13,FALSE)),\"X\",\"\")","v":""},null,{"$f":"IF(ISBLANK(VLOOKUP(K2323,INVENTORYDATA,13,FALSE)),\"\",VLOOKUP(K2323,INVENTORYDATA,13,FALSE))","v":{"$error":"#N/A"}}]
["Install Memory",null,"X",{"$nulls":3},"Install Memory",null,"X"]
["Power ON",null,"X",{"$nulls":3},"Power ON",null,"X"]
["Record BIOS info",null,"X",{"$nulls":3},"Record BIOS info",null,"X"]
["Check Optical Drive",null,{"$f":"IF((VLOOKUP(E2323,INVENTORYDATA,7,FALSE))=\"YES\",\"X\",\"\")","v":{"$error":"#N/A"}},{"$f":"IF((VLOOKUP(E2323,INVENTORYDATA,7,FALSE))=\"NO\",\"X\",\"\")","v":{"$error":"#N/A"}},null,null,"Check Optical Drive",null,{"$f":"IF((VLOOKUP(K2323,INVENTORYDATA,7,FALSE))=\"YES\",\"X\",\"\")","v":{"$error":"#N/A"}},{"$f":"IF((VLOOKUP(K2323,INVENTORYDATA,7,FALSE))=\"NO\",\"X\",\"\")","v":{"$error":"#N/A"}}]
["Power Off",null,"X",{"$nulls":3},"Power Off",null,"X"]
["HDD Serial No.",null,{"$f":"IF(ISBLANK(VLOOKUP(E2323,INVENTORYDATA,12,FALSE)),\"\",VLOOKUP(E2323,INVENTORYDATA,12,FALSE))","v":{"$error":"#N/A"}},{"$nulls":3},"HDD Serial No.",null,{"$f":"IF(ISBLANK(VLOOKUP(K2323,INVENTORYDATA,12,FALSE)),\"\",VLOOKUP(K2323,INVENTORYDATA,12,FALSE))","v":{"$error":"#N/A"}}]
[]
["Tested for key functions,R2/Ready for Resale",{"$nulls":5},"Tested for key functions,R2/Ready for Resale"]
["BIOS Lock","Caddy","Optical","WebCam","Battery",null,"BIOS Lock","Caddy","Optical","WebCam","Battery"]
[null,null,{"$f":"VLOOKUP(E2323,INVENTORY!$A$2:$N$144,7,FALSE)","v":{"$error":"#N/A"}},{"$f":"VLOOKUP(E2323,INVENTORY!$A$2:$N$144,8,FALSE)","v":{"$error":"#N/A"}},{"$f":"VLOOKUP(E2323,INVENTORY!$A$2:$N$144,9,FALSE)","v":{"$error":"#N/A"}},{"$nulls":3},{"$f":"VLOOKUP(K2323,INVENTORY!$A$2:$N$144,7,FALSE)","v":{"$error":"#N/A"}},{"$f":"VLOOKUP(K2323,INVENTORY!$A$2:$N$144,8,FALSE)","v":{"$error":"#N/A"}},{"$f":"VLOOKUP(K2323,INVENTORY!$A$2:$N$144,9,FALSE)","v":{"$error":"#N/A"}}]
[]
["CPU Cosmetics Defects:",null,{"$f":"\"Function Code: \"&VLOOKUP(E2323,INVENTORY!$A$2:$Q$144,14,FALSE)","v":{"$error":"#N/A"}},{"$nulls":3},"CPU Cosmetics Defects:",null,{"$f":"\"Function Code: \"&VLOOKUP(K2323,INVENTORY!$A$2:$Q$144,14,FALSE)","v":{"$error":"#N/A"}}]
[]
[null,null,{"$f":"\"Cosmetic Code: \"&VLOOKUP(E2323,INVENTORY!$A$2:$Q$144,15,FALSE)","v":{"$error":"#N/A"}},{"$nulls":5},{"$f":"\"Cosmetic Code: \"&VLOOKUP(K2323,INVENTORY!$A$2:$Q$144,15,FALSE)","v":{"$error":"#N/A"}}]
[]
["Casing","Plugs/Ports",{"$nulls":4},"Casing","Plugs/Ports"]
["Pass","Pass",{"$nulls":4},"Pass","Pass"]
["Fail","Fail",null,"TRRC#:L.T.R.",null,null,"Fail","Fail",null,"TRRC#:L.T.R."]
[]
["LAPTOP TESTING RECORD",{"$nulls":5},"LAPTOP TESTING RECORD"]
[]
[{"$nulls":3},"ITEM #",{"$f":"E2323+2","v":163},{"$nulls":4},"ITEM #",{"$f":"K2323+2","v":164}]
["Tester: ","RR","Date:",{"$f":"NOW()","v":"2026-01-06T11:13:00.960"},null,null,"Tester: ","RR","Date:",{"$f":"NOW()","v":"2026-01-06T11:13:00.960"}]
["Type: ","LAPTOP","SN:",{"$f":"VLOOKUP(E2352,INVENTORYDATA,10,FALSE)","v":{"$error":"#N/A"}},null,null,"Type: ","LAPTOP","SN:",{"$f":"VLOOKUP(K2352,INVENTORYDATA,10,FALSE)","v":{"$error":"#N/A"}}]
[{"$f":"\"Make: \"","v":"Make: "},{"$f":"VLOOKUP(E2352,INVENTORYDATA,2,FALSE)","v":{"$error":"#N/A"}},{"$f":"\"Model: \"","v":"Model: "},{"$f":"VLOOKUP(E2352,INVENTORYDATA,3,FALSE)","v":{"$error":"#N/A"}},null,null,{"$f":"\"Make: \"","v":"Make: "},{"$f":"VLOOKUP(K2352,INVENTORYDATA,2,FALSE)","v":{"$error":"#N/A"}},{"$f":"\"Model: \"","v":"Model: "},{"$f":"VLOOKUP(K2352,INVENTORYDATA,3,FALSE)","v":{"$error":"#N/A"}}]
[{"$f":"\"CPU/Speed: \"","v":"CPU/Speed: "},{"$f":"VLOOKUP(E2352,INVENTORYDATA,4,FALSE)&\" / \"&VLOOKUP(E2352,INVENTORYDATA,5,FALSE)&\"GHz\"","v":{"$error":"#N/A"}},null,{"$f":"\"Memory: \"","v":"Memory: "},{"$f":"VLOOKUP(E2352,INVENTORYDATA,6,FALSE)","v":{"$error":"#N/A"}},null,{"$f":"\"CPU/Speed: \"","v":"CPU/Speed: "},{"$f":"VLOOKUP(K2352,INVENTORYDATA,4,FALSE)&\" / \"&VLOOKUP(K2352,INVENTORYDATA,5,FALSE)&\"GHz\"","v":{"$error":"#N/A"}},null,{"$f":"\"Memory: \"","v":"Memory: "},{"$f":"VLOOKUP(K2352,INVENTORYDATA,6,FALSE)","v":{"$error":"#N/A"}}]
[]
["Key Function",null,"Pass","Fail ","Comments",null,"Key Function",null,"Pass","Fail ","Comments"]
["Hard Drive Removed",null,{"$f":"IF(ISBLANK(VLOOKUP(E2352,INVENTORYDATA,13,FALSE)),\"X\",\"\")","v":""},null,{"$f":"IF(ISBLANK(VLOOKUP(E2352,INVENTORYDATA,13,FALSE)),\"\",VLOOKUP(E2352,INVENTORYDATA,13,FALSE))","v":{"$error":"#N/A"}},null,"Hard Drive Removed",null,{"$f":"IF(ISBLANK(VLOOKUP(K2352,INVENTORYDATA,13,FALSE)),\"X\",\"\")","v":""},null,{"$f":"IF(ISBLANK(VLOOKUP(K2352,INVENTORYDATA,13,FALSE)),\"\",VLOOKUP(K2352,INVENTORYDATA,13,FALSE))","v":{"$error":"#N/A"}}]
["Install Memory",null,"X",{"$nulls":3},"Install Memory",null,"X"]
["Power ON",null,"X",{"$nulls":3},"Power ON",null,"X"]
["Record BIOS info",null,"X",{"$nulls":3},"Record BIOS info",null,"X"]
["Check Optical Drive",null,{"$f":"IF((VLOOKUP(E2352,INVENTORYDATA,7,FALSE))=\"YES\",\"X\",\"\")","v":{"$error":"#N/A"}},{"$f":"IF((VLOOKUP(E2352,INVENTORYDATA,7,FALSE))=\"NO\",\"X\",\"\")","v":{"$error":"#N/A"}},null,null,"Check Optical Drive",null,{"$f":"IF((VLOOKUP(K2352,INVENTORYDATA,7,FALSE))=\"YES\",\"X\",\"\")","v":{"$error":"#N/A"}},{"$f":"IF((VLOOKUP(K2352,INVENTORYDATA,7,FALSE))=\"NO\",\"X\",\"\")","v":{"$error":"#N/A"}}]
["Power Off",null,"X",{"$nulls":3},"Power Off",null,"X"]
["HDD Serial No.",null,{"$f":"IF(ISBLANK(VLOOKUP(E2352,INVENTORYDATA,12,FALSE)),\"\",VLOOKUP(E2352,INVENTORYDATA,12,FALSE))","v":{"$error":"#N/A"}},{"$nulls":3},"HDD Serial No.",null,{"$f":"IF(ISBLANK(VLOOKUP(K2352,INVENTORYDATA,12,FALSE)),\"\",VLOOKUP(K2352,INVENTORYDATA,12,FALSE))","v":{"$error":"#N/A"}}]
[]
["Tested for key functions,R2/Ready for Resale",{"$nulls":5},"Tested for key functions,R2/Ready for Resale"]
["BIOS Lock","Caddy","Optical","WebCam","Battery",null,"BIOS Lock","Caddy","Optical","WebCam","Battery"]
[null,null,{"$f":"VLOOKUP(E2352,INVENTORY!$A$2:$N$144,7,FALSE)","v":{"$error":"#N/A"}},{"$f":"VLOOKUP(E2352,INVENTORY!$A$2:$N$144,8,FALSE)","v":{"$error":"#N/A"}},{"$f":"VLOOKUP(E2352,INVENTORY!$A$2:$N$144,9,FALSE)","v":{"$error":"#N/A"}},{"$nulls":3},{"$f":"VLOOKUP(K2352,INVENTORY!$A$2:$N$144,7,FALSE)","v":{"$error":"#N/A"}},{"$f":"VLOOKUP(K2352,INVENTORY!$A$2:$N$144,8,FALSE)","v":{"$error":"#N/A"}},{"$f":"VLOOKUP(K2352,INVENTORY!$A$2:$N$144,9,FALSE)","v":{"$error":"#N/A"}}]
[]
["CPU Cosmetics Defects:",null,{"$f":"\"Function Code: \"&VLOOKUP(E2352,INVENTORY!$A$2:$Q$144,14,FALSE)","v":{"$error":"#N/A"}},{"$nulls":3},"CPU Cosmetics Defects:",null,{"$f":"\"Function Code: \"&VLOOKUP(K2352,INVENTORY!$A$2:$Q$144,14,FALSE)","v":{"$error":"#N/A"}}]
[]
[null,null,{"$f":"\"Cosmetic Code: \"&VLOOKUP(E2352,INVENTORY!$A$2:$Q$144,15,FALSE)","v":{"$error":"#N/A"}},{"$nulls":5},{"$f":"\"Cosmetic Code: \"&VLOOKUP(K2352,INVENTORY!$A$2:$Q$144,15,FALSE)","v":{"$error":"#N/A"}}]
[]
["Casing","Plugs/Ports",{"$nulls":4},"Casing","Plugs/Ports"]
["Pass","Pass",{"$nulls":4},"Pass","Pass"]
["Fail","Fail",null,"TRRC#:L.T.R.",null,null,"Fail","Fail",null,"TRRC#:L.T.R."]
[]
["LAPTOP TESTING RECORD",{"$nulls":5},"LAPTOP TESTING RECORD"]
[]
[{"$nulls":3},"ITEM #",{"$f":"E2352+2","v":165},{"$nulls":4},"ITEM #",{"$f":"K2352+2","v":166}]
["Tester: ","RR","Date:",{"$f":"NOW()","v":"2026-01-06T11:13:00.960"},null,null,"Tester: ","RR","Date:",{"$f":"NOW()","v":"2026-01-06T11:13:00.960"}]
["Type: ","LAPTOP","SN:",{"$f":"VLOOKUP(E2381,INVENTORYDATA,10,FALSE)","v":{"$error":"#N/A"}},null,null,"Type: ","LAPTOP","SN:",{"$f":"VLOOKUP(K2381,INVENTORYDATA,10,FALSE)","v":{"$error":"#N/A"}}]
[{"$f":"\"Make: \"","v":"Make: "},{"$f":"VLOOKUP(E2381,INVENTORYDATA,2,FALSE)","v":{"$error":"#N/A"}},{"$f":"\"Model: \"","v":"Model: "},{"$f":"VLOOKUP(E2381,INVENTORYDATA,3,FALSE)","v":{"$error":"#N/A"}},null,null,{"$f":"\"Make: \"","v":"Make: "},{"$f":"VLOOKUP(K2381,INVENTORYDATA,2,FALSE)","v":{"$error":"#N/A"}},{"$f":"\"Model: \"","v":"Model: "},{"$f":"VLOOKUP(K2381,INVENTORYDATA,3,FALSE)","v":{"$error":"#N/A"}}]
[{"$f":"\"CPU/Speed: \"","v":"CPU/Speed: "},{"$f":"VLOOKUP(E2381,INVENTORYDATA,4,FALSE)&\" / \"&VLOOKUP(E2381,INVENTORYDATA,5,FALSE)&\"GHz\"","v":{"$error":"#N/A"}},null,{"$f":"\"Memory: \"","v":"Memory: "},{"$f":"VLOOKUP(E2381,INVENTORYDATA,6,FALSE)","v":{"$error":"#N/A"}},null,{"$f":"\"CPU/Speed: \"","v":"CPU/Speed: "},{"$f":"VLOOKUP(K2381,INVENTORYDATA,4,FALSE)&\" / \"&VLOOKUP(K2381,INVENTORYDATA,5,FALSE)&\"GHz\"","v":{"$error":"#N/A"}},null,{"$f":"\"Memory: \"","v":"Memory: "},{"$f":"VLOOKUP(K2381,INVENTORYDATA,6,FALSE)","v":{"$error":"#N/A"}}]
[]
["Key Function",null,"Pass","Fail ","Comments",null,"Key Function",null,"Pass","Fail ","Comments"]
["Hard Drive Removed",null,{"$f":"IF(ISBLANK(VLOOKUP(E2381,INVENTORYDATA,13,FALSE)),\"X\",\"\")","v":""},null,{"$f":"IF(ISBLANK(VLOOKUP(E2381,INVENTORYDATA,13,FALSE)),\"\",VLOOKUP(E2381,INVENTORYDATA,13,FALSE))","v":{"$error":"#N/A"}},null,"Hard Drive Removed",null,{"$f":"IF(ISBLANK(VLOOKUP(K2381,INVENTORYDATA,13,FALSE)),\"X\",\"\")","v":""},null,{"$f":"IF(ISBLANK(VLOOKUP(K2381,INVENTORYDATA,13,FALSE)),\"\",VLOOKUP(K2381,INVENTORYDATA,13,FALSE))","v":{"$error":"#N/A"}}]
["Install Memory",null,"X",{"$nulls":3},"Install Memory",null,"X"]
["Power ON",null,"X",{"$nulls":3},"Power ON",null,"X"]
["Record BIOS info",null,"X",{"$nulls":3},"Record BIOS info",null,"X"]
["Check Optical Drive",null,{"$f":"IF((VLOOKUP(E2381,INVENTORYDATA,7,FALSE))=\"YES\",\"X\",\"\")","v":{"$error":"#N/A"}},{"$f":"IF((VLOOKUP(E2381,INVENTORYDATA,7,FALSE))=\"NO\",\"X\",\"\")","v":{"$error":"#N/A"}},null,null,"Check Optical Drive",null,{"$f":"IF((VLOOKUP(K2381,INVENTORYDATA,7,FALSE))=\"YES\",\"X\",\"\")","v":{"$error":"#N/A"}},{"$f":"IF((VLOOKUP(K2381,INVENTORYDATA,7,FALSE))=\"NO\",\"X\",\"\")","v":{"$error":"#N/A"}}]
["Power Off",null,"X",{"$nulls":3},"Power Off",null,"X"]
["HDD Serial No.",null,{"$f":"IF(ISBLANK(VLOOKUP(E2381,INVENTORYDATA,12,FALSE)),\"\",VLOOKUP(E2381,INVENTORYDATA,12,FALSE))","v":{"$error":"#N/A"}},{"$nulls":3},"HDD Serial No.",null,{"$f":"IF(ISBLANK(VLOOKUP(K2381,INVENTORYDATA,12,FALSE)),\"\",VLOOKUP(K2381,INVENTORYDATA,12,FALSE))","v":{"$error":"#N/A"}}]
[]
["Tested for key functions,R2/Ready for Resale",{"$nulls":5},"Tested for key functions,R2/Ready for Resale"]
["BIOS Lock","Caddy","Optical","WebCam","Battery",null,"BIOS Lock","Caddy","Optical","WebCam","Battery"]
[null,null,{"$f":"VLOOKUP(E2381,INVENTORY!$A$2:$N$144,7,FALSE)","v":{"$error":"#N/A"}},{"$f":"VLOOKUP(E2381,INVENTORY!$A$2:$N$144,8,FALSE)","v":{"$error":"#N/A"}},{"$f":"VLOOKUP(E2381,INVENTORY!$A$2:$N$144,9,FALSE)","v":{"$error":"#N/A"}},{"$nulls":3},{"$f":"VLOOKUP(K2381,INVENTORY!$A$2:$N$144,7,FALSE)","v":{"$error":"#N/A"}},{"$f":"VLOOKUP(K2381,INVENTORY!$A$2:$N$144,8,FALSE)","v":{"$error":"#N/A"}},{"$f":"VLOOKUP(K2381,INVENTORY!$A$2:$N$144,9,FALSE)","v":{"$error":"#N/A"}}]
[]
["CPU Cosmetics Defects:",null,{"$f":"\"Function Code: \"&VLOOKUP(E2381,INVENTORY!$A$2:$Q$144,14,FALSE)","v":{"$error":"#N/A"}},{"$nulls":3},"CPU Cosmetics Defects:",null,{"$f":"\"Function Code: \"&VLOOKUP(K2381,INVENTORY!$A$2:$Q$144,14,FALSE)","v":{"$error":"#N/A"}}]
[]
[null,null,{"$f":"\"Cosmetic Code: \"&VLOOKUP(E2381,INVENTORY!$A$2:$Q$144,15,FALSE)","v":{"$error":"#N/A"}},{"$nulls":5},{"$f":"\"Cosmetic Code: \"&VLOOKUP(K2381,INVENTORY!$A$2:$Q$144,15,FALSE)","v":{"$error":"#N/A"}}]
[]
["Casing","Plugs/Ports",{"$nulls":4},"Casing","Plugs/Ports"]
["Pass","Pass",{"$nulls":4},"Pass","Pass"]
["Fail","Fail",null,"TRRC#:L.T.R.",null,null,"Fail","Fail",null,"TRRC#:L.T.R."]
[]
["LAPTOP TESTING RECORD",{"$nulls":5},"LAPTOP TESTING RECORD"]
[]
[{"$nulls":3},"ITEM #",{"$f":"E2381+2","v":167},{"$nulls":4},"ITEM #",{"$f":"K2381+2","v":168}]
["Tester: ","RR","Date:",{"$f":"NOW()","v":"2026-01-06T11:13:00.960"},null,null,"Tester: ","RR","Date:",{"$f":"NOW()","v":"2026-01-06T11:13:00.960"}]
["Type: ","LAPTOP","SN:",{"$f":"VLOOKUP(E2410,INVENTORYDATA,10,FALSE)","v":{"$error":"#N/A"}},null,null,"Type: ","LAPTOP","SN:",{"$f":"VLOOKUP(K2410,INVENTORYDATA,10,FALSE)","v":{"$error":"#N/A"}}]
[{"$f":"\"Make: \"","v":"Make: "},{"$f":"VLOOKUP(E2410,INVENTORYDATA,2,FALSE)","v":{"$error":"#N/A"}},{"$f":"\"Model: \"","v":"Model: "},{"$f":"VLOOKUP(E2410,INVENTORYDATA,3,FALSE)","v":{"$error":"#N/A"}},null,null,{"$f":"\"Make: \"","v":"Make: "},{"$f":"VLOOKUP(K2410,INVENTORYDATA,2,FALSE)","v":{"$error":"#N/A"}},{"$f":"\"Model: \"","v":"Model: "},{"$f":"VLOOKUP(K2410,INVENTORYDATA,3,FALSE)","v":{"$error":"#N/A"}}]
[{"$f":"\"CPU/Speed: \"","v":"CPU/Speed: "},{"$f":"VLOOKUP(E2410,INVENTORYDATA,4,FALSE)&\" / \"&VLOOKUP(E2410,INVENTORYDATA,5,FALSE)&\"GHz\"","v":{"$error":"#N/A"}},null,{"$f":"\"Memory: \"","v":"Memory: "},{"$f":"VLOOKUP(E2410,INVENTORYDATA,6,FALSE)","v":{"$error":"#N/A"}},null,{"$f":"\"CPU/Speed: \"","v":"CPU/Speed: "},{"$f":"VLOOKUP(K2410,INVENTORYDATA,4,FALSE)&\" / \"&VLOOKUP(K2410,INVENTORYDATA,5,FALSE)&\"GHz\"","v":{"$error":"#N/A"}},null,{"$f":"\"Memory: \"","v":"Memory: "},{"$f":"VLOOKUP(K2410,INVENTORYDATA,6,FALSE)","v":{"$error":"#N/A"}}]
[]
["Key Function",null,"Pass","Fail ","Comments",null,"Key Function",null,"Pass","Fail ","Comments"]
["Hard Drive Removed",null,{"$f":"IF(ISBLANK(VLOOKUP(E2410,INVENTORYDATA,13,FALSE)),\"X\",\"\")","v":""},null,{"$f":"IF(ISBLANK(VLOOKUP(E2410,INVENTORYDATA,13,FALSE)),\"\",VLOOKUP(E2410,INVENTORYDATA,13,FALSE))","v":{"$error":"#N/A"}},null,"Hard Drive Removed",null,{"$f":"IF(ISBLANK(VLOOKUP(K2410,INVENTORYDATA,13,FALSE)),\"X\",\"\")","v":""},null,{"$f":"IF(ISBLANK(VLOOKUP(K2410,INVENTORYDATA,13,FALSE)),\"\",VLOOKUP(K2410,INVENTORYDATA,13,FALSE))","v":{"$error":"#N/A"}}]
["Install Memory",null,"X",{"$nulls":3},"Install Memory",null,"X"]
["Power ON",null,"X",{"$nulls":3},"Power ON",null,"X"]
["Record BIOS info",null,"X",{"$nulls":3},"Record BIOS info",null,"X"]
["Check Optical Drive",null,{"$f":"IF((VLOOKUP(E2410,INVENTORYDATA,7,FALSE))=\"YES\",\"X\",\"\")","v":{"$error":"#N/A"}},{"$f":"IF((VLOOKUP(E2410,INVENTORYDATA,7,FALSE))=\"NO\",\"X\",\"\")","v":{"$error":"#N/A"}},null,null,"Check Optical Drive",null,{"$f":"IF((VLOOKUP(K2410,INVENTORYDATA,7,FALSE))=\"YES\",\"X\",\"\")","v":{"$error":"#N/A"}},{"$f":"IF((VLOOKUP(K2410,INVENTORYDATA,7,FALSE))=\"NO\",\"X\",\"\")","v":{"$error":"#N/A"}}]
["Power Off",null,"X",{"$nulls":3},"Power Off",null,"X"]
["HDD Serial No.",null,{"$f":"IF(ISBLANK(VLOOKUP(E2410,INVENTORYDATA,12,FALSE)),\"\",VLOOKUP(E2410,INVENTORYDATA,12,FALSE))","v":{"$error":"#N/A"}},{"$nulls":3},"HDD Serial No.",null,{"$f":"IF(ISBLANK(VLOOKUP(K2410,INVENTORYDATA,12,FALSE)),\"\",VLOOKUP(K2410,INVENTORYDATA,12,FALSE))","v":{"$error":"#N/A"}}]
[]
["Tested for key functions,R2/Ready for Resale",{"$nulls":5},"Tested for key functions,R2/Ready for Resale"]
["BIOS Lock","Caddy","Optical","WebCam","Battery",null,"BIOS Lock","Caddy","Optical","WebCam","Battery"]
[null,null,{"$f":"VLOOKUP(E2410,INVENTORY!$A$2:$N$144,7,FALSE)","v":{"$error":"#N/A"}},{"$f":"VLOOKUP(E2410,INVENTORY!$A$2:$N$144,8,FALSE)","v":{"$error":"#N/A"}},{"$f":"VLOOKUP(E2410,INVENTORY!$A$2:$N$144,9,FALSE)","v":{"$error":"#N/A"}},{"$nulls":3},{"$f":"VLOOKUP(K2410,INVENTORY!$A$2:$N$144,7,FALSE)","v":{"$error":"#N/A"}},{"$f":"VLOOKUP(K2410,INVENTORY!$A$2:$N$144,8,FALSE)","v":{"$error":"#N/A"}},{"$f":"VLOOKUP(K2410,INVENTORY!$A$2:$N$144,9,FALSE)","v":{"$error":"#N/A"}}]
[]
["CPU Cosmetics Defects:",null,{"$f":"\"Function Code: \"&VLOOKUP(E2410,INVENTORY!$A$2:$Q$144,14,FALSE)","v":{"$error":"#N/A"}},{"$nulls":3},"CPU Cosmetics Defects:",null,{"$f":"\"Function Code: \"&VLOOKUP(K2410,INVENTORY!$A$2:$Q$144,14,FALSE)","v":{"$error":"#N/A"}}]
[]
[null,null,{"$f":"\"Cosmetic Code: \"&VLOOKUP(E2410,INVENTORY!$A$2:$Q$144,15,FALSE)","v":{"$error":"#N/A"}},{"$nulls":5},{"$f":"\"Cosmetic Code: \"&VLOOKUP(K2410,INVENTORY!$A$2:$Q$144,15,FALSE)","v":{"$error":"#N/A"}}]
[]
["Casing","Plugs/Ports",{"$nulls":4},"Casing","Plugs/Ports"]
["Pass","Pass",{"$nulls":4},"Pass","Pass"]
["Fail","Fail",null,"TRRC#:L.T.R.",null,null,"Fail","Fail",null,"TRRC#:L.T.R."]
[]
["LAPTOP TESTING RECORD",{"$nulls":5},"LAPTOP TESTING RECORD"]
[]
[{"$nulls":3},"ITEM #",{"$f":"E2410+2","v":169},{"$nulls":4},"ITEM #",{"$f":"K2410+2","v":170}]
["Tester: ","RR","Date:",{"$f":"NOW()","v":"2026-01-06T11:13:00.960"},null,null,"Tester: ","RR","Date:",{"$f":"NOW()","v":"2026-01-06T11:13:00.960"}]
["Type: ","LAPTOP","SN:",{"$f":"VLOOKUP(E2439,INVENTORYDATA,10,FALSE)","v":{"$error":"#N/A"}},null,null,"Type: ","LAPTOP","SN:",{"$f":"VLOOKUP(K2439,INVENTORYDATA,10,FALSE)","v":{"$error":"#N/A"}}]
[{"$f":"\"Make: \"","v":"Make: "},{"$f":"VLOOKUP(E2439,INVENTORYDATA,2,FALSE)","v":{"$error":"#N/A"}},{"$f":"\"Model: \"","v":"Model: "},{"$f":"VLOOKUP(E2439,INVENTORYDATA,3,FALSE)","v":{"$error":"#N/A"}},null,null,{"$f":"\"Make: \"","v":"Make: "},{"$f":"VLOOKUP(K2439,INVENTORYDATA,2,FALSE)","v":{"$error":"#N/A"}},{"$f":"\"Model: \"","v":"Model: "},{"$f":"VLOOKUP(K2439,INVENTORYDATA,3,FALSE)","v":{"$error":"#N/A"}}]
[{"$f":"\"CPU/Speed: \"","v":"CPU/Speed: "},{"$f":"VLOOKUP(E2439,INVENTORYDATA,4,FALSE)&\" / \"&VLOOKUP(E2439,INVENTORYDATA,5,FALSE)&\"GHz\"","v":{"$error":"#N/A"}},null,{"$f":"\"Memory: \"","v":"Memory: "},{"$f":"VLOOKUP(E2439,INVENTORYDATA,6,FALSE)","v":{"$error":"#N/A"}},null,{"$f":"\"CPU/Speed: \"","v":"CPU/Speed: "},{"$f":"VLOOKUP(K2439,INVENTORYDATA,4,FALSE)&\" / \"&VLOOKUP(K2439,INVENTORYDATA,5,FALSE)&\"GHz\"","v":{"$error":"#N/A"}},null,{"$f":"\"Memory: \"","v":"Memory: "},{"$f":"VLOOKUP(K2439,INVENTORYDATA,6,FALSE)","v":{"$error":"#N/A"}}]
[]
["Key Function",null,"Pass","Fail ","Comments",null,"Key Function",null,"Pass","Fail ","Comments"]
["Hard Drive Removed",null,{"$f":"IF(ISBLANK(VLOOKUP(E2439,INVENTORYDATA,13,FALSE)),\"X\",\"\")","v":""},null,{"$f":"IF(ISBLANK(VLOOKUP(E2439,INVENTORYDATA,13,FALSE)),\"\",VLOOKUP(E2439,INVENTORYDATA,13,FALSE))","v":{"$error":"#N/A"}},null,"Hard Drive Removed",null,{"$f":"IF(ISBLANK(VLOOKUP(K2439,INVENTORYDATA,13,FALSE)),\"X\",\"\")","v":""},null,{"$f":"IF(ISBLANK(VLOOKUP(K2439,INVENTORYDATA,13,FALSE)),\"\",VLOOKUP(K2439,INVENTORYDATA,13,FALSE))","v":{"$error":"#N/A"}}]
["Install Memory",null,"X",{"$nulls":3},"Install Memory",null,"X"]
["Power ON",null,"X",{"$nulls":3},"Power ON",null,"X"]
["Record BIOS info",null,"X",{"$nulls":3},"Record BIOS info",null,"X"]
["Check Optical Drive",null,{"$f":"IF((VLOOKUP(E2439,INVENTORYDATA,7,FALSE))=\"YES\",\"X\",\"\")","v":{"$error":"#N/A"}},{"$f":"IF((VLOOKUP(E2439,INVENTORYDATA,7,FALSE))=\"NO\",\"X\",\"\")","v":{"$error":"#N/A"}},null,null,"Check Optical Drive",null,{"$f":"IF((VLOOKUP(K2439,INVENTORYDATA,7,FALSE))=\"YES\",\"X\",\"\")","v":{"$error":"#N/A"}},{"$f":"IF((VLOOKUP(K2439,INVENTORYDATA,7,FALSE))=\"NO\",\"X\",\"\")","v":{"$error":"#N/A"}}]
["Power Off",null,"X",{"$nulls":3},"Power Off",null,"X"]
["HDD Serial No.",null,{"$f":"IF(ISBLANK(VLOOKUP(E2439,INVENTORYDATA,12,FALSE)),\"\",VLOOKUP(E2439,INVENTORYDATA,12,FALSE))","v":{"$error":"#N/A"}},{"$nulls":3},"HDD Serial No.",null,{"$f":"IF(ISBLANK(VLOOKUP(K2439,INVENTORYDATA,12,FALSE)),\"\",VLOOKUP(K2439,INVENTORYDATA,12,FALSE))","v":{"$error":"#N/A"}}]
[]
["Tested for key functions,R2/Ready for Resale",{"$nulls":5},"Tested for key functions,R2/Ready for Resale"]
["BIOS Lock","Caddy","Optical","WebCam","Battery",null,"BIOS Lock","Caddy","Optical","WebCam","Battery"]
[null,null,{"$f":"VLOOKUP(E2439,INVENTORY!$A$2:$N$144,7,FALSE)","v":{"$error":"#N/A"}},{"$f":"VLOOKUP(E2439,INVENTORY!$A$2:$N$144,8,FALSE)","v":{"$error":"#N/A"}},{"$f":"VLOOKUP(E2439,INVENTORY!$A$2:$N$144,9,FALSE)","v":{"$error":"#N/A"}},{"$nulls":3},{"$f":"VLOOKUP(K2439,INVENTORY!$A$2:$N$144,7,FALSE)","v":{"$error":"#N/A"}},{"$f":"VLOOKUP(K2439,INVENTORY!$A$2:$N$144,8,FALSE)","v":{"$error":"#N/A"}},{"$f":"VLOOKUP(K2439,INVENTORY!$A$2:$N$144,9,FALSE)","v":{"$error":"#N/A"}}]
[]
["CPU Cosmetics Defects:",null,{"$f":"\"Function Code: \"&VLOOKUP(E2439,INVENTORY!$A$2:$Q$144,14,FALSE)","v":{"$error":"#N/A"}},{"$nulls":3},"CPU Cosmetics Defects:",null,{"$f":"\"Function Code: \"&VLOOKUP(K2439,INVENTORY!$A$2:$Q$144,14,FALSE)","v":{"$error":"#N/A"}}]
[]
[null,null,{"$f":"\"Cosmetic Code: \"&VLOOKUP(E2439,INVENTORY!$A$2:$Q$144,15,FALSE)","v":{"$error":"#N/A"}},{"$nulls":5},{"$f":"\"Cosmetic Code: \"&VLOOKUP(K2439,INVENTORY!$A$2:$Q$144,15,FALSE)","v":{"$error":"#N/A"}}]
[]
["Casing","Plugs/Ports",{"$nulls":4},"Casing","Plugs/Ports"]
["Pass","Pass",{"$nulls":4},"Pass","Pass"]
["Fail","Fail",null,"TRRC#:L.T.R.",null,null,"Fail","Fail",null,"TRRC#:L.T.R."]
[]
["LAPTOP TESTING RECORD",{"$nulls":5},"LAPTOP TESTING RECORD"]
[]
[{"$nulls":3},"ITEM #",{"$f":"E2439+2","v":171},{"$nulls":4},"ITEM #",{"$f":"K2439+2","v":172}]
["Tester: ","RR","Date:",{"$f":"NOW()","v":"2026-01-06T11:13:00.960"},null,null,"Tester: ","RR","Date:",{"$f":"NOW()","v":"2026-01-06T11:13:00.960"}]
["Type: ","LAPTOP","SN:",{"$f":"VLOOKUP(E2468,INVENTORYDATA,10,FALSE)","v":{"$error":"#N/A"}},null,null,"Type: ","LAPTOP","SN:",{"$f":"VLOOKUP(K2468,INVENTORYDATA,10,FALSE)","v":{"$error":"#N/A"}}]
[{"$f":"\"Make: \"","v":"Make: "},{"$f":"VLOOKUP(E2468,INVENTORYDATA,2,FALSE)","v":{"$error":"#N/A"}},{"$f":"\"Model: \"","v":"Model: "},{"$f":"VLOOKUP(E2468,INVENTORYDATA,3,FALSE)","v":{"$error":"#N/A"}},null,null,{"$f":"\"Make: \"","v":"Make: "},{"$f":"VLOOKUP(K2468,INVENTORYDATA,2,FALSE)","v":{"$error":"#N/A"}},{"$f":"\"Model: \"","v":"Model: "},{"$f":"VLOOKUP(K2468,INVENTORYDATA,3,FALSE)","v":{"$error":"#N/A"}}]
[{"$f":"\"CPU/Speed: \"","v":"CPU/Speed: "},{"$f":"VLOOKUP(E2468,INVENTORYDATA,4,FALSE)&\" / \"&VLOOKUP(E2468,INVENTORYDATA,5,FALSE)&\"GHz\"","v":{"$error":"#N/A"}},null,{"$f":"\"Memory: \"","v":"Memory: "},{"$f":"VLOOKUP(E2468,INVENTORYDATA,6,FALSE)","v":{"$error":"#N/A"}},null,{"$f":"\"CPU/Speed: \"","v":"CPU/Speed: "},{"$f":"VLOOKUP(K2468,INVENTORYDATA,4,FALSE)&\" / \"&VLOOKUP(K2468,INVENTORYDATA,5,FALSE)&\"GHz\"","v":{"$error":"#N/A"}},null,{"$f":"\"Memory: \"","v":"Memory: "},{"$f":"VLOOKUP(K2468,INVENTORYDATA,6,FALSE)","v":{"$error":"#N/A"}}]
[]
["Key Function",null,"Pass","Fail ","Comments",null,"Key Function",null,"Pass","Fail ","Comments"]
["Hard Drive Removed",null,{"$f":"IF(ISBLANK(VLOOKUP(E2468,INVENTORYDATA,13,FALSE)),\"X\",\"\")","v":""},null,{"$f":"IF(ISBLANK(VLOOKUP(E2468,INVENTORYDATA,13,FALSE)),\"\",VLOOKUP(E2468,INVENTORYDATA,13,FALSE))","v":{"$error":"#N/A"}},null,"Hard Drive Removed",null,{"$f":"IF(ISBLANK(VLOOKUP(K2468,INVENTORYDATA,13,FALSE)),\"X\",\"\")","v":""},null,{"$f":"IF(ISBLANK(VLOOKUP(K2468,INVENTORYDATA,13,FALSE)),\"\",VLOOKUP(K2468,INVENTORYDATA,13,FALSE))","v":{"$error":"#N/A"}}]
["Install Memory",null,"X",{"$nulls":3},"Install Memory",null,"X"]
["Power ON",null,"X",{"$nulls":3},"Power ON",null,"X"]
["Record BIOS info",null,"X",{"$nulls":3},"Record BIOS info",null,"X"]
["Check Optical Drive",null,{"$f":"IF((VLOOKUP(E2468,INVENTORYDATA,7,FALSE))=\"YES\",\"X\",\"\")","v":{"$error":"#N/A"}},{"$f":"IF((VLOOKUP(E2468,INVENTORYDATA,7,FALSE))=\"NO\",\"X\",\"\")","v":{"$error":"#N/A"}},null,null,"Check Optical Drive",null,{"$f":"IF((VLOOKUP(K2468,INVENTORYDATA,7,FALSE))=\"YES\",\"X\",\"\")","v":{"$error":"#N/A"}},{"$f":"IF((VLOOKUP(K2468,INVENTORYDATA,7,FALSE))=\"NO\",\"X\",\"\")","v":{"$error":"#N/A"}}]
["Power Off",null,"X",{"$nulls":3},"Power Off",null,"X"]
["HDD Serial No.",null,{"$f":"IF(ISBLANK(VLOOKUP(E2468,INVENTORYDATA,12,FALSE)),\"\",VLOOKUP(E2468,INVENTORYDATA,12,FALSE))","v":{"$error":"#N/A"}},{"$nulls":3},"HDD Serial No.",null,{"$f":"IF(ISBLANK(VLOOKUP(K2468,INVENTORYDATA,12,FALSE)),\"\",VLOOKUP(K2468,INVENTORYDATA,12,FALSE))","v":{"$error":"#N/A"}}]
[]
["Tested for key functions,R2/Ready for Resale",{"$nulls":5},"Tested for key functions,R2/Ready for Resale"]
["BIOS Lock","Caddy","Optical","WebCam","Battery",null,"BIOS Lock","Caddy","Optical","WebCam","Battery"]
[null,null,{"$f":"VLOOKUP(E2468,INVENTORY!$A$2:$N$144,7,FALSE)","v":{"$error":"#N/A"}},{"$f":"VLOOKUP(E2468,INVENTORY!$A$2:$N$144,8,FALSE)","v":{"$error":"#N/A"}},{"$f":"VLOOKUP(E2468,INVENTORY!$A$2:$N$144,9,FALSE)","v":{"$error":"#N/A"}},{"$nulls":3},{"$f":"VLOOKUP(K2468,INVENTORY!$A$2:$N$144,7,FALSE)","v":{"$error":"#N/A"}},{"$f":"VLOOKUP(K2468,INVENTORY!$A$2:$N$144,8,FALSE)","v":{"$error":"#N/A"}},{"$f":"VLOOKUP(K2468,INVENTORY!$A$2:$N$144,9,FALSE)","v":{"$error":"#N/A"}}]
[]
["CPU Cosmetics Defects:",null,{"$f":"\"Function Code: \"&VLOOKUP(E2468,INVENTORY!$A$2:$Q$144,14,FALSE)","v":{"$error":"#N/A"}},{"$nulls":3},"CPU Cosmetics Defects:",null,{"$f":"\"Function Code: \"&VLOOKUP(K2468,INVENTORY!$A$2:$Q$144,14,FALSE)","v":{"$error":"#N/A"}}]
[]
[null,null,{"$f":"\"Cosmetic Code: \"&VLOOKUP(E2468,INVENTORY!$A$2:$Q$144,15,FALSE)","v":{"$error":"#N/A"}},{"$nulls":5},{"$f":"\"Cosmetic Code: \"&VLOOKUP(K2468,INVENTORY!$A$2:$Q$144,15,FALSE)","v":{"$error":"#N/A"}}]
[]
["Casing","Plugs/Ports",{"$nulls":4},"Casing","Plugs/Ports"]
["Pass","Pass",{"$nulls":4},"Pass","Pass"]
["Fail","Fail",null,"TRRC#:L.T.R.",null,null,"Fail","Fail",null,"TRRC#:L.T.R."]
[]
["LAPTOP TESTING RECORD",{"$nulls":5},"LAPTOP TESTING RECORD"]
[]
[{"$nulls":3},"ITEM #",{"$f":"E2468+2","v":173},{"$nulls":4},"ITEM #",{"$f":"K2468+2","v":174}]
["Tester: ","RR","Date:",{"$f":"NOW()","v":"2026-01-06T11:13:00.960"},null,null,"Tester: ","RR","Date:",{"$f":"NOW()","v":"2026-01-06T11:13:00.960"}]
["Type: ","LAPTOP","SN:",{"$f":"VLOOKUP(E2497,INVENTORYDATA,10,FALSE)","v":{"$error":"#N/A"}},null,null,"Type: ","LAPTOP","SN:",{"$f":"VLOOKUP(K2497,INVENTORYDATA,10,FALSE)","v":{"$error":"#N/A"}}]
[{"$f":"\"Make: \"","v":"Make: "},{"$f":"VLOOKUP(E2497,INVENTORYDATA,2,FALSE)","v":{"$error":"#N/A"}},{"$f":"\"Model: \"","v":"Model: "},{"$f":"VLOOKUP(E2497,INVENTORYDATA,3,FALSE)","v":{"$error":"#N/A"}},null,null,{"$f":"\"Make: \"","v":"Make: "},{"$f":"VLOOKUP(K2497,INVENTORYDATA,2,FALSE)","v":{"$error":"#N/A"}},{"$f":"\"Model: \"","v":"Model: "},{"$f":"VLOOKUP(K2497,INVENTORYDATA,3,FALSE)","v":{"$error":"#N/A"}}]
[{"$f":"\"CPU/Speed: \"","v":"CPU/Speed: "},{"$f":"VLOOKUP(E2497,INVENTORYDATA,4,FALSE)&\" / \"&VLOOKUP(E2497,INVENTORYDATA,5,FALSE)&\"GHz\"","v":{"$error":"#N/A"}},null,{"$f":"\"Memory: \"","v":"Memory: "},{"$f":"VLOOKUP(E2497,INVENTORYDATA,6,FALSE)","v":{"$error":"#N/A"}},null,{"$f":"\"CPU/Speed: \"","v":"CPU/Speed: "},{"$f":"VLOOKUP(K2497,INVENTORYDATA,4,FALSE)&\" / \"&VLOOKUP(K2497,INVENTORYDATA,5,FALSE)&\"GHz\"","v":{"$error":"#N/A"}},null,{"$f":"\"Memory: \"","v":"Memory: "},{"$f":"VLOOKUP(K2497,INVENTORYDATA,6,FALSE)","v":{"$error":"#N/A"}}]
[]
["Key Function",null,"Pass","Fail ","Comments",null,"Key Function",null,"Pass","Fail ","Comments"]
["Hard Drive Removed",null,{"$f":"IF(ISBLANK(VLOOKUP(E2497,INVENTORYDATA,13,FALSE)),\"X\",\"\")","v":""},null,{"$f":"IF(ISBLANK(VLOOKUP(E2497,INVENTORYDATA,13,FALSE)),\"\",VLOOKUP(E2497,INVENTORYDATA,13,FALSE))","v":{"$error":"#N/A"}},null,"Hard Drive Removed",null,{"$f":"IF(ISBLANK(VLOOKUP(K2497,INVENTORYDATA,13,FALSE)),\"X\",\"\")","v":""},null,{"$f":"IF(ISBLANK(VLOOKUP(K2497,INVENTORYDATA,13,FALSE)),\"\",VLOOKUP(K2497,INVENTORYDATA,13,FALSE))","v":{"$error":"#N/A"}}]
["Install Memory",null,"X",{"$nulls":3},"Install Memory",null,"X"]
["Power ON",null,"X",{"$nulls":3},"Power ON",null,"X"]
["Record BIOS info",null,"X",{"$nulls":3},"Record BIOS info",null,"X"]
["Check Optical Drive",null,{"$f":"IF((VLOOKUP(E2497,INVENTORYDATA,7,FALSE))=\"YES\",\"X\",\"\")","v":{"$error":"#N/A"}},{"$f":"IF((VLOOKUP(E2497,INVENTORYDATA,7,FALSE))=\"NO\",\"X\",\"\")","v":{"$error":"#N/A"}},null,null,"Check Optical Drive",null,{"$f":"IF((VLOOKUP(K2497,INVENTORYDATA,7,FALSE))=\"YES\",\"X\",\"\")","v":{"$error":"#N/A"}},{"$f":"IF((VLOOKUP(K2497,INVENTORYDATA,7,FALSE))=\"NO\",\"X\",\"\")","v":{"$error":"#N/A"}}]
["Power Off",null,"X",{"$nulls":3},"Power Off",null,"X"]
["HDD Serial No.",null,{"$f":"IF(ISBLANK(VLOOKUP(E2497,INVENTORYDATA,12,FALSE)),\"\",VLOOKUP(E2497,INVENTORYDATA,12,FALSE))","v":{"$error":"#N/A"}},{"$nulls":3},"HDD Serial No.",null,{"$f":"IF(ISBLANK(VLOOKUP(K2497,INVENTORYDATA,12,FALSE)),\"\",VLOOKUP(K2497,INVENTORYDATA,12,FALSE))","v":{"$error":"#N/A"}}]
[]
["Tested for key functions,R2/Ready for Resale",{"$nulls":5},"Tested for key functions,R2/Ready for Resale"]
["BIOS Lock","Caddy","Optical","WebCam","Battery",null,"BIOS Lock","Caddy","Optical","WebCam","Battery"]
[null,null,{"$f":"VLOOKUP(E2497,INVENTORY!$A$2:$N$144,7,FALSE)","v":{"$error":"#N/A"}},{"$f":"VLOOKUP(E2497,INVENTORY!$A$2:$N$144,8,FALSE)","v":{"$error":"#N/A"}},{"$f":"VLOOKUP(E2497,INVENTORY!$A$2:$N$144,9,FALSE)","v":{"$error":"#N/A"}},{"$nulls":3},{"$f":"VLOOKUP(K2497,INVENTORY!$A$2:$N$144,7,FALSE)","v":{"$error":"#N/A"}},{"$f":"VLOOKUP(K2497,INVENTORY!$A$2:$N$144,8,FALSE)","v":{"$error":"#N/A"}},{"$f":"VLOOKUP(K2497,INVENTORY!$A$2:$N$144,9,FALSE)","v":{"$error":"#N/A"}}]
[]
["CPU Cosmetics Defects:",null,{"$f":"\"Function Code: \"&VLOOKUP(E2497,INVENTORY!$A$2:$Q$144,14,FALSE)","v":{"$error":"#N/A"}},{"$nulls":3},"CPU Cosmetics Defects:",null,{"$f":"\"Function Code: \"&VLOOKUP(K2497,INVENTORY!$A$2:$Q$144,14,FALSE)","v":{"$error":"#N/A"}}]
[]
[null,null,{"$f":"\"Cosmetic Code: \"&VLOOKUP(E2497,INVENTORY!$A$2:$Q$144,15,FALSE)","v":{"$error":"#N/A"}},{"$nulls":5},{"$f":"\"Cosmetic Code: \"&VLOOKUP(K2497,INVENTORY!$A$2:$Q$144,15,FALSE)","v":{"$error":"#N/A"}}]
[]
["Casing","Plugs/Ports",{"$nulls":4},"Casing","Plugs/Ports"]
["Pass","Pass",{"$nulls":4},"Pass","Pass"]
["Fail","Fail",null,"TRRC#:L.T.R.",null,null,"Fail","Fail",null,"TRRC#:L.T.R."]
[]
["LAPTOP TESTING RECORD",{"$nulls":5},"LAPTOP TESTING RECORD"]
[]
[{"$nulls":3},"ITEM #",{"$f":"E2497+2","v":175},{"$nulls":4},"ITEM #",{"$f":"K2497+2","v":176}]
["Tester: ","RR","Date:",{"$f":"NOW()","v":"2026-01-06T11:13:00.960"},null,null,"Tester: ","RR","Date:",{"$f":"NOW()","v":"2026-01-06T11:13:00.960"}]
["Type: ","LAPTOP","SN:",{"$f":"VLOOKUP(E2526,INVENTORYDATA,10,FALSE)","v":{"$error":"#N/A"}},null,null,"Type: ","LAPTOP","SN:",{"$f":"VLOOKUP(K2526,INVENTORYDATA,10,FALSE)","v":{"$error":"#N/A"}}]
[{"$f":"\"Make: \"","v":"Make: "},{"$f":"VLOOKUP(E2526,INVENTORYDATA,2,FALSE)","v":{"$error":"#N/A"}},{"$f":"\"Model: \"","v":"Model: "},{"$f":"VLOOKUP(E2526,INVENTORYDATA,3,FALSE)","v":{"$error":"#N/A"}},null,null,{"$f":"\"Make: \"","v":"Make: "},{"$f":"VLOOKUP(K2526,INVENTORYDATA,2,FALSE)","v":{"$error":"#N/A"}},{"$f":"\"Model: \"","v":"Model: "},{"$f":"VLOOKUP(K2526,INVENTORYDATA,3,FALSE)","v":{"$error":"#N/A"}}]
[{"$f":"\"CPU/Speed: \"","v":"CPU/Speed: "},{"$f":"VLOOKUP(E2526,INVENTORYDATA,4,FALSE)&\" / \"&VLOOKUP(E2526,INVENTORYDATA,5,FALSE)&\"GHz\"","v":{"$error":"#N/A"}},null,{"$f":"\"Memory: \"","v":"Memory: "},{"$f":"VLOOKUP(E2526,INVENTORYDATA,6,FALSE)","v":{"$error":"#N/A"}},null,{"$f":"\"CPU/Speed: \"","v":"CPU/Speed: "},{"$f":"VLOOKUP(K2526,INVENTORYDATA,4,FALSE)&\" / \"&VLOOKUP(K2526,INVENTORYDATA,5,FALSE)&\"GHz\"","v":{"$error":"#N/A"}},null,{"$f":"\"Memory: \"","v":"Memory: "},{"$f":"VLOOKUP(K2526,INVENTORYDATA,6,FALSE)","v":{"$error":"#N/A"}}]
[]
["Key Function",null,"Pass","Fail ","Comments",null,"Key Function",null,"Pass","Fail ","Comments"]
["Hard Drive Removed",null,{"$f":"IF(ISBLANK(VLOOKUP(E2526,INVENTORYDATA,13,FALSE)),\"X\",\"\")","v":""},null,{"$f":"IF(ISBLANK(VLOOKUP(E2526,INVENTORYDATA,13,FALSE)),\"\",VLOOKUP(E2526,INVENTORYDATA,13,FALSE))","v":{"$error":"#N/A"}},null,"Hard Drive Removed",null,{"$f":"IF(ISBLANK(VLOOKUP(K2526,INVENTORYDATA,13,FALSE)),\"X\",\"\")","v":""},null,{"$f":"IF(ISBLANK(VLOOKUP(K2526,INVENTORYDATA,13,FALSE)),\"\",VLOOKUP(K2526,INVENTORYDATA,13,FALSE))","v":{"$error":"#N/A"}}]
["Install Memory",null,"X",{"$nulls":3},"Install Memory",null,"X"]
["Power ON",null,"X",{"$nulls":3},"Power ON",null,"X"]
["Record BIOS info",null,"X",{"$nulls":3},"Record BIOS info",null,"X"]
["Check Optical Drive",null,{"$f":"IF((VLOOKUP(E2526,INVENTORYDATA,7,FALSE))=\"YES\",\"X\",\"\")","v":{"$error":"#N/A"}},{"$f":"IF((VLOOKUP(E2526,INVENTORYDATA,7,FALSE))=\"NO\",\"X\",\"\")","v":{"$error":"#N/A"}},null,null,"Check Optical Drive",null,{"$f":"IF((VLOOKUP(K2526,INVENTORYDATA,7,FALSE))=\"YES\",\"X\",\"\")","v":{"$error":"#N/A"}},{"$f":"IF((VLOOKUP(K2526,INVENTORYDATA,7,FALSE))=\"NO\",\"X\",\"\")","v":{"$error":"#N/A"}}]
["Power Off",null,"X",{"$nulls":3},"Power Off",null,"X"]
["HDD Serial No.",null,{"$f":"IF(ISBLANK(VLOOKUP(E2526,INVENTORYDATA,12,FALSE)),\"\",VLOOKUP(E2526,INVENTORYDATA,12,FALSE))","v":{"$error":"#N/A"}},{"$nulls":3},"HDD Serial No.",null,{"$f":"IF(ISBLANK(VLOOKUP(K2526,INVENTORYDATA,12,FALSE)),\"\",VLOOKUP(K2526,INVENTORYDATA,12,FALSE))","v":{"$error":"#N/A"}}]
[]
["Tested for key functions,R2/Ready for Resale",{"$nulls":5},"Tested for key functions,R2/Ready for Resale"]
["BIOS Lock","Caddy","Optical","WebCam","Battery",null,"BIOS Lock","Caddy","Optical","WebCam","Battery"]
[null,null,{"$f":"VLOOKUP(E2526,INVENTORY!$A$2:$N$144,7,FALSE)","v":{"$error":"#N/A"}},{"$f":"VLOOKUP(E2526,INVENTORY!$A$2:$N$144,8,FALSE)","v":{"$error":"#N/A"}},{"$f":"VLOOKUP(E2526,INVENTORY!$A$2:$N$144,9,FALSE)","v":{"$error":"#N/A"}},{"$nulls":3},{"$f":"VLOOKUP(K2526,INVENTORY!$A$2:$N$144,7,FALSE)","v":{"$error":"#N/A"}},{"$f":"VLOOKUP(K2526,INVENTORY!$A$2:$N$144,8,FALSE)","v":{"$error":"#N/A"}},{"$f":"VLOOKUP(K2526,INVENTORY!$A$2:$N$144,9,FALSE)","v":{"$error":"#N/A"}}]
[]
["CPU Cosmetics Defects:",null,{"$f":"\"Function Code: \"&VLOOKUP(E2526,INVENTORY!$A$2:$Q$144,14,FALSE)","v":{"$error":"#N/A"}},{"$nulls":3},"CPU Cosmetics Defects:",null,{"$f":"\"Function Code: \"&VLOOKUP(K2526,INVENTORY!$A$2:$Q$144,14,FALSE)","v":{"$error":"#N/A"}}]
[]
[null,null,{"$f":"\"Cosmetic Code: \"&VLOOKUP(E2526,INVENTORY!$A$2:$Q$144,15,FALSE)","v":{"$error":"#N/A"}},{"$nulls":5},{"$f":"\"Cosmetic Code: \"&VLOOKUP(K2526,INVENTORY!$A$2:$Q$144,15,FALSE)","v":{"$error":"#N/A"}}]
[]
["Casing","Plugs/Ports",{"$nulls":4},"Casing","Plugs/Ports"]
["Pass","Pass",{"$nulls":4},"Pass","Pass"]
["Fail","Fail",null,"TRRC#:L.T.R.",null,null,"Fail","Fail",null,"TRRC#:L.T.R."]
[]
["LAPTOP TESTING RECORD",{"$nulls":5},"LAPTOP TESTING RECORD"]
[]
[{"$nulls":3},"ITEM #",{"$f":"E2526+2","v":177},{"$nulls":4},"ITEM #",{"$f":"K2526+2","v":178}]
["Tester: ","RR","Date:",{"$f":"NOW()","v":"2026-01-06T11:13:00.960"},null,null,"Tester: ","RR","Date:",{"$f":"NOW()","v":"2026-01-06T11:13:00.960"}]
["Type: ","LAPTOP","SN:",{"$f":"VLOOKUP(E2555,INVENTORYDATA,10,FALSE)","v":{"$error":"#N/A"}},null,null,"Type: ","LAPTOP","SN:",{"$f":"VLOOKUP(K2555,INVENTORYDATA,10,FALSE)","v":{"$error":"#N/A"}}]
[{"$f":"\"Make: \"","v":"Make: "},{"$f":"VLOOKUP(E2555,INVENTORYDATA,2,FALSE)","v":{"$error":"#N/A"}},{"$f":"\"Model: \"","v":"Model: "},{"$f":"VLOOKUP(E2555,INVENTORYDATA,3,FALSE)","v":{"$error":"#N/A"}},null,null,{"$f":"\"Make: \"","v":"Make: "},{"$f":"VLOOKUP(K2555,INVENTORYDATA,2,FALSE)","v":{"$error":"#N/A"}},{"$f":"\"Model: \"","v":"Model: "},{"$f":"VLOOKUP(K2555,INVENTORYDATA,3,FALSE)","v":{"$error":"#N/A"}}]
[{"$f":"\"CPU/Speed: \"","v":"CPU/Speed: "},{"$f":"VLOOKUP(E2555,INVENTORYDATA,4,FALSE)&\" / \"&VLOOKUP(E2555,INVENTORYDATA,5,FALSE)&\"GHz\"","v":{"$error":"#N/A"}},null,{"$f":"\"Memory: \"","v":"Memory: "},{"$f":"VLOOKUP(E2555,INVENTORYDATA,6,FALSE)","v":{"$error":"#N/A"}},null,{"$f":"\"CPU/Speed: \"","v":"CPU/Speed: "},{"$f":"VLOOKUP(K2555,INVENTORYDATA,4,FALSE)&\" / \"&VLOOKUP(K2555,INVENTORYDATA,5,FALSE)&\"GHz\"","v":{"$error":"#N/A"}},null,{"$f":"\"Memory: \"","v":"Memory: "},{"$f":"VLOOKUP(K2555,INVENTORYDATA,6,FALSE)","v":{"$error":"#N/A"}}]
[]
["Key Function",null,"Pass","Fail ","Comments",null,"Key Function",null,"Pass","Fail ","Comments"]
["Hard Drive Removed",null,{"$f":"IF(ISBLANK(VLOOKUP(E2555,INVENTORYDATA,13,FALSE)),\"X\",\"\")","v":""},null,{"$f":"IF(ISBLANK(VLOOKUP(E2555,INVENTORYDATA,13,FALSE)),\"\",VLOOKUP(E2555,INVENTORYDATA,13,FALSE))","v":{"$error":"#N/A"}},null,"Hard Drive Removed",null,{"$f":"IF(ISBLANK(VLOOKUP(K2555,INVENTORYDATA,13,FALSE)),\"X\",\"\")","v":""},null,{"$f":"IF(ISBLANK(VLOOKUP(K2555,INVENTORYDATA,13,FALSE)),\"\",VLOOKUP(K2555,INVENTORYDATA,13,FALSE))","v":{"$error":"#N/A"}}]
["Install Memory",null,"X",{"$nulls":3},"Install Memory",null,"X"]
["Power ON",null,"X",{"$nulls":3},"Power ON",null,"X"]
["Record BIOS info",null,"X",{"$nulls":3},"Record BIOS info",null,"X"]
["Check Optical Drive",null,{"$f":"IF((VLOOKUP(E2555,INVENTORYDATA,7,FALSE))=\"YES\",\"X\",\"\")","v":{"$error":"#N/A"}},{"$f":"IF((VLOOKUP(E2555,INVENTORYDATA,7,FALSE))=\"NO\",\"X\",\"\")","v":{"$error":"#N/A"}},null,null,"Check Optical Drive",null,{"$f":"IF((VLOOKUP(K2555,INVENTORYDATA,7,FALSE))=\"YES\",\"X\",\"\")","v":{"$error":"#N/A"}},{"$f":"IF((VLOOKUP(K2555,INVENTORYDATA,7,FALSE))=\"NO\",\"X\",\"\")","v":{"$error":"#N/A"}}]
["Power Off",null,"X",{"$nulls":3},"Power Off",null,"X"]
["HDD Serial No.",null,{"$f":"IF(ISBLANK(VLOOKUP(E2555,INVENTORYDATA,12,FALSE)),\"\",VLOOKUP(E2555,INVENTORYDATA,12,FALSE))","v":{"$error":"#N/A"}},{"$nulls":3},"HDD Serial No.",null,{"$f":"IF(ISBLANK(VLOOKUP(K2555,INVENTORYDATA,12,FALSE)),\"\",VLOOKUP(K2555,INVENTORYDATA,12,FALSE))","v":{"$error":"#N/A"}}]
[]
["Tested for key functions,R2/Ready for Resale",{"$nulls":5},"Tested for key functions,R2/Ready for Resale"]
["BIOS Lock","Caddy","Optical","WebCam","Battery",null,"BIOS Lock","Caddy","Optical","WebCam","Battery"]
[null,null,{"$f":"VLOOKUP(E2555,INVENTORY!$A$2:$N$144,7,FALSE)","v":{"$error":"#N/A"}},{"$f":"VLOOKUP(E2555,INVENTORY!$A$2:$N$144,8,FALSE)","v":{"$error":"#N/A"}},{"$f":"VLOOKUP(E2555,INVENTORY!$A$2:$N$144,9,FALSE)","v":{"$error":"#N/A"}},{"$nulls":3},{"$f":"VLOOKUP(K2555,INVENTORY!$A$2:$N$144,7,FALSE)","v":{"$error":"#N/A"}},{"$f":"VLOOKUP(K2555,INVENTORY!$A$2:$N$144,8,FALSE)","v":{"$error":"#N/A"}},{"$f":"VLOOKUP(K2555,INVENTORY!$A$2:$N$144,9,FALSE)","v":{"$error":"#N/A"}}]
[]
["CPU Cosmetics Defects:",null,{"$f":"\"Function Code: \"&VLOOKUP(E2555,INVENTORY!$A$2:$Q$144,14,FALSE)","v":{"$error":"#N/A"}},{"$nulls":3},"CPU Cosmetics Defects:",null,{"$f":"\"Function Code: \"&VLOOKUP(K2555,INVENTORY!$A$2:$Q$144,14,FALSE)","v":{"$error":"#N/A"}}]
[]
[null,null,{"$f":"\"Cosmetic Code: \"&VLOOKUP(E2555,INVENTORY!$A$2:$Q$144,15,FALSE)","v":{"$error":"#N/A"}},{"$nulls":5},{"$f":"\"Cosmetic Code: \"&VLOOKUP(K2555,INVENTORY!$A$2:$Q$144,15,FALSE)","v":{"$error":"#N/A"}}]
[]
["Casing","Plugs/Ports",{"$nulls":4},"Casing","Plugs/Ports"]
["Pass","Pass",{"$nulls":4},"Pass","Pass"]
["Fail","Fail",null,"TRRC#:L.T.R.",null,null,"Fail","Fail",null,"TRRC#:L.T.R."]
[]
["LAPTOP TESTING RECORD",{"$nulls":5},"LAPTOP TESTING RECORD"]
[]
[{"$nulls":3},"ITEM #",{"$f":"E2555+2","v":179},{"$nulls":4},"ITEM #",{"$f":"K2555+2","v":180}]
["Tester: ","RR","Date:",{"$f":"NOW()","v":"2026-01-06T11:13:00.960"},null,null,"Tester: ","RR","Date:",{"$f":"NOW()","v":"2026-01-06T11:13:00.960"}]
["Type: ","LAPTOP","SN:",{"$f":"VLOOKUP(E2584,INVENTORYDATA,10,FALSE)","v":{"$error":"#N/A"}},null,null,"Type: ","LAPTOP","SN:",{"$f":"VLOOKUP(K2584,INVENTORYDATA,10,FALSE)","v":{"$error":"#N/A"}}]
[{"$f":"\"Make: \"","v":"Make: "},{"$f":"VLOOKUP(E2584,INVENTORYDATA,2,FALSE)","v":{"$error":"#N/A"}},{"$f":"\"Model: \"","v":"Model: "},{"$f":"VLOOKUP(E2584,INVENTORYDATA,3,FALSE)","v":{"$error":"#N/A"}},null,null,{"$f":"\"Make: \"","v":"Make: "},{"$f":"VLOOKUP(K2584,INVENTORYDATA,2,FALSE)","v":{"$error":"#N/A"}},{"$f":"\"Model: \"","v":"Model: "},{"$f":"VLOOKUP(K2584,INVENTORYDATA,3,FALSE)","v":{"$error":"#N/A"}}]
[{"$f":"\"CPU/Speed: \"","v":"CPU/Speed: "},{"$f":"VLOOKUP(E2584,INVENTORYDATA,4,FALSE)&\" / \"&VLOOKUP(E2584,INVENTORYDATA,5,FALSE)&\"GHz\"","v":{"$error":"#N/A"}},null,{"$f":"\"Memory: \"","v":"Memory: "},{"$f":"VLOOKUP(E2584,INVENTORYDATA,6,FALSE)","v":{"$error":"#N/A"}},null,{"$f":"\"CPU/Speed: \"","v":"CPU/Speed: "},{"$f":"VLOOKUP(K2584,INVENTORYDATA,4,FALSE)&\" / \"&VLOOKUP(K2584,INVENTORYDATA,5,FALSE)&\"GHz\"","v":{"$error":"#N/A"}},null,{"$f":"\"Memory: \"","v":"Memory: "},{"$f":"VLOOKUP(K2584,INVENTORYDATA,6,FALSE)","v":{"$error":"#N/A"}}]
[]
["Key Function",null,"Pass","Fail ","Comments",null,"Key Function",null,"Pass","Fail ","Comments"]
["Hard Drive Removed",null,{"$f":"IF(ISBLANK(VLOOKUP(E2584,INVENTORYDATA,13,FALSE)),\"X\",\"\")","v":""},null,{"$f":"IF(ISBLANK(VLOOKUP(E2584,INVENTORYDATA,13,FALSE)),\"\",VLOOKUP(E2584,INVENTORYDATA,13,FALSE))","v":{"$error":"#N/A"}},null,"Hard Drive Removed",null,{"$f":"IF(ISBLANK(VLOOKUP(K2584,INVENTORYDATA,13,FALSE)),\"X\",\"\")","v":""},null,{"$f":"IF(ISBLANK(VLOOKUP(K2584,INVENTORYDATA,13,FALSE)),\"\",VLOOKUP(K2584,INVENTORYDATA,13,FALSE))","v":{"$error":"#N/A"}}]
["Install Memory",null,"X",{"$nulls":3},"Install Memory",null,"X"]
["Power ON",null,"X",{"$nulls":3},"Power ON",null,"X"]
["Record BIOS info",null,"X",{"$nulls":3},"Record BIOS info",null,"X"]
["Check Optical Drive",null,{"$f":"IF((VLOOKUP(E2584,INVENTORYDATA,7,FALSE))=\"YES\",\"X\",\"\")","v":{"$error":"#N/A"}},{"$f":"IF((VLOOKUP(E2584,INVENTORYDATA,7,FALSE))=\"NO\",\"X\",\"\")","v":{"$error":"#N/A"}},null,null,"Check Optical Drive",null,{"$f":"IF((VLOOKUP(K2584,INVENTORYDATA,7,FALSE))=\"YES\",\"X\",\"\")","v":{"$error":"#N/A"}},{"$f":"IF((VLOOKUP(K2584,INVENTORYDATA,7,FALSE))=\"NO\",\"X\",\"\")","v":{"$error":"#N/A"}}]
["Power Off",null,"X",{"$nulls":3},"Power Off",null,"X"]
["HDD Serial No.",null,{"$f":"IF(ISBLANK(VLOOKUP(E2584,INVENTORYDATA,12,FALSE)),\"\",VLOOKUP(E2584,INVENTORYDATA,12,FALSE))","v":{"$error":"#N/A"}},{"$nulls":3},"HDD Serial No.",null,{"$f":"IF(ISBLANK(VLOOKUP(K2584,INVENTORYDATA,12,FALSE)),\"\",VLOOKUP(K2584,INVENTORYDATA,12,FALSE))","v":{"$error":"#N/A"}}]
[]
["Tested for key functions,R2/Ready for Resale",{"$nulls":5},"Tested for key functions,R2/Ready for Resale"]
["BIOS Lock","Caddy","Optical","WebCam","Battery",null,"BIOS Lock","Caddy","Optical","WebCam","Battery"]
[null,null,{"$f":"VLOOKUP(E2584,INVENTORY!$A$2:$N$144,7,FALSE)","v":{"$error":"#N/A"}},{"$f":"VLOOKUP(E2584,INVENTORY!$A$2:$N$144,8,FALSE)","v":{"$error":"#N/A"}},{"$f":"VLOOKUP(E2584,INVENTORY!$A$2:$N$144,9,FALSE)","v":{"$error":"#N/A"}},{"$nulls":3},{"$f":"VLOOKUP(K2584,INVENTORY!$A$2:$N$144,7,FALSE)","v":{"$error":"#N/A"}},{"$f":"VLOOKUP(K2584,INVENTORY!$A$2:$N$144,8,FALSE)","v":{"$error":"#N/A"}},{"$f":"VLOOKUP(K2584,INVENTORY!$A$2:$N$144,9,FALSE)","v":{"$error":"#N/A"}}]
[]
["CPU Cosmetics Defects:",null,{"$f":"\"Function Code: \"&VLOOKUP(E2584,INVENTORY!$A$2:$Q$144,14,FALSE)","v":{"$error":"#N/A"}},{"$nulls":3},"CPU Cosmetics Defects:",null,{"$f":"\"Function Code: \"&VLOOKUP(K2584,INVENTORY!$A$2:$Q$144,14,FALSE)","v":{"$error":"#N/A"}}]
[]
[null,null,{"$f":"\"Cosmetic Code: \"&VLOOKUP(E2584,INVENTORY!$A$2:$Q$144,15,FALSE)","v":{"$error":"#N/A"}},{"$nulls":5},{"$f":"\"Cosmetic Code: \"&VLOOKUP(K2584,INVENTORY!$A$2:$Q$144,15,FALSE)","v":{"$error":"#N/A"}}]
[]
["Casing","Plugs/Ports",{"$nulls":4},"Casing","Plugs/Ports"]
["Pass","Pass",{"$nulls":4},"Pass","Pass"]
["Fail","Fail",null,"TRRC#:L.T.R.",null,null,"Fail","Fail",null,"TRRC#:L.T.R."]
[]
["LAPTOP TESTING RECORD",{"$nulls":5},"LAPTOP TESTING RECORD"]
[]
[{"$nulls":3},"ITEM #",{"$f":"E2584+2","v":181},{"$nulls":4},"ITEM #",{"$f":"K2584+2","v":182}]
["Tester: ","RR","Date:",{"$f":"NOW()","v":"2026-01-06T11:13:00.960"},null,null,"Tester: ","RR","Date:",{"$f":"NOW()","v":"2026-01-06T11:13:00.960"}]
["Type: ","LAPTOP","SN:",{"$f":"VLOOKUP(E2613,INVENTORYDATA,10,FALSE)","v":{"$error":"#N/A"}},null,null,"Type: ","LAPTOP","SN:",{"$f":"VLOOKUP(K2613,INVENTORYDATA,10,FALSE)","v":{"$error":"#N/A"}}]
[{"$f":"\"Make: \"","v":"Make: "},{"$f":"VLOOKUP(E2613,INVENTORYDATA,2,FALSE)","v":{"$error":"#N/A"}},{"$f":"\"Model: \"","v":"Model: "},{"$f":"VLOOKUP(E2613,INVENTORYDATA,3,FALSE)","v":{"$error":"#N/A"}},null,null,{"$f":"\"Make: \"","v":"Make: "},{"$f":"VLOOKUP(K2613,INVENTORYDATA,2,FALSE)","v":{"$error":"#N/A"}},{"$f":"\"Model: \"","v":"Model: "},{"$f":"VLOOKUP(K2613,INVENTORYDATA,3,FALSE)","v":{"$error":"#N/A"}}]
[{"$f":"\"CPU/Speed: \"","v":"CPU/Speed: "},{"$f":"VLOOKUP(E2613,INVENTORYDATA,4,FALSE)&\" / \"&VLOOKUP(E2613,INVENTORYDATA,5,FALSE)&\"GHz\"","v":{"$error":"#N/A"}},null,{"$f":"\"Memory: \"","v":"Memory: "},{"$f":"VLOOKUP(E2613,INVENTORYDATA,6,FALSE)","v":{"$error":"#N/A"}},null,{"$f":"\"CPU/Speed: \"","v":"CPU/Speed: "},{"$f":"VLOOKUP(K2613,INVENTORYDATA,4,FALSE)&\" / \"&VLOOKUP(K2613,INVENTORYDATA,5,FALSE)&\"GHz\"","v":{"$error":"#N/A"}},null,{"$f":"\"Memory: \"","v":"Memory: "},{"$f":"VLOOKUP(K2613,INVENTORYDATA,6,FALSE)","v":{"$error":"#N/A"}}]
[]
["Key Function",null,"Pass","Fail ","Comments",null,"Key Function",null,"Pass","Fail ","Comments"]
["Hard Drive Removed",null,{"$f":"IF(ISBLANK(VLOOKUP(E2613,INVENTORYDATA,13,FALSE)),\"X\",\"\")","v":""},null,{"$f":"IF(ISBLANK(VLOOKUP(E2613,INVENTORYDATA,13,FALSE)),\"\",VLOOKUP(E2613,INVENTORYDATA,13,FALSE))","v":{"$error":"#N/A"}},null,"Hard Drive Removed",null,{"$f":"IF(ISBLANK(VLOOKUP(K2613,INVENTORYDATA,13,FALSE)),\"X\",\"\")","v":""},null,{"$f":"IF(ISBLANK(VLOOKUP(K2613,INVENTORYDATA,13,FALSE)),\"\",VLOOKUP(K2613,INVENTORYDATA,13,FALSE))","v":{"$error":"#N/A"}}]
["Install Memory",null,"X",{"$nulls":3},"Install Memory",null,"X"]
["Power ON",null,"X",{"$nulls":3},"Power ON",null,"X"]
["Record BIOS info",null,"X",{"$nulls":3},"Record BIOS info",null,"X"]
["Check Optical Drive",null,{"$f":"IF((VLOOKUP(E2613,INVENTORYDATA,7,FALSE))=\"YES\",\"X\",\"\")","v":{"$error":"#N/A"}},{"$f":"IF((VLOOKUP(E2613,INVENTORYDATA,7,FALSE))=\"NO\",\"X\",\"\")","v":{"$error":"#N/A"}},null,null,"Check Optical Drive",null,{"$f":"IF((VLOOKUP(K2613,INVENTORYDATA,7,FALSE))=\"YES\",\"X\",\"\")","v":{"$error":"#N/A"}},{"$f":"IF((VLOOKUP(K2613,INVENTORYDATA,7,FALSE))=\"NO\",\"X\",\"\")","v":{"$error":"#N/A"}}]
["Power Off",null,"X",{"$nulls":3},"Power Off",null,"X"]
["HDD Serial No.",null,{"$f":"IF(ISBLANK(VLOOKUP(E2613,INVENTORYDATA,12,FALSE)),\"\",VLOOKUP(E2613,INVENTORYDATA,12,FALSE))","v":{"$error":"#N/A"}},{"$nulls":3},"HDD Serial No.",null,{"$f":"IF(ISBLANK(VLOOKUP(K2613,INVENTORYDATA,12,FALSE)),\"\",VLOOKUP(K2613,INVENTORYDATA,12,FALSE))","v":{"$error":"#N/A"}}]
[]
["Tested for key functions,R2/Ready for Resale",{"$nulls":5},"Tested for key functions,R2/Ready for Resale"]
["BIOS Lock","Caddy","Optical","WebCam","Battery",null,"BIOS Lock","Caddy","Optical","WebCam","Battery"]
[null,null,{"$f":"VLOOKUP(E2613,INVENTORY!$A$2:$N$144,7,FALSE)","v":{"$error":"#N/A"}},{"$f":"VLOOKUP(E2613,INVENTORY!$A$2:$N$144,8,FALSE)","v":{"$error":"#N/A"}},{"$f":"VLOOKUP(E2613,INVENTORY!$A$2:$N$144,9,FALSE)","v":{"$error":"#N/A"}},{"$nulls":3},{"$f":"VLOOKUP(K2613,INVENTORY!$A$2:$N$144,7,FALSE)","v":{"$error":"#N/A"}},{"$f":"VLOOKUP(K2613,INVENTORY!$A$2:$N$144,8,FALSE)","v":{"$error":"#N/A"}},{"$f":"VLOOKUP(K2613,INVENTORY!$A$2:$N$144,9,FALSE)","v":{"$error":"#N/A"}}]
[]
["CPU Cosmetics Defects:",null,{"$f":"\"Function Code: \"&VLOOKUP(E2613,INVENTORY!$A$2:$Q$144,14,FALSE)","v":{"$error":"#N/A"}},{"$nulls":3},"CPU Cosmetics Defects:",null,{"$f":"\"Function Code: \"&VLOOKUP(K2613,INVENTORY!$A$2:$Q$144,14,FALSE)","v":{"$error":"#N/A"}}]
[]
[null,null,{"$f":"\"Cosmetic Code: \"&VLOOKUP(E2613,INVENTORY!$A$2:$Q$144,15,FALSE)","v":{"$error":"#N/A"}},{"$nulls":5},{"$f":"\"Cosmetic Code: \"&VLOOKUP(K2613,INVENTORY!$A$2:$Q$144,15,FALSE)","v":{"$error":"#N/A"}}]
[]
["Casing","Plugs/Ports",{"$nulls":4},"Casing","Plugs/Ports"]
["Pass","Pass",{"$nulls":4},"Pass","Pass"]
["Fail","Fail",null,"TRRC#:L.T.R.",null,null,"Fail","Fail",null,"TRRC#:L.T.R."]
[]
["LAPTOP TESTING RECORD",{"$nulls":5},"LAPTOP TESTING RECORD"]
[]
[{"$nulls":3},"ITEM #",{"$f":"E2613+2","v":183},{"$nulls":4},"ITEM #",{"$f":"K2613+2","v":184}]
["Tester: ","RR","Date:",{"$f":"NOW()","v":"2026-01-06T11:13:00.960"},null,null,"Tester: ","RR","Date:",{"$f":"NOW()","v":"2026-01-06T11:13:00.960"}]
["Type: ","LAPTOP","SN:",{"$f":"VLOOKUP(E2642,INVENTORYDATA,10,FALSE)","v":{"$error":"#N/A"}},null,null,"Type: ","LAPTOP","SN:",{"$f":"VLOOKUP(K2642,INVENTORYDATA,10,FALSE)","v":{"$error":"#N/A"}}]
[{"$f":"\"Make: \"","v":"Make: "},{"$f":"VLOOKUP(E2642,INVENTORYDATA,2,FALSE)","v":{"$error":"#N/A"}},{"$f":"\"Model: \"","v":"Model: "},{"$f":"VLOOKUP(E2642,INVENTORYDATA,3,FALSE)","v":{"$error":"#N/A"}},null,null,{"$f":"\"Make: \"","v":"Make: "},{"$f":"VLOOKUP(K2642,INVENTORYDATA,2,FALSE)","v":{"$error":"#N/A"}},{"$f":"\"Model: \"","v":"Model: "},{"$f":"VLOOKUP(K2642,INVENTORYDATA,3,FALSE)","v":{"$error":"#N/A"}}]
[{"$f":"\"CPU/Speed: \"","v":"CPU/Speed: "},{"$f":"VLOOKUP(E2642,INVENTORYDATA,4,FALSE)&\" / \"&VLOOKUP(E2642,INVENTORYDATA,5,FALSE)&\"GHz\"","v":{"$error":"#N/A"}},null,{"$f":"\"Memory: \"","v":"Memory: "},{"$f":"VLOOKUP(E2642,INVENTORYDATA,6,FALSE)","v":{"$error":"#N/A"}},null,{"$f":"\"CPU/Speed: \"","v":"CPU/Speed: "},{"$f":"VLOOKUP(K2642,INVENTORYDATA,4,FALSE)&\" / \"&VLOOKUP(K2642,INVENTORYDATA,5,FALSE)&\"GHz\"","v":{"$error":"#N/A"}},null,{"$f":"\"Memory: \"","v":"Memory: "},{"$f":"VLOOKUP(K2642,INVENTORYDATA,6,FALSE)","v":{"$error":"#N/A"}}]
[]
["Key Function",null,"Pass","Fail ","Comments",null,"Key Function",null,"Pass","Fail ","Comments"]
["Hard Drive Removed",null,{"$f":"IF(ISBLANK(VLOOKUP(E2642,INVENTORYDATA,13,FALSE)),\"X\",\"\")","v":""},null,{"$f":"IF(ISBLANK(VLOOKUP(E2642,INVENTORYDATA,13,FALSE)),\"\",VLOOKUP(E2642,INVENTORYDATA,13,FALSE))","v":{"$error":"#N/A"}},null,"Hard Drive Removed",null,{"$f":"IF(ISBLANK(VLOOKUP(K2642,INVENTORYDATA,13,FALSE)),\"X\",\"\")","v":""},null,{"$f":"IF(ISBLANK(VLOOKUP(K2642,INVENTORYDATA,13,FALSE)),\"\",VLOOKUP(K2642,INVENTORYDATA,13,FALSE))","v":{"$error":"#N/A"}}]
["Install Memory",null,"X",{"$nulls":3},"Install Memory",null,"X"]
["Power ON",null,"X",{"$nulls":3},"Power ON",null,"X"]
["Record BIOS info",null,"X",{"$nulls":3},"Record BIOS info",null,"X"]
["Check Optical Drive",null,{"$f":"IF((VLOOKUP(E2642,INVENTORYDATA,7,FALSE))=\"YES\",\"X\",\"\")","v":{"$error":"#N/A"}},{"$f":"IF((VLOOKUP(E2642,INVENTORYDATA,7,FALSE))=\"NO\",\"X\",\"\")","v":{"$error":"#N/A"}},null,null,"Check Optical Drive",null,{"$f":"IF((VLOOKUP(K2642,INVENTORYDATA,7,FALSE))=\"YES\",\"X\",\"\")","v":{"$error":"#N/A"}},{"$f":"IF((VLOOKUP(K2642,INVENTORYDATA,7,FALSE))=\"NO\",\"X\",\"\")","v":{"$error":"#N/A"}}]
["Power Off",null,"X",{"$nulls":3},"Power Off",null,"X"]
["HDD Serial No.",null,{"$f":"IF(ISBLANK(VLOOKUP(E2642,INVENTORYDATA,12,FALSE)),\"\",VLOOKUP(E2642,INVENTORYDATA,12,FALSE))","v":{"$error":"#N/A"}},{"$nulls":3},"HDD Serial No.",null,{"$f":"IF(ISBLANK(VLOOKUP(K2642,INVENTORYDATA,12,FALSE)),\"\",VLOOKUP(K2642,INVENTORYDATA,12,FALSE))","v":{"$error":"#N/A"}}]
[]
["Tested for key functions,R2/Ready for Resale",{"$nulls":5},"Tested for key functions,R2/Ready for Resale"]
["BIOS Lock","Caddy","Optical","WebCam","Battery",null,"BIOS Lock","Caddy","Optical","WebCam","Battery"]
[null,null,{"$f":"VLOOKUP(E2642,INVENTORY!$A$2:$N$144,7,FALSE)","v":{"$error":"#N/A"}},{"$f":"VLOOKUP(E2642,INVENTORY!$A$2:$N$144,8,FALSE)","v":{"$error":"#N/A"}},{"$f":"VLOOKUP(E2642,INVENTORY!$A$2:$N$144,9,FALSE)","v":{"$error":"#N/A"}},{"$nulls":3},{"$f":"VLOOKUP(K2642,INVENTORY!$A$2:$N$144,7,FALSE)","v":{"$error":"#N/A"}},{"$f":"VLOOKUP(K2642,INVENTORY!$A$2:$N$144,8,FALSE)","v":{"$error":"#N/A"}},{"$f":"VLOOKUP(K2642,INVENTORY!$A$2:$N$144,9,FALSE)","v":{"$error":"#N/A"}}]
[]
["CPU Cosmetics Defects:",null,{"$f":"\"Function Code: \"&VLOOKUP(E2642,INVENTORY!$A$2:$Q$144,14,FALSE)","v":{"$error":"#N/A"}},{"$nulls":3},"CPU Cosmetics Defects:",null,{"$f":"\"Function Code: \"&VLOOKUP(K2642,INVENTORY!$A$2:$Q$144,14,FALSE)","v":{"$error":"#N/A"}}]
[]
[null,null,{"$f":"\"Cosmetic Code: \"&VLOOKUP(E2642,INVENTORY!$A$2:$Q$144,15,FALSE)","v":{"$error":"#N/A"}},{"$nulls":5},{"$f":"\"Cosmetic Code: \"&VLOOKUP(K2642,INVENTORY!$A$2:$Q$144,15,FALSE)","v":{"$error":"#N/A"}}]
[]
["Casing","Plugs/Ports",{"$nulls":4},"Casing","Plugs/Ports"]
["Pass","Pass",{"$nulls":4},"Pass","Pass"]
["Fail","Fail",null,"TRRC#:L.T.R.",null,null,"Fail","Fail",null,"TRRC#:L.T.R."]
[]
["LAPTOP TESTING RECORD",{"$nulls":5},"LAPTOP TESTING RECORD"]
[]
[{"$nulls":3},"ITEM #",{"$f":"E2642+2","v":185},{"$nulls":4},"ITEM #",{"$f":"K2642+2","v":186}]
["Tester: ","RR","Date:",{"$f":"NOW()","v":"2026-01-06T11:13:00.960"},null,null,"Tester: ","RR","Date:",{"$f":"NOW()","v":"2026-01-06T11:13:00.960"}]
["Type: ","LAPTOP","SN:",{"$f":"VLOOKUP(E2671,INVENTORYDATA,10,FALSE)","v":{"$error":"#N/A"}},null,null,"Type: ","LAPTOP","SN:",{"$f":"VLOOKUP(K2671,INVENTORYDATA,10,FALSE)","v":{"$error":"#N/A"}}]
[{"$f":"\"Make: \"","v":"Make: "},{"$f":"VLOOKUP(E2671,INVENTORYDATA,2,FALSE)","v":{"$error":"#N/A"}},{"$f":"\"Model: \"","v":"Model: "},{"$f":"VLOOKUP(E2671,INVENTORYDATA,3,FALSE)","v":{"$error":"#N/A"}},null,null,{"$f":"\"Make: \"","v":"Make: "},{"$f":"VLOOKUP(K2671,INVENTORYDATA,2,FALSE)","v":{"$error":"#N/A"}},{"$f":"\"Model: \"","v":"Model: "},{"$f":"VLOOKUP(K2671,INVENTORYDATA,3,FALSE)","v":{"$error":"#N/A"}}]
[{"$f":"\"CPU/Speed: \"","v":"CPU/Speed: "},{"$f":"VLOOKUP(E2671,INVENTORYDATA,4,FALSE)&\" / \"&VLOOKUP(E2671,INVENTORYDATA,5,FALSE)&\"GHz\"","v":{"$error":"#N/A"}},null,{"$f":"\"Memory: \"","v":"Memory: "},{"$f":"VLOOKUP(E2671,INVENTORYDATA,6,FALSE)","v":{"$error":"#N/A"}},null,{"$f":"\"CPU/Speed: \"","v":"CPU/Speed: "},{"$f":"VLOOKUP(K2671,INVENTORYDATA,4,FALSE)&\" / \"&VLOOKUP(K2671,INVENTORYDATA,5,FALSE)&\"GHz\"","v":{"$error":"#N/A"}},null,{"$f":"\"Memory: \"","v":"Memory: "},{"$f":"VLOOKUP(K2671,INVENTORYDATA,6,FALSE)","v":{"$error":"#N/A"}}]
[]
["Key Function",null,"Pass","Fail ","Comments",null,"Key Function",null,"Pass","Fail ","Comments"]
["Hard Drive Removed",null,{"$f":"IF(ISBLANK(VLOOKUP(E2671,INVENTORYDATA,13,FALSE)),\"X\",\"\")","v":""},null,{"$f":"IF(ISBLANK(VLOOKUP(E2671,INVENTORYDATA,13,FALSE)),\"\",VLOOKUP(E2671,INVENTORYDATA,13,FALSE))","v":{"$error":"#N/A"}},null,"Hard Drive Removed",null,{"$f":"IF(ISBLANK(VLOOKUP(K2671,INVENTORYDATA,13,FALSE)),\"X\",\"\")","v":""},null,{"$f":"IF(ISBLANK(VLOOKUP(K2671,INVENTORYDATA,13,FALSE)),\"\",VLOOKUP(K2671,INVENTORYDATA,13,FALSE))","v":{"$error":"#N/A"}}]
["Install Memory",null,"X",{"$nulls":3},"Install Memory",null,"X"]
["Power ON",null,"X",{"$nulls":3},"Power ON",null,"X"]
["Record BIOS info",null,"X",{"$nulls":3},"Record BIOS info",null,"X"]
["Check Optical Drive",null,{"$f":"IF((VLOOKUP(E2671,INVENTORYDATA,7,FALSE))=\"YES\",\"X\",\"\")","v":{"$error":"#N/A"}},{"$f":"IF((VLOOKUP(E2671,INVENTORYDATA,7,FALSE))=\"NO\",\"X\",\"\")","v":{"$error":"#N/A"}},null,null,"Check Optical Drive",null,{"$f":"IF((VLOOKUP(K2671,INVENTORYDATA,7,FALSE))=\"YES\",\"X\",\"\")","v":{"$error":"#N/A"}},{"$f":"IF((VLOOKUP(K2671,INVENTORYDATA,7,FALSE))=\"NO\",\"X\",\"\")","v":{"$error":"#N/A"}}]
["Power Off",null,"X",{"$nulls":3},"Power Off",null,"X"]
["HDD Serial No.",null,{"$f":"IF(ISBLANK(VLOOKUP(E2671,INVENTORYDATA,12,FALSE)),\"\",VLOOKUP(E2671,INVENTORYDATA,12,FALSE))","v":{"$error":"#N/A"}},{"$nulls":3},"HDD Serial No.",null,{"$f":"IF(ISBLANK(VLOOKUP(K2671,INVENTORYDATA,12,FALSE)),\"\",VLOOKUP(K2671,INVENTORYDATA,12,FALSE))","v":{"$error":"#N/A"}}]
[]
["Tested for key functions,R2/Ready for Resale",{"$nulls":5},"Tested for key functions,R2/Ready for Resale"]
["BIOS Lock","Caddy","Optical","WebCam","Battery",null,"BIOS Lock","Caddy","Optical","WebCam","Battery"]
[null,null,{"$f":"VLOOKUP(E2671,INVENTORY!$A$2:$N$144,7,FALSE)","v":{"$error":"#N/A"}},{"$f":"VLOOKUP(E2671,INVENTORY!$A$2:$N$144,8,FALSE)","v":{"$error":"#N/A"}},{"$f":"VLOOKUP(E2671,INVENTORY!$A$2:$N$144,9,FALSE)","v":{"$error":"#N/A"}},{"$nulls":3},{"$f":"VLOOKUP(K2671,INVENTORY!$A$2:$N$144,7,FALSE)","v":{"$error":"#N/A"}},{"$f":"VLOOKUP(K2671,INVENTORY!$A$2:$N$144,8,FALSE)","v":{"$error":"#N/A"}},{"$f":"VLOOKUP(K2671,INVENTORY!$A$2:$N$144,9,FALSE)","v":{"$error":"#N/A"}}]
[]
["CPU Cosmetics Defects:",null,{"$f":"\"Function Code: \"&VLOOKUP(E2671,INVENTORY!$A$2:$Q$144,14,FALSE)","v":{"$error":"#N/A"}},{"$nulls":3},"CPU Cosmetics Defects:",null,{"$f":"\"Function Code: \"&VLOOKUP(K2671,INVENTORY!$A$2:$Q$144,14,FALSE)","v":{"$error":"#N/A"}}]
[]
[null,null,{"$f":"\"Cosmetic Code: \"&VLOOKUP(E2671,INVENTORY!$A$2:$Q$144,15,FALSE)","v":{"$error":"#N/A"}},{"$nulls":5},{"$f":"\"Cosmetic Code: \"&VLOOKUP(K2671,INVENTORY!$A$2:$Q$144,15,FALSE)","v":{"$error":"#N/A"}}]
[]
["Casing","Plugs/Ports",{"$nulls":4},"Casing","Plugs/Ports"]
["Pass","Pass",{"$nulls":4},"Pass","Pass"]
["Fail","Fail",null,"TRRC#:L.T.R.",null,null,"Fail","Fail",null,"TRRC#:L.T.R."]
[]
["LAPTOP TESTING RECORD",{"$nulls":5},"LAPTOP TESTING RECORD"]
[]
[{"$nulls":3},"ITEM #",{"$f":"E2671+2","v":187},{"$nulls":4},"ITEM #",{"$f":"K2671+2","v":188}]
["Tester: ","RR","Date:",{"$f":"NOW()","v":"2026-01-06T11:13:00.960"},null,null,"Tester: ","RR","Date:",{"$f":"NOW()","v":"2026-01-06T11:13:00.960"}]
["Type: ","LAPTOP","SN:",{"$f":"VLOOKUP(E2700,INVENTORYDATA,10,FALSE)","v":{"$error":"#N/A"}},null,null,"Type: ","LAPTOP","SN:",{"$f":"VLOOKUP(K2700,INVENTORYDATA,10,FALSE)","v":{"$error":"#N/A"}}]
[{"$f":"\"Make: \"","v":"Make: "},{"$f":"VLOOKUP(E2700,INVENTORYDATA,2,FALSE)","v":{"$error":"#N/A"}},{"$f":"\"Model: \"","v":"Model: "},{"$f":"VLOOKUP(E2700,INVENTORYDATA,3,FALSE)","v":{"$error":"#N/A"}},null,null,{"$f":"\"Make: \"","v":"Make: "},{"$f":"VLOOKUP(K2700,INVENTORYDATA,2,FALSE)","v":{"$error":"#N/A"}},{"$f":"\"Model: \"","v":"Model: "},{"$f":"VLOOKUP(K2700,INVENTORYDATA,3,FALSE)","v":{"$error":"#N/A"}}]
[{"$f":"\"CPU/Speed: \"","v":"CPU/Speed: "},{"$f":"VLOOKUP(E2700,INVENTORYDATA,4,FALSE)&\" / \"&VLOOKUP(E2700,INVENTORYDATA,5,FALSE)&\"GHz\"","v":{"$error":"#N/A"}},null,{"$f":"\"Memory: \"","v":"Memory: "},{"$f":"VLOOKUP(E2700,INVENTORYDATA,6,FALSE)","v":{"$error":"#N/A"}},null,{"$f":"\"CPU/Speed: \"","v":"CPU/Speed: "},{"$f":"VLOOKUP(K2700,INVENTORYDATA,4,FALSE)&\" / \"&VLOOKUP(K2700,INVENTORYDATA,5,FALSE)&\"GHz\"","v":{"$error":"#N/A"}},null,{"$f":"\"Memory: \"","v":"Memory: "},{"$f":"VLOOKUP(K2700,INVENTORYDATA,6,FALSE)","v":{"$error":"#N/A"}}]
[]
["Key Function",null,"Pass","Fail ","Comments",null,"Key Function",null,"Pass","Fail ","Comments"]
["Hard Drive Removed",null,{"$f":"IF(ISBLANK(VLOOKUP(E2700,INVENTORYDATA,13,FALSE)),\"X\",\"\")","v":""},null,{"$f":"IF(ISBLANK(VLOOKUP(E2700,INVENTORYDATA,13,FALSE)),\"\",VLOOKUP(E2700,INVENTORYDATA,13,FALSE))","v":{"$error":"#N/A"}},null,"Hard Drive Removed",null,{"$f":"IF(ISBLANK(VLOOKUP(K2700,INVENTORYDATA,13,FALSE)),\"X\",\"\")","v":""},null,{"$f":"IF(ISBLANK(VLOOKUP(K2700,INVENTORYDATA,13,FALSE)),\"\",VLOOKUP(K2700,INVENTORYDATA,13,FALSE))","v":{"$error":"#N/A"}}]
["Install Memory",null,"X",{"$nulls":3},"Install Memory",null,"X"]
["Power ON",null,"X",{"$nulls":3},"Power ON",null,"X"]
["Record BIOS info",null,"X",{"$nulls":3},"Record BIOS info",null,"X"]
["Check Optical Drive",null,{"$f":"IF((VLOOKUP(E2700,INVENTORYDATA,7,FALSE))=\"YES\",\"X\",\"\")","v":{"$error":"#N/A"}},{"$f":"IF((VLOOKUP(E2700,INVENTORYDATA,7,FALSE))=\"NO\",\"X\",\"\")","v":{"$error":"#N/A"}},null,null,"Check Optical Drive",null,{"$f":"IF((VLOOKUP(K2700,INVENTORYDATA,7,FALSE))=\"YES\",\"X\",\"\")","v":{"$error":"#N/A"}},{"$f":"IF((VLOOKUP(K2700,INVENTORYDATA,7,FALSE))=\"NO\",\"X\",\"\")","v":{"$error":"#N/A"}}]
["Power Off",null,"X",{"$nulls":3},"Power Off",null,"X"]
["HDD Serial No.",null,{"$f":"IF(ISBLANK(VLOOKUP(E2700,INVENTORYDATA,12,FALSE)),\"\",VLOOKUP(E2700,INVENTORYDATA,12,FALSE))","v":{"$error":"#N/A"}},{"$nulls":3},"HDD Serial No.",null,{"$f":"IF(ISBLANK(VLOOKUP(K2700,INVENTORYDATA,12,FALSE)),\"\",VLOOKUP(K2700,INVENTORYDATA,12,FALSE))","v":{"$error":"#N/A"}}]
[]
["Tested for key functions,R2/Ready for Resale",{"$nulls":5},"Tested for key functions,R2/Ready for Resale"]
["BIOS Lock","Caddy","Optical","WebCam","Battery",null,"BIOS Lock","Caddy","Optical","WebCam","Battery"]
[null,null,{"$f":"VLOOKUP(E2700,INVENTORY!$A$2:$N$144,7,FALSE)","v":{"$error":"#N/A"}},{"$f":"VLOOKUP(E2700,INVENTORY!$A$2:$N$144,8,FALSE)","v":{"$error":"#N/A"}},{"$f":"VLOOKUP(E2700,INVENTORY!$A$2:$N$144,9,FALSE)","v":{"$error":"#N/A"}},{"$nulls":3},{"$f":"VLOOKUP(K2700,INVENTORY!$A$2:$N$144,7,FALSE)","v":{"$error":"#N/A"}},{"$f":"VLOOKUP(K2700,INVENTORY!$A$2:$N$144,8,FALSE)","v":{"$error":"#N/A"}},{"$f":"VLOOKUP(K2700,INVENTORY!$A$2:$N$144,9,FALSE)","v":{"$error":"#N/A"}}]
[]
["CPU Cosmetics Defects:",null,{"$f":"\"Function Code: \"&VLOOKUP(E2700,INVENTORY!$A$2:$Q$144,14,FALSE)","v":{"$error":"#N/A"}},{"$nulls":3},"CPU Cosmetics Defects:",null,{"$f":"\"Function Code: \"&VLOOKUP(K2700,INVENTORY!$A$2:$Q$144,14,FALSE)","v":{"$error":"#N/A"}}]
[]
[null,null,{"$f":"\"Cosmetic Code: \"&VLOOKUP(E2700,INVENTORY!$A$2:$Q$144,15,FALSE)","v":{"$error":"#N/A"}},{"$nulls":5},{"$f":"\"Cosmetic Code: \"&VLOOKUP(K2700,INVENTORY!$A$2:$Q$144,15,FALSE)","v":{"$error":"#N/A"}}]
[]
["Casing","Plugs/Ports",{"$nulls":4},"Casing","Plugs/Ports"]
["Pass","Pass",{"$nulls":4},"Pass","Pass"]
["Fail","Fail",null,"TRRC#:L.T.R.",null,null,"Fail","Fail",null,"TRRC#:L.T.R."]
[]
["LAPTOP TESTING RECORD",{"$nulls":5},"LAPTOP TESTING RECORD"]
[]
[{"$nulls":3},"ITEM #",{"$f":"E2700+2","v":189},{"$nulls":4},"ITEM #",{"$f":"K2700+2","v":190}]
["Tester: ","RR","Date:",{"$f":"NOW()","v":"2026-01-06T11:13:00.960"},null,null,"Tester: ","RR","Date:",{"$f":"NOW()","v":"2026-01-06T11:13:00.960"}]
["Type: ","LAPTOP","SN:",{"$f":"VLOOKUP(E2729,INVENTORYDATA,10,FALSE)","v":{"$error":"#N/A"}},null,null,"Type: ","LAPTOP","SN:",{"$f":"VLOOKUP(K2729,INVENTORYDATA,10,FALSE)","v":{"$error":"#N/A"}}]
[{"$f":"\"Make: \"","v":"Make: "},{"$f":"VLOOKUP(E2729,INVENTORYDATA,2,FALSE)","v":{"$error":"#N/A"}},{"$f":"\"Model: \"","v":"Model: "},{"$f":"VLOOKUP(E2729,INVENTORYDATA,3,FALSE)","v":{"$error":"#N/A"}},null,null,{"$f":"\"Make: \"","v":"Make: "},{"$f":"VLOOKUP(K2729,INVENTORYDATA,2,FALSE)","v":{"$error":"#N/A"}},{"$f":"\"Model: \"","v":"Model: "},{"$f":"VLOOKUP(K2729,INVENTORYDATA,3,FALSE)","v":{"$error":"#N/A"}}]
[{"$f":"\"CPU/Speed: \"","v":"CPU/Speed: "},{"$f":"VLOOKUP(E2729,INVENTORYDATA,4,FALSE)&\" / \"&VLOOKUP(E2729,INVENTORYDATA,5,FALSE)&\"GHz\"","v":{"$error":"#N/A"}},null,{"$f":"\"Memory: \"","v":"Memory: "},{"$f":"VLOOKUP(E2729,INVENTORYDATA,6,FALSE)","v":{"$error":"#N/A"}},null,{"$f":"\"CPU/Speed: \"","v":"CPU/Speed: "},{"$f":"VLOOKUP(K2729,INVENTORYDATA,4,FALSE)&\" / \"&VLOOKUP(K2729,INVENTORYDATA,5,FALSE)&\"GHz\"","v":{"$error":"#N/A"}},null,{"$f":"\"Memory: \"","v":"Memory: "},{"$f":"VLOOKUP(K2729,INVENTORYDATA,6,FALSE)","v":{"$error":"#N/A"}}]
[]
["Key Function",null,"Pass","Fail ","Comments",null,"Key Function",null,"Pass","Fail ","Comments"]
["Hard Drive Removed",null,{"$f":"IF(ISBLANK(VLOOKUP(E2729,INVENTORYDATA,13,FALSE)),\"X\",\"\")","v":""},null,{"$f":"IF(ISBLANK(VLOOKUP(E2729,INVENTORYDATA,13,FALSE)),\"\",VLOOKUP(E2729,INVENTORYDATA,13,FALSE))","v":{"$error":"#N/A"}},null,"Hard Drive Removed",null,{"$f":"IF(ISBLANK(VLOOKUP(K2729,INVENTORYDATA,13,FALSE)),\"X\",\"\")","v":""},null,{"$f":"IF(ISBLANK(VLOOKUP(K2729,INVENTORYDATA,13,FALSE)),\"\",VLOOKUP(K2729,INVENTORYDATA,13,FALSE))","v":{"$error":"#N/A"}}]
["Install Memory",null,"X",{"$nulls":3},"Install Memory",null,"X"]
["Power ON",null,"X",{"$nulls":3},"Power ON",null,"X"]
["Record BIOS info",null,"X",{"$nulls":3},"Record BIOS info",null,"X"]
["Check Optical Drive",null,{"$f":"IF((VLOOKUP(E2729,INVENTORYDATA,7,FALSE))=\"YES\",\"X\",\"\")","v":{"$error":"#N/A"}},{"$f":"IF((VLOOKUP(E2729,INVENTORYDATA,7,FALSE))=\"NO\",\"X\",\"\")","v":{"$error":"#N/A"}},null,null,"Check Optical Drive",null,{"$f":"IF((VLOOKUP(K2729,INVENTORYDATA,7,FALSE))=\"YES\",\"X\",\"\")","v":{"$error":"#N/A"}},{"$f":"IF((VLOOKUP(K2729,INVENTORYDATA,7,FALSE))=\"NO\",\"X\",\"\")","v":{"$error":"#N/A"}}]
["Power Off",null,"X",{"$nulls":3},"Power Off",null,"X"]
["HDD Serial No.",null,{"$f":"IF(ISBLANK(VLOOKUP(E2729,INVENTORYDATA,12,FALSE)),\"\",VLOOKUP(E2729,INVENTORYDATA,12,FALSE))","v":{"$error":"#N/A"}},{"$nulls":3},"HDD Serial No.",null,{"$f":"IF(ISBLANK(VLOOKUP(K2729,INVENTORYDATA,12,FALSE)),\"\",VLOOKUP(K2729,INVENTORYDATA,12,FALSE))","v":{"$error":"#N/A"}}]
[]
["Tested for key functions,R2/Ready for Resale",{"$nulls":5},"Tested for key functions,R2/Ready for Resale"]
["BIOS Lock","Caddy","Optical","WebCam","Battery",null,"BIOS Lock","Caddy","Optical","WebCam","Battery"]
[null,null,{"$f":"VLOOKUP(E2729,INVENTORY!$A$2:$N$144,7,FALSE)","v":{"$error":"#N/A"}},{"$f":"VLOOKUP(E2729,INVENTORY!$A$2:$N$144,8,FALSE)","v":{"$error":"#N/A"}},{"$f":"VLOOKUP(E2729,INVENTORY!$A$2:$N$144,9,FALSE)","v":{"$error":"#N/A"}},{"$nulls":3},{"$f":"VLOOKUP(K2729,INVENTORY!$A$2:$N$144,7,FALSE)","v":{"$error":"#N/A"}},{"$f":"VLOOKUP(K2729,INVENTORY!$A$2:$N$144,8,FALSE)","v":{"$error":"#N/A"}},{"$f":"VLOOKUP(K2729,INVENTORY!$A$2:$N$144,9,FALSE)","v":{"$error":"#N/A"}}]
[]
["CPU Cosmetics Defects:",null,{"$f":"\"Function Code: \"&VLOOKUP(E2729,INVENTORY!$A$2:$Q$144,14,FALSE)","v":{"$error":"#N/A"}},{"$nulls":3},"CPU Cosmetics Defects:",null,{"$f":"\"Function Code: \"&VLOOKUP(K2729,INVENTORY!$A$2:$Q$144,14,FALSE)","v":{"$error":"#N/A"}}]
[]
[null,null,{"$f":"\"Cosmetic Code: \"&VLOOKUP(E2729,INVENTORY!$A$2:$Q$144,15,FALSE)","v":{"$error":"#N/A"}},{"$nulls":5},{"$f":"\"Cosmetic Code: \"&VLOOKUP(K2729,INVENTORY!$A$2:$Q$144,15,FALSE)","v":{"$error":"#N/A"}}]
[]
["Casing","Plugs/Ports",{"$nulls":4},"Casing","Plugs/Ports"]
["Pass","Pass",{"$nulls":4},"Pass","Pass"]
["Fail","Fail",null,"TRRC#:L.T.R.",null,null,"Fail","Fail",null,"TRRC#:L.T.R."]
[]
["LAPTOP TESTING RECORD",{"$nulls":5},"LAPTOP TESTING RECORD"]
[]
[{"$nulls":3},"ITEM #",{"$f":"E2729+2","v":191},{"$nulls":4},"ITEM #",{"$f":"K2729+2","v":192}]
["Tester: ","RR","Date:",{"$f":"NOW()","v":"2026-01-06T11:13:00.960"},null,null,"Tester: ","RR","Date:",{"$f":"NOW()","v":"2026-01-06T11:13:00.960"}]
["Type: ","LAPTOP","SN:",{"$f":"VLOOKUP(E2758,INVENTORYDATA,10,FALSE)","v":{"$error":"#N/A"}},null,null,"Type: ","LAPTOP","SN:",{"$f":"VLOOKUP(K2758,INVENTORYDATA,10,FALSE)","v":{"$error":"#N/A"}}]
[{"$f":"\"Make: \"","v":"Make: "},{"$f":"VLOOKUP(E2758,INVENTORYDATA,2,FALSE)","v":{"$error":"#N/A"}},{"$f":"\"Model: \"","v":"Model: "},{"$f":"VLOOKUP(E2758,INVENTORYDATA,3,FALSE)","v":{"$error":"#N/A"}},null,null,{"$f":"\"Make: \"","v":"Make: "},{"$f":"VLOOKUP(K2758,INVENTORYDATA,2,FALSE)","v":{"$error":"#N/A"}},{"$f":"\"Model: \"","v":"Model: "},{"$f":"VLOOKUP(K2758,INVENTORYDATA,3,FALSE)","v":{"$error":"#N/A"}}]
[{"$f":"\"CPU/Speed: \"","v":"CPU/Speed: "},{"$f":"VLOOKUP(E2758,INVENTORYDATA,4,FALSE)&\" / \"&VLOOKUP(E2758,INVENTORYDATA,5,FALSE)&\"GHz\"","v":{"$error":"#N/A"}},null,{"$f":"\"Memory: \"","v":"Memory: "},{"$f":"VLOOKUP(E2758,INVENTORYDATA,6,FALSE)","v":{"$error":"#N/A"}},null,{"$f":"\"CPU/Speed: \"","v":"CPU/Speed: "},{"$f":"VLOOKUP(K2758,INVENTORYDATA,4,FALSE)&\" / \"&VLOOKUP(K2758,INVENTORYDATA,5,FALSE)&\"GHz\"","v":{"$error":"#N/A"}},null,{"$f":"\"Memory: \"","v":"Memory: "},{"$f":"VLOOKUP(K2758,INVENTORYDATA,6,FALSE)","v":{"$error":"#N/A"}}]
[]
["Key Function",null,"Pass","Fail ","Comments",null,"Key Function",null,"Pass","Fail ","Comments"]
["Hard Drive Removed",null,{"$f":"IF(ISBLANK(VLOOKUP(E2758,INVENTORYDATA,13,FALSE)),\"X\",\"\")","v":""},null,{"$f":"IF(ISBLANK(VLOOKUP(E2758,INVENTORYDATA,13,FALSE)),\"\",VLOOKUP(E2758,INVENTORYDATA,13,FALSE))","v":{"$error":"#N/A"}},null,"Hard Drive Removed",null,{"$f":"IF(ISBLANK(VLOOKUP(K2758,INVENTORYDATA,13,FALSE)),\"X\",\"\")","v":""},null,{"$f":"IF(ISBLANK(VLOOKUP(K2758,INVENTORYDATA,13,FALSE)),\"\",VLOOKUP(K2758,INVENTORYDATA,13,FALSE))","v":{"$error":"#N/A"}}]
["Install Memory",null,"X",{"$nulls":3},"Install Memory",null,"X"]
["Power ON",null,"X",{"$nulls":3},"Power ON",null,"X"]
["Record BIOS info",null,"X",{"$nulls":3},"Record BIOS info",null,"X"]
["Check Optical Drive",null,{"$f":"IF((VLOOKUP(E2758,INVENTORYDATA,7,FALSE))=\"YES\",\"X\",\"\")","v":{"$error":"#N/A"}},{"$f":"IF((VLOOKUP(E2758,INVENTORYDATA,7,FALSE))=\"NO\",\"X\",\"\")","v":{"$error":"#N/A"}},null,null,"Check Optical Drive",null,{"$f":"IF((VLOOKUP(K2758,INVENTORYDATA,7,FALSE))=\"YES\",\"X\",\"\")","v":{"$error":"#N/A"}},{"$f":"IF((VLOOKUP(K2758,INVENTORYDATA,7,FALSE))=\"NO\",\"X\",\"\")","v":{"$error":"#N/A"}}]
["Power Off",null,"X",{"$nulls":3},"Power Off",null,"X"]
["HDD Serial No.",null,{"$f":"IF(ISBLANK(VLOOKUP(E2758,INVENTORYDATA,12,FALSE)),\"\",VLOOKUP(E2758,INVENTORYDATA,12,FALSE))","v":{"$error":"#N/A"}},{"$nulls":3},"HDD Serial No.",null,{"$f":"IF(ISBLANK(VLOOKUP(K2758,INVENTORYDATA,12,FALSE)),\"\",VLOOKUP(K2758,INVENTORYDATA,12,FALSE))","v":{"$error":"#N/A"}}]
[]
["Tested for key functions,R2/Ready for Resale",{"$nulls":5},"Tested for key functions,R2/Ready for Resale"]
["BIOS Lock","Caddy","Optical","WebCam","Battery",null,"BIOS Lock","Caddy","Optical","WebCam","Battery"]
[null,null,{"$f":"VLOOKUP(E2758,INVENTORY!$A$2:$N$144,7,FALSE)","v":{"$error":"#N/A"}},{"$f":"VLOOKUP(E2758,INVENTORY!$A$2:$N$144,8,FALSE)","v":{"$error":"#N/A"}},{"$f":"VLOOKUP(E2758,INVENTORY!$A$2:$N$144,9,FALSE)","v":{"$error":"#N/A"}},{"$nulls":3},{"$f":"VLOOKUP(K2758,INVENTORY!$A$2:$N$144,7,FALSE)","v":{"$error":"#N/A"}},{"$f":"VLOOKUP(K2758,INVENTORY!$A$2:$N$144,8,FALSE)","v":{"$error":"#N/A"}},{"$f":"VLOOKUP(K2758,INVENTORY!$A$2:$N$144,9,FALSE)","v":{"$error":"#N/A"}}]
[]
["CPU Cosmetics Defects:",null,{"$f":"\"Function Code: \"&VLOOKUP(E2758,INVENTORY!$A$2:$Q$144,14,FALSE)","v":{"$error":"#N/A"}},{"$nulls":3},"CPU Cosmetics Defects:",null,{"$f":"\"Function Code: \"&VLOOKUP(K2758,INVENTORY!$A$2:$Q$144,14,FALSE)","v":{"$error":"#N/A"}}]
[]
[null,null,{"$f":"\"Cosmetic Code: \"&VLOOKUP(E2758,INVENTORY!$A$2:$Q$144,15,FALSE)","v":{"$error":"#N/A"}},{"$nulls":5},{"$f":"\"Cosmetic Code: \"&VLOOKUP(K2758,INVENTORY!$A$2:$Q$144,15,FALSE)","v":{"$error":"#N/A"}}]
[]
["Casing","Plugs/Ports",{"$nulls":4},"Casing","Plugs/Ports"]
["Pass","Pass",{"$nulls":4},"Pass","Pass"]
["Fail","Fail",null,"TRRC#:L.T.R.",null,null,"Fail","Fail",null,"TRRC#:L.T.R."]
[]
["LAPTOP TESTING RECORD",{"$nulls":5},"LAPTOP TESTING RECORD"]
[]
[{"$nulls":3},"ITEM #",{"$f":"E2758+2","v":193},{"$nulls":4},"ITEM #",{"$f":"K2758+2","v":194}]
["Tester: ","RR","Date:",{"$f":"NOW()","v":"2026-01-06T11:13:00.960"},null,null,"Tester: ","RR","Date:",{"$f":"NOW()","v":"2026-01-06T11:13:00.960"}]
["Type: ","LAPTOP","SN:",{"$f":"VLOOKUP(E2787,INVENTORYDATA,10,FALSE)","v":{"$error":"#N/A"}},null,null,"Type: ","LAPTOP","SN:",{"$f":"VLOOKUP(K2787,INVENTORYDATA,10,FALSE)","v":{"$error":"#N/A"}}]
[{"$f":"\"Make: \"","v":"Make: "},{"$f":"VLOOKUP(E2787,INVENTORYDATA,2,FALSE)","v":{"$error":"#N/A"}},{"$f":"\"Model: \"","v":"Model: "},{"$f":"VLOOKUP(E2787,INVENTORYDATA,3,FALSE)","v":{"$error":"#N/A"}},null,null,{"$f":"\"Make: \"","v":"Make: "},{"$f":"VLOOKUP(K2787,INVENTORYDATA,2,FALSE)","v":{"$error":"#N/A"}},{"$f":"\"Model: \"","v":"Model: "},{"$f":"VLOOKUP(K2787,INVENTORYDATA,3,FALSE)","v":{"$error":"#N/A"}}]
[{"$f":"\"CPU/Speed: \"","v":"CPU/Speed: "},{"$f":"VLOOKUP(E2787,INVENTORYDATA,4,FALSE)&\" / \"&VLOOKUP(E2787,INVENTORYDATA,5,FALSE)&\"GHz\"","v":{"$error":"#N/A"}},null,{"$f":"\"Memory: \"","v":"Memory: "},{"$f":"VLOOKUP(E2787,INVENTORYDATA,6,FALSE)","v":{"$error":"#N/A"}},null,{"$f":"\"CPU/Speed: \"","v":"CPU/Speed: "},{"$f":"VLOOKUP(K2787,INVENTORYDATA,4,FALSE)&\" / \"&VLOOKUP(K2787,INVENTORYDATA,5,FALSE)&\"GHz\"","v":{"$error":"#N/A"}},null,{"$f":"\"Memory: \"","v":"Memory: "},{"$f":"VLOOKUP(K2787,INVENTORYDATA,6,FALSE)","v":{"$error":"#N/A"}}]
[]
["Key Function",null,"Pass","Fail ","Comments",null,"Key Function",null,"Pass","Fail ","Comments"]
["Hard Drive Removed",null,{"$f":"IF(ISBLANK(VLOOKUP(E2787,INVENTORYDATA,13,FALSE)),\"X\",\"\")","v":""},null,{"$f":"IF(ISBLANK(VLOOKUP(E2787,INVENTORYDATA,13,FALSE)),\"\",VLOOKUP(E2787,INVENTORYDATA,13,FALSE))","v":{"$error":"#N/A"}},null,"Hard Drive Removed",null,{"$f":"IF(ISBLANK(VLOOKUP(K2787,INVENTORYDATA,13,FALSE)),\"X\",\"\")","v":""},null,{"$f":"IF(ISBLANK(VLOOKUP(K2787,INVENTORYDATA,13,FALSE)),\"\",VLOOKUP(K2787,INVENTORYDATA,13,FALSE))","v":{"$error":"#N/A"}}]
["Install Memory",null,"X",{"$nulls":3},"Install Memory",null,"X"]
["Power ON",null,"X",{"$nulls":3},"Power ON",null,"X"]
["Record BIOS info",null,"X",{"$nulls":3},"Record BIOS info",null,"X"]
["Check Optical Drive",null,{"$f":"IF((VLOOKUP(E2787,INVENTORYDATA,7,FALSE))=\"YES\",\"X\",\"\")","v":{"$error":"#N/A"}},{"$f":"IF((VLOOKUP(E2787,INVENTORYDATA,7,FALSE))=\"NO\",\"X\",\"\")","v":{"$error":"#N/A"}},null,null,"Check Optical Drive",null,{"$f":"IF((VLOOKUP(K2787,INVENTORYDATA,7,FALSE))=\"YES\",\"X\",\"\")","v":{"$error":"#N/A"}},{"$f":"IF((VLOOKUP(K2787,INVENTORYDATA,7,FALSE))=\"NO\",\"X\",\"\")","v":{"$error":"#N/A"}}]
["Power Off",null,"X",{"$nulls":3},"Power Off",null,"X"]
["HDD Serial No.",null,{"$f":"IF(ISBLANK(VLOOKUP(E2787,INVENTORYDATA,12,FALSE)),\"\",VLOOKUP(E2787,INVENTORYDATA,12,FALSE))","v":{"$error":"#N/A"}},{"$nulls":3},"HDD Serial No.",null,{"$f":"IF(ISBLANK(VLOOKUP(K2787,INVENTORYDATA,12,FALSE)),\"\",VLOOKUP(K2787,INVENTORYDATA,12,FALSE))","v":{"$error":"#N/A"}}]
[]
["Tested for key functions,R2/Ready for Resale",{"$nulls":5},"Tested for key functions,R2/Ready for Resale"]
["BIOS Lock","Caddy","Optical","WebCam","Battery",null,"BIOS Lock","Caddy","Optical","WebCam","Battery"]
[null,null,{"$f":"VLOOKUP(E2787,INVENTORY!$A$2:$N$144,7,FALSE)","v":{"$error":"#N/A"}},{"$f":"VLOOKUP(E2787,INVENTORY!$A$2:$N$144,8,FALSE)","v":{"$error":"#N/A"}},{"$f":"VLOOKUP(E2787,INVENTORY!$A$2:$N$144,9,FALSE)","v":{"$error":"#N/A"}},{"$nulls":3},{"$f":"VLOOKUP(K2787,INVENTORY!$A$2:$N$144,7,FALSE)","v":{"$error":"#N/A"}},{"$f":"VLOOKUP(K2787,INVENTORY!$A$2:$N$144,8,FALSE)","v":{"$error":"#N/A"}},{"$f":"VLOOKUP(K2787,INVENTORY!$A$2:$N$144,9,FALSE)","v":{"$error":"#N/A"}}]
[]
["CPU Cosmetics Defects:",null,{"$f":"\"Function Code: \"&VLOOKUP(E2787,INVENTORY!$A$2:$Q$144,14,FALSE)","v":{"$error":"#N/A"}},{"$nulls":3},"CPU Cosmetics Defects:",null,{"$f":"\"Function Code: \"&VLOOKUP(K2787,INVENTORY!$A$2:$Q$144,14,FALSE)","v":{"$error":"#N/A"}}]
[]
[null,null,{"$f":"\"Cosmetic Code: \"&VLOOKUP(E2787,INVENTORY!$A$2:$Q$144,15,FALSE)","v":{"$error":"#N/A"}},{"$nulls":5},{"$f":"\"Cosmetic Code: \"&VLOOKUP(K2787,INVENTORY!$A$2:$Q$144,15,FALSE)","v":{"$error":"#N/A"}}]
[]
["Casing","Plugs/Ports",{"$nulls":4},"Casing","Plugs/Ports"]
["Pass","Pass",{"$nulls":4},"Pass","Pass"]
["Fail","Fail",null,"TRRC#:L.T.R.",null,null,"Fail","Fail",null,"TRRC#:L.T.R."]
[]
["LAPTOP TESTING RECORD",{"$nulls":5},"LAPTOP TESTING RECORD"]
[]
[{"$nulls":3},"ITEM #",{"$f":"E2787+2","v":195},{"$nulls":4},"ITEM #",{"$f":"K2787+2","v":196}]
["Tester: ","RR","Date:",{"$f":"NOW()","v":"2026-01-06T11:13:00.960"},null,null,"Tester: ","RR","Date:",{"$f":"NOW()","v":"2026-01-06T11:13:00.960"}]
["Type: ","LAPTOP","SN:",{"$f":"VLOOKUP(E2816,INVENTORYDATA,10,FALSE)","v":{"$error":"#N/A"}},null,null,"Type: ","LAPTOP","SN:",{"$f":"VLOOKUP(K2816,INVENTORYDATA,10,FALSE)","v":{"$error":"#N/A"}}]
[{"$f":"\"Make: \"","v":"Make: "},{"$f":"VLOOKUP(E2816,INVENTORYDATA,2,FALSE)","v":{"$error":"#N/A"}},{"$f":"\"Model: \"","v":"Model: "},{"$f":"VLOOKUP(E2816,INVENTORYDATA,3,FALSE)","v":{"$error":"#N/A"}},null,null,{"$f":"\"Make: \"","v":"Make: "},{"$f":"VLOOKUP(K2816,INVENTORYDATA,2,FALSE)","v":{"$error":"#N/A"}},{"$f":"\"Model: \"","v":"Model: "},{"$f":"VLOOKUP(K2816,INVENTORYDATA,3,FALSE)","v":{"$error":"#N/A"}}]
[{"$f":"\"CPU/Speed: \"","v":"CPU/Speed: "},{"$f":"VLOOKUP(E2816,INVENTORYDATA,4,FALSE)&\" / \"&VLOOKUP(E2816,INVENTORYDATA,5,FALSE)&\"GHz\"","v":{"$error":"#N/A"}},null,{"$f":"\"Memory: \"","v":"Memory: "},{"$f":"VLOOKUP(E2816,INVENTORYDATA,6,FALSE)","v":{"$error":"#N/A"}},null,{"$f":"\"CPU/Speed: \"","v":"CPU/Speed: "},{"$f":"VLOOKUP(K2816,INVENTORYDATA,4,FALSE)&\" / \"&VLOOKUP(K2816,INVENTORYDATA,5,FALSE)&\"GHz\"","v":{"$error":"#N/A"}},null,{"$f":"\"Memory: \"","v":"Memory: "},{"$f":"VLOOKUP(K2816,INVENTORYDATA,6,FALSE)","v":{"$error":"#N/A"}}]
[]
["Key Function",null,"Pass","Fail ","Comments",null,"Key Function",null,"Pass","Fail ","Comments"]
["Hard Drive Removed",null,{"$f":"IF(ISBLANK(VLOOKUP(E2816,INVENTORYDATA,13,FALSE)),\"X\",\"\")","v":""},null,{"$f":"IF(ISBLANK(VLOOKUP(E2816,INVENTORYDATA,13,FALSE)),\"\",VLOOKUP(E2816,INVENTORYDATA,13,FALSE))","v":{"$error":"#N/A"}},null,"Hard Drive Removed",null,{"$f":"IF(ISBLANK(VLOOKUP(K2816,INVENTORYDATA,13,FALSE)),\"X\",\"\")","v":""},null,{"$f":"IF(ISBLANK(VLOOKUP(K2816,INVENTORYDATA,13,FALSE)),\"\",VLOOKUP(K2816,INVENTORYDATA,13,FALSE))","v":{"$error":"#N/A"}}]
["Install Memory",null,"X",{"$nulls":3},"Install Memory",null,"X"]
["Power ON",null,"X",{"$nulls":3},"Power ON",null,"X"]
["Record BIOS info",null,"X",{"$nulls":3},"Record BIOS info",null,"X"]
["Check Optical Drive",null,{"$f":"IF((VLOOKUP(E2816,INVENTORYDATA,7,FALSE))=\"YES\",\"X\",\"\")","v":{"$error":"#N/A"}},{"$f":"IF((VLOOKUP(E2816,INVENTORYDATA,7,FALSE))=\"NO\",\"X\",\"\")","v":{"$error":"#N/A"}},null,null,"Check Optical Drive",null,{"$f":"IF((VLOOKUP(K2816,INVENTORYDATA,7,FALSE))=\"YES\",\"X\",\"\")","v":{"$error":"#N/A"}},{"$f":"IF((VLOOKUP(K2816,INVENTORYDATA,7,FALSE))=\"NO\",\"X\",\"\")","v":{"$error":"#N/A"}}]
["Power Off",null,"X",{"$nulls":3},"Power Off",null,"X"]
["HDD Serial No.",null,{"$f":"IF(ISBLANK(VLOOKUP(E2816,INVENTORYDATA,12,FALSE)),\"\",VLOOKUP(E2816,INVENTORYDATA,12,FALSE))","v":{"$error":"#N/A"}},{"$nulls":3},"HDD Serial No.",null,{"$f":"IF(ISBLANK(VLOOKUP(K2816,INVENTORYDATA,12,FALSE)),\"\",VLOOKUP(K2816,INVENTORYDATA,12,FALSE))","v":{"$error":"#N/A"}}]
[]
["Tested for key functions,R2/Ready for Resale",{"$nulls":5},"Tested for key functions,R2/Ready for Resale"]
["BIOS Lock","Caddy","Optical","WebCam","Battery",null,"BIOS Lock","Caddy","Optical","WebCam","Battery"]
[null,null,{"$f":"VLOOKUP(E2816,INVENTORY!$A$2:$N$144,7,FALSE)","v":{"$error":"#N/A"}},{"$f":"VLOOKUP(E2816,INVENTORY!$A$2:$N$144,8,FALSE)","v":{"$error":"#N/A"}},{"$f":"VLOOKUP(E2816,INVENTORY!$A$2:$N$144,9,FALSE)","v":{"$error":"#N/A"}},{"$nulls":3},{"$f":"VLOOKUP(K2816,INVENTORY!$A$2:$N$144,7,FALSE)","v":{"$error":"#N/A"}},{"$f":"VLOOKUP(K2816,INVENTORY!$A$2:$N$144,8,FALSE)","v":{"$error":"#N/A"}},{"$f":"VLOOKUP(K2816,INVENTORY!$A$2:$N$144,9,FALSE)","v":{"$error":"#N/A"}}]
[]
["CPU Cosmetics Defects:",null,{"$f":"\"Function Code: \"&VLOOKUP(E2816,INVENTORY!$A$2:$Q$144,14,FALSE)","v":{"$error":"#N/A"}},{"$nulls":3},"CPU Cosmetics Defects:",null,{"$f":"\"Function Code: \"&VLOOKUP(K2816,INVENTORY!$A$2:$Q$144,14,FALSE)","v":{"$error":"#N/A"}}]
[]
[null,null,{"$f":"\"Cosmetic Code: \"&VLOOKUP(E2816,INVENTORY!$A$2:$Q$144,15,FALSE)","v":{"$error":"#N/A"}},{"$nulls":5},{"$f":"\"Cosmetic Code: \"&VLOOKUP(K2816,INVENTORY!$A$2:$Q$144,15,FALSE)","v":{"$error":"#N/A"}}]
[]
["Casing","Plugs/Ports",{"$nulls":4},"Casing","Plugs/Ports"]
["Pass","Pass",{"$nulls":4},"Pass","Pass"]
["Fail","Fail",null,"TRRC#:L.T.R.",null,null,"Fail","Fail",null,"TRRC#:L.T.R."]
[]
["LAPTOP TESTING RECORD",{"$nulls":5},"LAPTOP TESTING RECORD"]
[]
[{"$nulls":3},"ITEM #",{"$f":"E2816+2","v":197},{"$nulls":4},"ITEM #",{"$f":"K2816+2","v":198}]
["Tester: ","RR","Date:",{"$f":"NOW()","v":"2026-01-06T11:13:00.960"},null,null,"Tester: ","RR","Date:",{"$f":"NOW()","v":"2026-01-06T11:13:00.960"}]
["Type: ","LAPTOP","SN:",{"$f":"VLOOKUP(E2845,INVENTORYDATA,10,FALSE)","v":{"$error":"#N/A"}},null,null,"Type: ","LAPTOP","SN:",{"$f":"VLOOKUP(K2845,INVENTORYDATA,10,FALSE)","v":{"$error":"#N/A"}}]
[{"$f":"\"Make: \"","v":"Make: "},{"$f":"VLOOKUP(E2845,INVENTORYDATA,2,FALSE)","v":{"$error":"#N/A"}},{"$f":"\"Model: \"","v":"Model: "},{"$f":"VLOOKUP(E2845,INVENTORYDATA,3,FALSE)","v":{"$error":"#N/A"}},null,null,{"$f":"\"Make: \"","v":"Make: "},{"$f":"VLOOKUP(K2845,INVENTORYDATA,2,FALSE)","v":{"$error":"#N/A"}},{"$f":"\"Model: \"","v":"Model: "},{"$f":"VLOOKUP(K2845,INVENTORYDATA,3,FALSE)","v":{"$error":"#N/A"}}]
[{"$f":"\"CPU/Speed: \"","v":"CPU/Speed: "},{"$f":"VLOOKUP(E2845,INVENTORYDATA,4,FALSE)&\" / \"&VLOOKUP(E2845,INVENTORYDATA,5,FALSE)&\"GHz\"","v":{"$error":"#N/A"}},null,{"$f":"\"Memory: \"","v":"Memory: "},{"$f":"VLOOKUP(E2845,INVENTORYDATA,6,FALSE)","v":{"$error":"#N/A"}},null,{"$f":"\"CPU/Speed: \"","v":"CPU/Speed: "},{"$f":"VLOOKUP(K2845,INVENTORYDATA,4,FALSE)&\" / \"&VLOOKUP(K2845,INVENTORYDATA,5,FALSE)&\"GHz\"","v":{"$error":"#N/A"}},null,{"$f":"\"Memory: \"","v":"Memory: "},{"$f":"VLOOKUP(K2845,INVENTORYDATA,6,FALSE)","v":{"$error":"#N/A"}}]
[]
["Key Function",null,"Pass","Fail ","Comments",null,"Key Function",null,"Pass","Fail ","Comments"]
["Hard Drive Removed",null,{"$f":"IF(ISBLANK(VLOOKUP(E2845,INVENTORYDATA,13,FALSE)),\"X\",\"\")","v":""},null,{"$f":"IF(ISBLANK(VLOOKUP(E2845,INVENTORYDATA,13,FALSE)),\"\",VLOOKUP(E2845,INVENTORYDATA,13,FALSE))","v":{"$error":"#N/A"}},null,"Hard Drive Removed",null,{"$f":"IF(ISBLANK(VLOOKUP(K2845,INVENTORYDATA,13,FALSE)),\"X\",\"\")","v":""},null,{"$f":"IF(ISBLANK(VLOOKUP(K2845,INVENTORYDATA,13,FALSE)),\"\",VLOOKUP(K2845,INVENTORYDATA,13,FALSE))","v":{"$error":"#N/A"}}]
["Install Memory",null,"X",{"$nulls":3},"Install Memory",null,"X"]
["Power ON",null,"X",{"$nulls":3},"Power ON",null,"X"]
["Record BIOS info",null,"X",{"$nulls":3},"Record BIOS info",null,"X"]
["Check Optical Drive",null,{"$f":"IF((VLOOKUP(E2845,INVENTORYDATA,7,FALSE))=\"YES\",\"X\",\"\")","v":{"$error":"#N/A"}},{"$f":"IF((VLOOKUP(E2845,INVENTORYDATA,7,FALSE))=\"NO\",\"X\",\"\")","v":{"$error":"#N/A"}},null,null,"Check Optical Drive",null,{"$f":"IF((VLOOKUP(K2845,INVENTORYDATA,7,FALSE))=\"YES\",\"X\",\"\")","v":{"$error":"#N/A"}},{"$f":"IF((VLOOKUP(K2845,INVENTORYDATA,7,FALSE))=\"NO\",\"X\",\"\")","v":{"$error":"#N/A"}}]
["Power Off",null,"X",{"$nulls":3},"Power Off",null,"X"]
["HDD Serial No.",null,{"$f":"IF(ISBLANK(VLOOKUP(E2845,INVENTORYDATA,12,FALSE)),\"\",VLOOKUP(E2845,INVENTORYDATA,12,FALSE))","v":{"$error":"#N/A"}},{"$nulls":3},"HDD Serial No.",null,{"$f":"IF(ISBLANK(VLOOKUP(K2845,INVENTORYDATA,12,FALSE)),\"\",VLOOKUP(K2845,INVENTORYDATA,12,FALSE))","v":{"$error":"#N/A"}}]
[]
["Tested for key functions,R2/Ready for Resale",{"$nulls":5},"Tested for key functions,R2/Ready for Resale"]
["BIOS Lock","Caddy","Optical","WebCam","Battery",null,"BIOS Lock","Caddy","Optical","WebCam","Battery"]
[null,null,{"$f":"VLOOKUP(E2845,INVENTORY!$A$2:$N$144,7,FALSE)","v":{"$error":"#N/A"}},{"$f":"VLOOKUP(E2845,INVENTORY!$A$2:$N$144,8,FALSE)","v":{"$error":"#N/A"}},{"$f":"VLOOKUP(E2845,INVENTORY!$A$2:$N$144,9,FALSE)","v":{"$error":"#N/A"}},{"$nulls":3},{"$f":"VLOOKUP(K2845,INVENTORY!$A$2:$N$144,7,FALSE)","v":{"$error":"#N/A"}},{"$f":"VLOOKUP(K2845,INVENTORY!$A$2:$N$144,8,FALSE)","v":{"$error":"#N/A"}},{"$f":"VLOOKUP(K2845,INVENTORY!$A$2:$N$144,9,FALSE)","v":{"$error":"#N/A"}}]
[]
["CPU Cosmetics Defects:",null,{"$f":"\"Function Code: \"&VLOOKUP(E2845,INVENTORY!$A$2:$Q$144,14,FALSE)","v":{"$error":"#N/A"}},{"$nulls":3},"CPU Cosmetics Defects:",null,{"$f":"\"Function Code: \"&VLOOKUP(K2845,INVENTORY!$A$2:$Q$144,14,FALSE)","v":{"$error":"#N/A"}}]
[]
[null,null,{"$f":"\"Cosmetic Code: \"&VLOOKUP(E2845,INVENTORY!$A$2:$Q$144,15,FALSE)","v":{"$error":"#N/A"}},{"$nulls":5},{"$f":"\"Cosmetic Code: \"&VLOOKUP(K2845,INVENTORY!$A$2:$Q$144,15,FALSE)","v":{"$error":"#N/A"}}]
[]
["Casing","Plugs/Ports",{"$nulls":4},"Casing","Plugs/Ports"]
["Pass","Pass",{"$nulls":4},"Pass","Pass"]
["Fail","Fail",null,"TRRC#:L.T.R.",null,null,"Fail","Fail",null,"TRRC#:L.T.R."]
[]
["LAPTOP TESTING RECORD",{"$nulls":5},"LAPTOP TESTING RECORD"]
[]
[{"$nulls":3},"ITEM #",{"$f":"E2845+2","v":199},{"$nulls":4},"ITEM #",{"$f":"K2845+2","v":200}]
["Tester: ","RR","Date:",{"$f":"NOW()","v":"2026-01-06T11:13:00.960"},null,null,"Tester: ","RR","Date:",{"$f":"NOW()","v":"2026-01-06T11:13:00.960"}]
["Type: ","LAPTOP","SN:",{"$f":"VLOOKUP(E2874,INVENTORYDATA,10,FALSE)","v":{"$error":"#N/A"}},null,null,"Type: ","LAPTOP","SN:",{"$f":"VLOOKUP(K2874,INVENTORYDATA,10,FALSE)","v":{"$error":"#N/A"}}]
[{"$f":"\"Make: \"","v":"Make: "},{"$f":"VLOOKUP(E2874,INVENTORYDATA,2,FALSE)","v":{"$error":"#N/A"}},{"$f":"\"Model: \"","v":"Model: "},{"$f":"VLOOKUP(E2874,INVENTORYDATA,3,FALSE)","v":{"$error":"#N/A"}},null,null,{"$f":"\"Make: \"","v":"Make: "},{"$f":"VLOOKUP(K2874,INVENTORYDATA,2,FALSE)","v":{"$error":"#N/A"}},{"$f":"\"Model: \"","v":"Model: "},{"$f":"VLOOKUP(K2874,INVENTORYDATA,3,FALSE)","v":{"$error":"#N/A"}}]
[{"$f":"\"CPU/Speed: \"","v":"CPU/Speed: "},{"$f":"VLOOKUP(E2874,INVENTORYDATA,4,FALSE)&\" / \"&VLOOKUP(E2874,INVENTORYDATA,5,FALSE)&\"GHz\"","v":{"$error":"#N/A"}},null,{"$f":"\"Memory: \"","v":"Memory: "},{"$f":"VLOOKUP(E2874,INVENTORYDATA,6,FALSE)","v":{"$error":"#N/A"}},null,{"$f":"\"CPU/Speed: \"","v":"CPU/Speed: "},{"$f":"VLOOKUP(K2874,INVENTORYDATA,4,FALSE)&\" / \"&VLOOKUP(K2874,INVENTORYDATA,5,FALSE)&\"GHz\"","v":{"$error":"#N/A"}},null,{"$f":"\"Memory: \"","v":"Memory: "},{"$f":"VLOOKUP(K2874,INVENTORYDATA,6,FALSE)","v":{"$error":"#N/A"}}]
[]
["Key Function",null,"Pass","Fail ","Comments",null,"Key Function",null,"Pass","Fail ","Comments"]
["Hard Drive Removed",null,{"$f":"IF(ISBLANK(VLOOKUP(E2874,INVENTORYDATA,13,FALSE)),\"X\",\"\")","v":""},null,{"$f":"IF(ISBLANK(VLOOKUP(E2874,INVENTORYDATA,13,FALSE)),\"\",VLOOKUP(E2874,INVENTORYDATA,13,FALSE))","v":{"$error":"#N/A"}},null,"Hard Drive Removed",null,{"$f":"IF(ISBLANK(VLOOKUP(K2874,INVENTORYDATA,13,FALSE)),\"X\",\"\")","v":""},null,{"$f":"IF(ISBLANK(VLOOKUP(K2874,INVENTORYDATA,13,FALSE)),\"\",VLOOKUP(K2874,INVENTORYDATA,13,FALSE))","v":{"$error":"#N/A"}}]
["Install Memory",null,"X",{"$nulls":3},"Install Memory",null,"X"]
["Power ON",null,"X",{"$nulls":3},"Power ON",null,"X"]
["Record BIOS info",null,"X",{"$nulls":3},"Record BIOS info",null,"X"]
["Check Optical Drive",null,{"$f":"IF((VLOOKUP(E2874,INVENTORYDATA,7,FALSE))=\"YES\",\"X\",\"\")","v":{"$error":"#N/A"}},{"$f":"IF((VLOOKUP(E2874,INVENTORYDATA,7,FALSE))=\"NO\",\"X\",\"\")","v":{"$error":"#N/A"}},null,null,"Check Optical Drive",null,{"$f":"IF((VLOOKUP(K2874,INVENTORYDATA,7,FALSE))=\"YES\",\"X\",\"\")","v":{"$error":"#N/A"}},{"$f":"IF((VLOOKUP(K2874,INVENTORYDATA,7,FALSE))=\"NO\",\"X\",\"\")","v":{"$error":"#N/A"}}]
["Power Off",null,"X",{"$nulls":3},"Power Off",null,"X"]
["HDD Serial No.",null,{"$f":"IF(ISBLANK(VLOOKUP(E2874,INVENTORYDATA,12,FALSE)),\"\",VLOOKUP(E2874,INVENTORYDATA,12,FALSE))","v":{"$error":"#N/A"}},{"$nulls":3},"HDD Serial No.",null,{"$f":"IF(ISBLANK(VLOOKUP(K2874,INVENTORYDATA,12,FALSE)),\"\",VLOOKUP(K2874,INVENTORYDATA,12,FALSE))","v":{"$error":"#N/A"}}]
[]
["Tested for key functions,R2/Ready for Resale",{"$nulls":5},"Tested for key functions,R2/Ready for Resale"]
["BIOS Lock","Caddy","Optical","WebCam","Battery",null,"BIOS Lock","Caddy","Optical","WebCam","Battery"]
[null,null,{"$f":"VLOOKUP(E2874,INVENTORY!$A$2:$N$144,7,FALSE)","v":{"$error":"#N/A"}},{"$f":"VLOOKUP(E2874,INVENTORY!$A$2:$N$144,8,FALSE)","v":{"$error":"#N/A"}},{"$f":"VLOOKUP(E2874,INVENTORY!$A$2:$N$144,9,FALSE)","v":{"$error":"#N/A"}},{"$nulls":3},{"$f":"VLOOKUP(K2874,INVENTORY!$A$2:$N$144,7,FALSE)","v":{"$error":"#N/A"}},{"$f":"VLOOKUP(K2874,INVENTORY!$A$2:$N$144,8,FALSE)","v":{"$error":"#N/A"}},{"$f":"VLOOKUP(K2874,INVENTORY!$A$2:$N$144,9,FALSE)","v":{"$error":"#N/A"}}]
[]
["CPU Cosmetics Defects:",null,{"$f":"\"Function Code: \"&VLOOKUP(E2874,INVENTORY!$A$2:$Q$144,14,FALSE)","v":{"$error":"#N/A"}},{"$nulls":3},"CPU Cosmetics Defects:",null,{"$f":"\"Function Code: \"&VLOOKUP(K2874,INVENTORY!$A$2:$Q$144,14,FALSE)","v":{"$error":"#N/A"}}]
[]
[null,null,{"$f":"\"Cosmetic Code: \"&VLOOKUP(E2874,INVENTORY!$A$2:$Q$144,15,FALSE)","v":{"$error":"#N/A"}},{"$nulls":5},{"$f":"\"Cosmetic Code: \"&VLOOKUP(K2874,INVENTORY!$A$2:$Q$144,15,FALSE)","v":{"$error":"#N/A"}}]
[]
["Casing","Plugs/Ports",{"$nulls":4},"Casing","Plugs/Ports"]
["Pass","Pass",{"$nulls":4},"Pass","Pass"]
["Fail","Fail",null,"TRRC#:L.T.R.",null,null,"Fail","Fail",null,"TRRC#:L.T.R."]

{"sheet":"TAGS-BLANK","index":4,"n_rows":57,"n_cols":11,"rows_kept":57,"merged":[[0,0,1,4],[0,6,1,10],[8,0,8,1],[8,6,8,7],[9,0,9,1],[9,6,9,7],[10,0,10,1],[10,6,10,7],[11,0,11,1],[11,6,11,7],[12,0,12,1],[12,6,12,7],[13,0,13,1],[13,6,13,7],[14,0,14,1],[14,6,14,7],[15,0,15,1],[15,6,15,7],[16,0,16,1],[16,6,16,7],[17,0,17,4],[17,6,17,10],[21,2,21,4],[21,8,21,10],[22,2,22,4],[22,8,22,10],[23,2,23,4],[23,8,23,10],[27,3,27,4],[27,9,27,10],[29,0,30,4],[29,6,30,10],[37,0,37,1],[37,6,37,7],[38,0,38,1],[38,6,38,7],[39,0,39,1],[39,6,39,7],[40,0,40,1],[40,6,40,7],[41,0,41,1],[41,6,41,7],[42,0,42,1],[42,6,42,7],[43,0,43,1],[43,6,43,7],[44,0,44,1],[44,6,44,7],[45,0,45,1],[45,6,45,7],[46,0,46,4],[46,6,46,10],[50,2,50,4],[50,8,50,10],[51,2,51,4],[51,8,51,10],[52,2,52,4],[52,8,52,10],[56,3,56,4],[56,9,56,10]]}
["LAPTOP TESTING RECORD",{"$nulls":5},"LAPTOP TESTING RECORD"]
[]
[{"$nulls":3},"ITEM #",{"$nulls":5},"ITEM #"]
["Tester: ","RR","Date:",{"$nulls":3},"Tester: ","RR","Date:"]
["Type: ",null,"SN:",{"$nulls":3},"Type: ",null,"SN:"]
[{"$f":"\"Make: \"","v":"Make: "},null,{"$f":"\"Model: \"","v":"Model: "},{"$nulls":3},{"$f":"\"Make: \"","v":"Make: "},null,{"$f":"\"Model: \"","v":"Model: "}]
[{"$f":"\"CPU/Speed: \"","v":"CPU/Speed: "},null,null,{"$f":"\"Memory: \"","v":"Memory: "},null,null,{"$f":"\"CPU/Speed: \"","v":"CPU/Speed: "},null,null,{"$f":"\"Memory: \"","v":"Memory: "}]
[]
["Key Function",null,"Pass","Fail ","Comments",null,"Key Function",null,"Pass","Fail ","Comments"]
["Hard Drive Removed",null,"X",{"$nulls":3},"Hard Drive Removed",null,"X"]
["Install Memory",null,"X",{"$nulls":3},"Install Memory",null,"X"]
["Power ON",null,"X",{"$nulls":3},"Power ON",null,"X"]
["Record BIOS info",null,"X",{"$nulls":3},"Record BIOS info",null,"X"]
["Check Optical Drive",null,"X",{"$nulls":3},"Check Optical Drive",null,"X"]
["Power Off",null,"X",{"$nulls":3},"Power Off",null,"X"]
[]
[]
["Tested for key functions,R2/Ready for Resale",{"$nulls":5},"Tested for key functions,R2/Ready for Resale"]
["BIOS Lock","Caddy","Optical","WedCam","Battery",null,"BIOS Lock","Caddy","Optical","WedCam","Battery"]
[]
[]
["CPU Cosmetics Defects:",null,"Function Code: ",{"$nulls":3},"CPU Cosmetics Defects:",null,"Function Code: "]
[]
[null,null,"Cosmetic Code:",{"$nulls":5},"Cosmetic Code:"]
[]
["Casing","Plugs/Ports",{"$nulls":4},"Casing","Plugs/Ports"]
["Pass","Pass",{"$nulls":4},"Pass","Pass"]
["Fail","Fail",null,"QP-TRRC-0019-01",null,null,"Fail","Fail",null,"QP-TRRC-0019-01"]
[]
["LAPTOP TESTING RECORD",{"$nulls":5},"LAPTOP TESTING RECORD"]
[]
[{"$nulls":3},"ITEM #",{"$nulls":5},"ITEM #"]
["Tester: ","RR","Date:",{"$nulls":3},"Tester: ","RR","Date:"]
["Type: ",null,"SN:",{"$nulls":3},"Type: ",null,"SN:"]
[{"$f":"\"Make: \"","v":"Make: "},null,{"$f":"\"Model: \"","v":"Model: "},{"$nulls":3},{"$f":"\"Make: \"","v":"Make: "},null,{"$f":"\"Model: \"","v":"Model: "}]
[{"$f":"\"CPU/Speed: \"","v":"CPU/Speed: "},null,null,{"$f":"\"Memory: \"","v":"Memory: "},null,null,{"$f":"\"CPU/Speed: \"","v":"CPU/Speed: "},null,null,{"$f":"\"Memory: \"","v":"Memory: "}]
[]
["Key Function",null,"Pass","Fail ","Comments",null,"Key Function",null,"Pass","Fail ","Comments"]
["Hard Drive Removed",null,"X",{"$nulls":3},"Hard Drive Removed",null,"X"]
["Install Memory",null,"X",{"$nulls":3},"Install Memory",null,"X"]
["Power ON",null,"X",{"$nulls":3},"Power ON",null,"X"]
["Record BIOS info",null,"X",{"$nulls":3},"Record BIOS info",null,"X"]
["Check Optical Drive",null,"X",{"$nulls":3},"Check Optical Drive",null,"X"]
["Power Off",null,"X",{"$nulls":3},"Power Off",null,"X"]
[]
[]
["Tested for key functions,R2/Ready for Resale",{"$nulls":5},"Tested for key functions,R2/Ready for Resale"]
["BIOS Lock","Caddy","Optical","WedCam","Battery",null,"BIOS Lock","Caddy","Optical","WedCam","Battery"]
[]
[]
["CPU Cosmetics Defects:",null,"Function Code: ",{"$nulls":3},"CPU Cosmetics Defects:",null,"Function Code: "]
[]
[null,null,"Cosmetic Code:",{"$nulls":5},"Cosmetic Code:"]
[]
["Casing","Plugs/Ports",{"$nulls":4},"Casing","Plugs/Ports"]
["Pass","Pass",{"$nulls":4},"Pass","Pass"]
["Fail","Fail",null,"QP-TRRC-0019-01",null,null,"Fail","Fail",null,"QP-TRRC-0019-01"]

{"sheet":"Data-PULLDOWNS","index":5,"n_rows":22,"n_cols":13,"rows_kept":22}
["First Tag #",1]
["Number of PCs",{"$f":"MAX(INVENTORY!A2:A373)","v":51}]
["Number of Pages",{"$f":"ROUNDUP(B2/4,0)","v":13}]
[]
["To print a specific range of tags, enter the first tag number in \"First Tag #\" and the number of"]
["pages required  (# of tags /4) in \"Number of Pages\""]
["CAUTION: This will overwrite the automatic calculation!"]
[]
[]
[]
["MAKE","MODEL","TYPE PROC.","MEMORY","OPTICAL","WEBCAM","BATTERY","FUNC. CODE","COSMETIC CODE","PRE-SANITIZATION","NON-DATA","HDD SIZE","TYPE"]
["DELL","LATITUDE ","I3-","0G","YES","YES","YES","F1","C2","ENCD","ND","256G","NVMe M.2 - 22MM - 30MM"]
["HP","ELITEBOOK ","I5-","2G","NO","NO","NO","F2","C3",null,null,"512G","NVMe M.2 - 22MM - 42MM"]
["LENOVO","PROBOOK ","I7-","4G","N/A","N/A","N/A","F3","C4",null,null,"1TB","NVMe M.2 - 22MM - 80MM"]
["MSI","PRECISION ","X-","8G",{"$nulls":3},"F4","C5",null,null,"2TB","NVMe M.2 - 22MM - 110MM"]
[null,"XPS","AMD-","16G",{"$nulls":7},"3TB","SATA M.2 - 22MM - 30MM"]
[null,"ZBOOK","I9-","32G",{"$nulls":7},"4TB","SATA M.2 - 22MM - 42MM"]
[null,"NOTEBOOK"]
[null,"IDEAPAD"]
[null,"THINKPAD"]
[null,"TOUGHBOOK"]
[null,"CF-"]