{"text_format":"3","workbook":"xlsx","n_sheets":6,"sheets":["INVENTORY","QA SAMPLE SIZE SHEET","INVENTORY LOG SHEET","TAGS","TAGS-BLANK","Data-PULLDOWNS"],"not_rendered":{"images":1,"external_links":2,"defined_names":22,"comments":2},"read":"whole","date_system":"1900"}

{"sheet":"INVENTORY","index":0,"n_rows":16,"n_cols":17,"rows_kept":16}
["#","MAKE","MODEL","PROC.","SPEED","MEM.","OPTICAL","WEBCAM","BATT.","LAPTOP SERIAL #","SN INPUT","HDD SERIAL #","HDD SIZE","FUNC. CODE","COS. CODE","PRE. SAN.","NON-DATA"]
[1,"LENOVO","THINKPAD L13 YOGA G3","RYZEN7 PRO 5875U",{"v":2,"d":"2.00"},"16G",{"$f":"IF($B2<>\"\",\"NO\",\"\")","v":"NO"},{"$f":"IF($B2<>\"\",\"YES\",\"\")","v":"YES"},"YES",{"$f":"UPPER(K2)","v":"PW055EYX"},"PW055EYX","sn9AN86841150B51Y","512G",{"$f":"IF($B2<>\"\",\"F3\",\"\")","v":"F3"},{"$f":"IF($B2<>\"\",\"C5\",\"\")","v":"C5"},{"$f":"IF($B2<>\"\",\"ENCD\",\"\")","v":"ENCD"},{"$f":"IF($B2<>\"\",\"ND\",\"\")","v":"ND"}]
[{"$f":"IF(B3=\"\",\"\",A2+1)","v":2},"LENOVO","THINKPAD L13 YOGA G3","RYZEN7 PRO 5875U",{"v":2,"d":"2.00"},"16G","NO","YES","YES","PW055EZY","PW055EZY","TW07YGY09DH0002J00XM","512G","F3","C5","ENCD","ND"]
[{"$f":"IF(B4=\"\",\"\",A3+1)","v":3},"LENOVO","THINKPAD L13 YOGA G3","RYZEN7 PRO 5875U",{"v":2,"d":"2.00"},"16G","NO","YES","YES","PW058CLB","PW058CLB","SN9AN90191030B65H","512G","F3","C5","ENCD","ND"]
[4,"LENOVO","THINKPAD L13 YOGA G3","RYZEN7 PRO 5875U",{"v":2,"d":"2.00"},"16G","NO","YES","YES","PW058CLE","PW058CLE","tw07YGY09DH0002O02CM","512G","F3","C5","ENCD","ND"]
[5,"LENOVO","THINKPAD L13 YOGA G3","RYZEN7 PRO 5875U",{"v":2,"d":"2.00"},"16G","NO","YES","YES","PW058CLS","PW058CLS","sn9AN82571020AU28","512G","F3","C5","ENCD","ND"]
[6,"LENOVO","THINKPAD L13 YOGA G3","RYZEN7 PRO 5875U",{"v":2,"d":"2.00"},"16G","NO","YES","YES","PW05HGKX","PW05HGKX","z9FPC6EUPTML","512G","F3","C5","ENCD","ND"]
[7,"LENOVO","THINKPAD L13 YOGA G3","RYZEN7 PRO 5875U",{"v":2,"d":"2.00"},"16G","NO","YES","YES","PW05HHTW","PW05HHTW","605PE0DEPTML","512G","F3","C5","ENCD","ND"]
[8,"LENOVO","THINKPAD L13 YOGA G3","RYZEN7 PRO 5875U",{"v":2,"d":"2.00"},"16G","NO","YES","YES","PW05HHVS","PW05HHVS","tw07YGY09DH0002J00WY","512G","F3","C5","ENCD","ND"]
[9,"LENOVO","THINKPAD L13 YOGA G3","RYZEN7 PRO 5875U",{"v":2,"d":"2.00"},"16G","NO","YES","YES","PW05HYWA","PW05HYWA","SN9BN44181010B74R","512G","F3","C5","ENCD","ND"]
[10,"LENOVO","THINKPAD L13 YOGA G3","RYZEN7 PRO 5875U",{"v":2,"d":"2.00"},"16G","NO","YES","YES","PW05RRYA","PW05RRYA","sn9AN82631130B445","512G","F3","C5","ENCD","ND"]
[11,"LENOVO","THINKPAD L13 YOGA G3","RYZEN7 PRO 5875U",{"v":2,"d":"2.00"},"16G","NO","YES","YES","PW05RTH4","PW05RTH4","TW07YGY09DH0002O02EG","512G","F3","C5","ENCD","ND"]
[12,"LENOVO","THINKPAD L13 YOGA G3","RYZEN7 PRO 5875U",{"v":2,"d":"2.00"},"16G","NO","YES","YES","PW05SGT5","PW05SGT5","606PG96IPTML","512G","F3","C5","ENCD","ND"]
[13,"LENOVO","THINKPAD L13 YOGA G3","RYZEN7 PRO 5875U",{"v":2,"d":"2.00"},"16G","NO","YES","YES","PW05SJHK","PW05SJHK","sd01N670910301U0X","512G","F3","C5","ENCD","ND"]
[14,"LENOVO","THINKPAD L13 YOGA G3","RYZEN7 PRO 5875U",{"v":2,"d":"2.00"},"16G","NO","YES","YES","PW05SJHS","PW05SJHS","sn9AN79251110AU6C","512G","F3","C5","ENCD","ND"]
[15,"LENOVO","THINKPAD L13 YOGA G3","RYZEN7 PRO 5875U",{"v":2,"d":"2.00"},"16G","NO","YES","YES","PW05TP9N","PW05TP9N","SN9AN74551100AU06","512G","F3","C5","ENCD","ND"]

{"sheet":"QA SAMPLE SIZE SHEET","index":1,"n_rows":27,"n_cols":7,"rows_kept":27,"merged":[[0,0,0,6],[1,0,1,6],[2,1,2,2],[3,0,3,6],[4,1,4,3],[5,1,5,3],[6,1,6,3],[7,1,7,3],[8,1,8,3],[9,1,9,3],[10,1,10,3],[11,1,11,3],[12,1,12,3],[13,1,13,3],[14,1,14,3],[16,0,16,6],[17,0,21,6],[24,0,24,6],[25,0,25,6],[26,0,30,6]]}
[{"$f":"NOW()","v":"2025-12-15T11:00:59.760"}]
["DEPARTMENT: LAPTOPS"]
["LOT# ","L-42"]
["\nNOTE: A sample size test of any material that is purchased as tested or data wiped will be conducted on\nindividual shipments.  The sample size may vary between 1% and 5% based on results on initial sampling.  \nIf testing Failure Rate of initial sampling is greater than 1%, well will continue to test to 5% of the LOT. If the Failure Rate of initial sampling is greater than 5% the entire Lot will be re-tested. If the test results are 1% or Less, the Lot can be processed for Bid. \n\nThe Quality Assurance Clerk will conduct a Full Function Test along with a Visual Inspection on 5 or more radom items within the LOT. Record the results below."]
["#","DISCRIPTION OF PRODUCT",null,null,"SERIAL NUMBER\nOR SKU","FUNCTION &\n COSMETIC CODE","PASS - FAIL"]
[1,{"$f":"TRANSPOSE(INVENTORY!C2)","v":"THINKPAD L13 YOGA G3"},null,null,{"$f":"TRANSPOSE(INVENTORY!J2)","v":"PW055EYX"},"F3-C5","PASS"]
[2,{"$f":"TRANSPOSE(INVENTORY!C3)","v":"THINKPAD L13 YOGA G3"},null,null,{"$f":"TRANSPOSE(INVENTORY!J3)","v":"PW055EZY"},"F3-C5","PASS"]
[3,{"$f":"TRANSPOSE(INVENTORY!C4)","v":"THINKPAD L13 YOGA G3"},null,null,{"$f":"TRANSPOSE(INVENTORY!J4)","v":"PW058CLB"},"F3-C5","PASS"]
[4,{"$f":"TRANSPOSE(INVENTORY!C5)","v":"THINKPAD L13 YOGA G3"},null,null,{"$f":"TRANSPOSE(INVENTORY!J5)","v":"PW058CLE"},"F3-C5","PASS"]
[5,{"$f":"TRANSPOSE(INVENTORY!C6)","v":"THINKPAD L13 YOGA G3"},null,null,{"$f":"TRANSPOSE(INVENTORY!J6)","v":"PW058CLS"},"F3-C5","PASS"]
[6]
[7]
[8]
[9]
[10]
[]
["PASS READY FOR BID"]
["_____________________________________________________\nQUALITY ASSURANCE CLERK SIGNATURE"]
{"$rows_empty":7}
["FAIL REWORK ENTIRE LOT"]
["_____________________________________________________\nQUALITY ASSURANCE CLERK SIGNATURE"]

{"sheet":"INVENTORY LOG SHEET","index":2,"n_rows":24,"n_cols":9,"rows_kept":24,"merged":[[0,0,0,10],[1,0,1,10],[2,1,2,10],[3,0,7,0],[3,1,3,5],[3,6,3,10],[4,1,4,5],[4,6,4,10],[5,1,5,5],[5,6,5,10],[6,1,6,5],[6,6,6,10],[7,1,7,10],[8,0,8,10],[9,0,14,0],[9,1,9,10],[10,1,10,5],[10,6,10,10],[11,1,11,5],[11,6,11,10],[12,1,12,5],[12,6,12,10],[13,3,13,5],[13,8,13,10],[14,1,14,10],[15,0,15,10],[16,0,19,0],[16,1,16,10],[17,2,17,10],[18,2,18,10],[19,1,19,10],[20,0,20,10],[21,0,23,0],[21,1,21,10],[22,1,22,10],[23,1,23,10]]}
["INVENTORY \nLOG SHEET "]
[]
[null,"DEPARTMENT CHECK LIST"]
["DEPT","DEPARTMENT:",{"$nulls":4},"LAPTOPS"]
[null,"DESCRIPTION:",{"$nulls":4},"LENOVO AMD RYZEN"]
[null,"COUNT:",{"$nulls":4},15]
[null,"LOT#",{"$nulls":4},"L-42"]
[null,"DEPARTMENT SIGNATURE:_______________________DATE:______________"]
[]
["FORK-LIFT","FORK-LIFT CHECK LIST"]
[null,"GROSS WEIGHT:"]
[null,"TARE WEIGHT:"]
[null,"NET WEIGHT:"]
[null,null,"o","WEIGHED ON SCALE #1",{"$nulls":3},"X","WEIGHED ON SCALE #2"]
[null,"FORK-LIFT DRIVER SIGNATURE:____________________DATE:______________"]
[]
["QA CLERK","QUALITY ASSURANCE CLERK CHECK LIST"]
[null,"o","Inspect the integrity of the shipment, Sign the Tare Sheet and place in Finished Product."]
[null,"o","Attach 5 Tare Sheets - 1 on each side of the Gaylord/Pallet including the Top of the shipment."]
[null,"QA SEAL_______________________INSPECTION DATE:___________________"]
[]
["CLERK","CLERK INVENTORY CHECK LIST"]
[null,"PRODUCT ENTERED INTO INVENTORY"]
[null,"FRONT OFFICE CLERK SIGNATURE:_________________DATE:______________"]

{"sheet":"TAGS","index":3,"n_rows":2899,"n_cols":11,"rows_kept":2899,"merged":[[539,0,539,4],[539,6,539,10],[543,2,543,4],[543,8,543,10],[544,2,544,4],[544,8,544,10],[545,2,545,4],[545,8,545,10],[551,0,552,4],[551,6,552,10],[559,0,559,1],[559,6,559,7],[560,0,560,1],[560,6,560,7],[561,0,561,1],[561,6,561,7],[562,0,562,1],[562,6,562,7],[563,0,563,1],[563,6,563,7],[564,0,564,1],[564,6,564,7],[565,0,565,1],[565,6,565,7],[566,0,566,1],[566,2,566,4],[566,6,566,7],[566,8,566,10],[567,0,567,1],[567,6,567,7],[568,0,568,4],[568,6,568,10],[572,2,572,4],[572,8,572,10],[573,2,573,4],[573,8,573,10],[574,2,574,4],[574,8,574,10],[578,3,578,4],[578,9,578,10],[580,0,581,4],[580,6,581,10],[588,0,588,1],[588,6,588,7],[589,0,589,1],[589,6,589,7],[590,0,590,1],[590,6,590,7],[591,0,591,1],[591,6,591,7],[592,0,592,1],[592,6,592,7],[593,0,593,1],[593,6,593,7],[594,0,594,1],[594,6,594,7],[595,0,595,1],[595,2,595,4],[595,6,595,7],[595,8,595,10],[596,0,596,1],[596,6,596,7],[597,0,597,4],[597,6,597,10],[601,2,601,4],[601,8,601,10],[602,2,602,4],[602,8,602,10],[603,2,603,4],[603,8,603,10],[607,3,607,4],[607,9,607,10],[609,0,610,4],[609,6,610,10],[617,0,617,1],[617,6,617,7],[618,0,618,1],[618,6,618,7],[619,0,619,1],[619,6,619,7],[620,0,620,1],[620,6,620,7],[621,0,621,1],[621,6,621,7],[622,0,622,1],[622,6,622,7],[623,0,623,1],[623,6,623,7],[624,0,624,1],[624,2,624,4],[624,6,624,7],[624,8,624,10],[625,0,625,1],[625,6,625,7],[626,0,626,4],[626,6,626,10],[630,2,630,4],[630,8,630,10],[631,2,631,4],[631,8,631,10],[632,2,632,4],[632,8,632,10],[636,3,636,4],[636,9,636,10],[638,0,639,4],[638,6,639,10],[646,0,646,1],[646,6,646,7],[647,0,647,1],[647,6,647,7],[648,0,648,1],[648,6,648,7],[649,0,649,1],[649,6,649,7],[650,0,650,1],[650,6,650,7],[651,0,651,1],[651,6,651,7],[652,0,652,1],[652,6,652,7],[653,0,653,1],[653,2,653,4],[653,6,653,7],[653,8,653,10],[654,0,654,1],[654,6,654,7],[655,0,655,4],[655,6,655,10],[659,2,659,4],[659,8,659,10],[660,2,660,4],[660,8,660,10],[661,2,661,4],[661,8,661,10],[665,3,665,4],[665,9,665,10],[667,0,668,4],[667,6,668,10],[675,0,675,1],[675,6,675,7],[676,0,676,1],[676,6,676,7],[677,0,677,1],[677,6,677,7],[678,0,678,1],[678,6,678,7],[679,0,679,1],[679,6,679,7],[680,0,680,1],[680,6,680,7],[681,0,681,1],[681,6,681,7],[682,0,682,1],[682,2,682,4],[682,6,682,7],[682,8,682,10],[683,0,683,1],[683,6,683,7],[684,0,684,4],[684,6,684,10],[688,2,688,4],[688,8,688,10],[689,2,689,4],[689,8,689,10],[690,2,690,4],[690,8,690,10],[694,3,694,4],[694,9,694,10],[696,0,697,4],[696,6,697,10],[704,0,704,1],[704,6,704,7],[705,0,705,1],[705,6,705,7],[706,0,706,1],[706,6,706,7],[707,0,707,1],[707,6,707,7],[708,0,708,1],[708,6,708,7],[709,0,709,1],[709,6,709,7],[710,0,710,1],[710,6,710,7],[711,0,711,1],[711,2,711,4],[711,6,711,7],[711,8,711,10],[712,0,712,1],[712,6,712,7],[713,0,713,4],[713,6,713,10],[717,2,717,4],[717,8,717,10],[718,2,718,4],[718,8,718,10],[719,2,719,4],[719,8,719,10],[723,3,723,4],[723,9,723,10],[725,0,726,4],[725,6,726,10],[733,0,733,1],[733,6,733,7],[734,0,734,1],[734,6,734,7],[735,0,735,1],[735,6,735,7],[736,0,736,1],[736,6,736,7],[737,0,737,1],[737,6,737,7],[738,0,738,1],[738,6,738,7],[739,0,739,1],[739,6,739,7],[740,0,740,1],[740,2,740,4],[740,6,740,7],[740,8,740,10],[741,0,741,1],[741,6,741,7],[742,0,742,4],[742,6,742,10],[746,2,746,4],[746,8,746,10],[747,2,747,4],[747,8,747,10],[748,2,748,4],[748,8,748,10],[752,3,752,4],[752,9,752,10],[754,0,755,4],[754,6,755,10],[762,0,762,1],[762,6,762,7],[763,0,763,1],[763,6,763,7],[764,0,764,1],[764,6,764,7],[765,0,765,1],[765,6,765,7],[766,0,766,1],[766,6,766,7],[767,0,767,1],[767,6,767,7],[768,0,768,1],[768,6,768,7],[769,0,769,1],[769,2,769,4],[769,6,769,7],[769,8,769,10],[770,0,770,1],[770,6,770,7],[771,0,771,4],[771,6,771,10],[775,2,775,4],[775,8,775,10],[776,2,776,4],[776,8,776,10],[777,2,777,4],[777,8,777,10],[781,3,781,4],[781,9,781,10],[783,0,784,4],[783,6,784,10],[791,0,791,1],[791,6,791,7],[792,0,792,1],[792,6,792,7],[793,0,793,1],[793,6,793,7],[794,0,794,1],[794,6,794,7],[795,0,795,1],[795,6,795,7],[796,0,796,1],[796,6,796,7],[797,0,797,1],[797,6,797,7],[798,0,798,1],[798,2,798,4],[798,6,798,7],[798,8,798,10],[799,0,799,1],[799,6,799,7],[800,0,800,4],[800,6,800,10],[804,2,804,4],[804,8,804,10],[805,2,805,4],[805,8,805,10],[806,2,806,4],[806,8,806,10],[810,3,810,4],[810,9,810,10],[812,0,813,4],[812,6,813,10],[820,0,820,1],[820,6,820,7],[821,0,821,1],[821,6,821,7],[822,0,822,1],[822,6,822,7],[823,0,823,1],[823,6,823,7],[824,0,824,1],[824,6,824,7],[825,0,825,1],[825,6,825,7],[826,0,826,1],[826,6,826,7],[827,0,827,1],[827,2,827,4],[827,6,827,7],[827,8,827,10],[828,0,828,1],[828,6,828,7],[829,0,829,4],[829,6,829,10],[833,2,833,4],[833,8,833,10],[834,2,834,4],[834,8,834,10],[835,2,835,4],[835,8,835,10],[839,3,839,4],[839,9,839,10],[841,0,842,4],[841,6,842,10],[849,0,849,1],[849,6,849,7],[850,0,850,1],[850,6,850,7],[851,0,851,1],[851,6,851,7],[852,0,852,1],[852,6,852,7],[853,0,853,1],[853,6,853,7],[854,0,854,1],[854,6,854,7],[855,0,855,1],[855,6,855,7],[856,0,856,1],[856,2,856,4],[856,6,856,7],[856,8,856,10],[857,0,857,1],[857,6,857,7],[858,0,858,4],[858,6,858,10],[862,2,862,4],[862,8,862,10],[863,2,863,4],[863,8,863,10],[864,2,864,4],[864,8,864,10],[868,3,868,4],[868,9,868,10],[870,0,871,4],[870,6,871,10],[878,0,878,1],[878,6,878,7],[879,0,879,1],[879,6,879,7],[880,0,880,1],[880,6,880,7],[881,0,881,1],[881,6,881,7],[882,0,882,1],[882,6,882,7],[883,0,883,1],[883,6,883,7],[884,0,884,1],[884,6,884,7],[885,0,885,1],[885,2,885,4],[885,6,885,7],[885,8,885,10],[886,0,886,1],[886,6,886,7],[887,0,887,4],[887,6,887,10],[891,2,891,4],[891,8,891,10],[892,2,892,4],[892,8,892,10],[893,2,893,4],[893,8,893,10],[897,3,897,4],[897,9,897,10],[899,0,900,4],[899,6,900,10],[907,0,907,1],[907,6,907,7],[908,0,908,1],[908,6,908,7],[909,0,909,1],[909,6,909,7],[910,0,910,1],[910,6,910,7],[911,0,911,1],[911,6,911,7],[912,0,912,1],[912,6,912,7],[913,0,913,1],[913,6,913,7],[914,0,914,1],[914,2,914,4],[914,6,914,7],[914,8,914,10],[915,0,915,1],[915,6,915,7],[916,0,916,4],[916,6,916,10],[920,2,920,4],[920,8,920,10],[921,2,921,4],[921,8,921,10],[922,2,922,4],[922,8,922,10],[926,3,926,4],[926,9,926,10],[928,0,929,4],[928,6,929,10],[936,0,936,1],[936,6,936,7],[937,0,937,1],[937,6,937,7],[938,0,938,1],[938,6,938,7],[939,0,939,1],[939,6,939,7],[940,0,940,1],[940,6,940,7],[941,0,941,1],[941,6,941,7],[942,0,942,1],[942,6,942,7],[943,0,943,1],[943,2,943,4],[943,6,943,7],[943,8,943,10],[944,0,944,1],[944,6,944,7],[945,0,945,4],[945,6,945,10],[949,2,949,4],[949,8,949,10],[950,2,950,4],[950,8,950,10],[951,2,951,4],[951,8,951,10],[955,3,955,4],[955,9,955,10],[957,0,958,4],[957,6,958,10],[965,0,965,1],[965,6,965,7],[966,0,966,1],[966,6,966,7],[967,0,967,1],[967,6,967,7],[968,0,968,1],[968,6,968,7],[969,0,969,1],[969,6,969,7],[970,0,970,1],[970,6,970,7],[971,0,971,1],[971,6,971,7],[972,0,972,1],[972,2,972,4],[972,6,972,7],[972,8,972,10],[973,0,973,1],[973,6,973,7],[974,0,974,4],[974,6,974,10],[978,2,978,4],[978,8,978,10],[979,2,979,4],[979,8,979,10],[980,2,980,4],[980,8,980,10],[984,3,984,4],[984,9,984,10],[986,0,987,4],[986,6,987,10],[994,0,994,1],[994,6,994,7],[995,0,995,1],[995,6,995,7],[996,0,996,1],[996,6,996,7],[997,0,997,1],[997,6,997,7],[998,0,998,1],[998,6,998,7],[999,0,999,1],[999,6,999,7],[1000,0,1000,1],[1000,6,1000,7],[1001,0,1001,1],[1001,2,1001,4],[1001,6,1001,7],[1001,8,1001,10],[1002,0,1002,1],[1002,6,1002,7],[1003,0,1003,4],[1003,6,1003,10],[1007,2,1007,4],[1007,8,1007,10],[1008,2,1008,4],[1008,8,1008,10],[1009,2,1009,4],[1009,8,1009,10],[1013,3,1013,4],[1013,9,1013,10],[1015,0,1016,4],[1015,6,1016,10],[1023,0,1023,1],[1023,6,1023,7],[1024,0,1024,1],[1024,6,1024,7],[1025,0,1025,1],[1025,6,1025,7],[1026,0,1026,1],[1026,6,1026,7],[1027,0,1027,1],[1027,6,1027,7],[1028,0,1028,1],[1028,6,1028,7],[1029,0,1029,1],[1029,6,1029,7],[1030,0,1030,1],[1030,2,1030,4],[1030,6,1030,7],[1030,8,1030,10],[1031,0,1031,1],[1031,6,1031,7],[1032,0,1032,4],[1032,6,1032,10],[1036,2,1036,4],[1036,8,1036,10],[1037,2,1037,4],[1037,8,1037,10],[1038,2,1038,4],[1038,8,1038,10],[1042,3,1042,4],[1042,9,1042,10],[1044,0,1045,4],[1044,6,1045,10],[1052,0,1052,1],[1052,6,1052,7],[1053,0,1053,1],[1053,6,1053,7],[1054,0,1054,1],[1054,6,1054,7],[1055,0,1055,1],[1055,6,1055,7],[1056,0,1056,1],[1056,6,1056,7],[1057,0,1057,1],[1057,6,1057,7],[1058,0,1058,1],[1058,6,1058,7],[1059,0,1059,1],[1059,2,1059,4],[1059,6,1059,7],[1059,8,1059,10],[1060,0,1060,1],[1060,6,1060,7],[1061,0,1061,4],[1061,6,1061,10],[1065,2,1065,4],[1065,8,1065,10],[1066,2,1066,4],[1066,8,1066,10],[1067,2,1067,4],[1067,8,1067,10],[1071,3,1071,4],[1071,9,1071,10],[1073,0,1074,4],[1073,6,1074,10],[1081,0,1081,1],[1081,6,1081,7],[1082,0,1082,1],[1082,6,1082,7],[1083,0,1083,1],[1083,6,1083,7],[1084,0,1084,1],[1084,6,1084,7],[1085,0,1085,1],[1085,6,1085,7],[1086,0,1086,1],[1086,6,1086,7],[1087,0,1087,1],[1087,6,1087,7],[1088,0,1088,1],[1088,2,1088,4],[1088,6,1088,7],[1088,8,1088,10],[1089,0,1089,1],[1089,6,1089,7],[1090,0,1090,4],[1090,6,1090,10],[1094,2,1094,4],[1094,8,1094,10],[1095,2,1095,4],[1095,8,1095,10],[1096,2,1096,4],[1096,8,1096,10],[1100,3,1100,4],[1100,9,1100,10],[1102,0,1103,4],[1102,6,1103,10],[1110,0,1110,1],[1110,6,1110,7],[1111,0,1111,1],[1111,6,1111,7],[1112,0,1112,1],[1112,6,1112,7],[1113,0,1113,1],[1113,6,1113,7],[1114,0,1114,1],[1114,6,1114,7],[1115,0,1115,1],[1115,6,1115,7],[1116,0,1116,1],[1116,6,1116,7],[1117,0,1117,1],[1117,2,1117,4],[1117,6,1117,7],[1117,8,1117,10],[1118,0,1118,1],[1118,6,1118,7],[1119,0,1119,4],[1119,6,1119,10],[1123,2,1123,4],[1123,8,1123,10],[1124,2,1124,4],[1124,8,1124,10],[1125,2,1125,4],[1125,8,1125,10],[1129,3,1129,4],[1129,9,1129,10],[1131,0,1132,4],[1131,6,1132,10],[1139,0,1139,1],[1139,6,1139,7],[1140,0,1140,1],[1140,6,1140,7],[1141,0,1141,1],[1141,6,1141,7],[1142,0,1142,1],[1142,6,1142,7],[1143,0,1143,1],[1143,6,1143,7],[1144,0,1144,1],[1144,6,1144,7],[1145,0,1145,1],[1145,6,1145,7],[1146,0,1146,1],[1146,2,1146,4],[1146,6,1146,7],[1146,8,1146,10],[1147,0,1147,1],[1147,6,1147,7],[1148,0,1148,4],[1148,6,1148,10],[1152,2,1152,4],[1152,8,1152,10],[1153,2,1153,4],[1153,8,1153,10],[1154,2,1154,4],[1154,8,1154,10],[1158,3,1158,4],[1158,9,1158,10],[1160,0,1161,4],[1160,6,1161,10],[1168,0,1168,1],[1168,6,1168,7],[1169,0,1169,1],[1169,6,1169,7],[1170,0,1170,1],[1170,6,1170,7],[1171,0,1171,1],[1171,6,1171,7],[1172,0,1172,1],[1172,6,1172,7],[1173,0,1173,1],[1173,6,1173,7],[1174,0,1174,1],[1174,6,1174,7],[1175,0,1175,1],[1175,2,1175,4],[1175,6,1175,7],[1175,8,1175,10],[1176,0,1176,1],[1176,6,1176,7],[1177,0,1177,4],[1177,6,1177,10],[1181,2,1181,4],[1181,8,1181,10],[1182,2,1182,4],[1182,8,1182,10],[1183,2,1183,4],[1183,8,1183,10],[1187,3,1187,4],[1187,9,1187,10],[1189,0,1190,4],[1189,6,1190,10],[1197,0,1197,1],[1197,6,1197,7],[1198,0,1198,1],[1198,6,1198,7],[1199,0,1199,1],[1199,6,1199,7],[1200,0,1200,1],[1200,6,1200,7],[1201,0,1201,1],[1201,6,1201,7],[1202,0,1202,1],[1202,6,1202,7],[1203,0,1203,1],[1203,6,1203,7],[1204,0,1204,1],[1204,2,1204,4],[1204,6,1204,7],[1204,8,1204,10],[1205,0,1205,1],[1205,6,1205,7],[1206,0,1206,4],[1206,6,1206,10],[1210,2,1210,4],[1210,8,1210,10],[1211,2,1211,4],[1211,8,1211,10],[1212,2,1212,4],[1212,8,1212,10],[1216,3,1216,4],[1216,9,1216,10],[1218,0,1219,4],[1218,6,1219,10],[1226,0,1226,1],[1226,6,1226,7],[1227,0,1227,1],[1227,6,1227,7],[1228,0,1228,1],[1228,6,1228,7],[1229,0,1229,1],[1229,6,1229,7],[1230,0,1230,1],[1230,6,1230,7],[1231,0,1231,1],[1231,6,1231,7],[1232,0,1232,1],[1232,6,1232,7],[1233,0,1233,1],[1233,2,1233,4],[1233,6,1233,7],[1233,8,1233,10],[1234,0,1234,1],[1234,6,1234,7],[1235,0,1235,4],[1235,6,1235,10],[1239,2,1239,4],[1239,8,1239,10],[1240,2,1240,4],[1240,8,1240,10],[1241,2,1241,4],[1241,8,1241,10],[1245,3,1245,4],[1245,9,1245,10],[1247,0,1248,4],[1247,6,1248,10],[1255,0,1255,1],[1255,6,1255,7],[1256,0,1256,1],[1256,6,1256,7],[1257,0,1257,1],[1257,6,1257,7],[1258,0,1258,1],[1258,6,1258,7],[1259,0,1259,1],[1259,6,1259,7],[1260,0,1260,1],[1260,6,1260,7],[1261,0,1261,1],[1261,6,1261,7],[1262,0,1262,1],[1262,2,1262,4],[1262,6,1262,7],[1262,8,1262,10],[1263,0,1263,1],[1263,6,1263,7],[1264,0,1264,4],[1264,6,1264,10],[1268,2,1268,4],[1268,8,1268,10],[1269,2,1269,4],[1269,8,1269,10],[1270,2,1270,4],[1270,8,1270,10],[1274,3,1274,4],[1274,9,1274,10],[1276,0,1277,4],[1276,6,1277,10],[1284,0,1284,1],[1284,6,1284,7],[1285,0,1285,1],[1285,6,1285,7],[1286,0,1286,1],[1286,6,1286,7],[1287,0,1287,1],[1287,6,1287,7],[1288,0,1288,1],[1288,6,1288,7],[1289,0,1289,1],[1289,6,1289,7],[1290,0,1290,1],[1290,6,1290,7],[1291,0,1291,1],[1291,2,1291,4],[1291,6,1291,7],[1291,8,1291,10],[1292,0,1292,1],[1292,6,1292,7],[1293,0,1293,4],[1293,6,1293,10],[1297,2,1297,4],[1297,8,1297,10],[1298,2,1298,4],[1298,8,1298,10],[1299,2,1299,4],[1299,8,1299,10],[1303,3,1303,4],[1303,9,1303,10],[1305,0,1306,4],[1305,6,1306,10],[1313,0,1313,1],[1313,6,1313,7],[1314,0,1314,1],[1314,6,1314,7],[1315,0,1315,1],[1315,6,1315,7],[1316,0,1316,1],[1316,6,1316,7],[1317,0,1317,1],[1317,6,1317,7],[1318,0,1318,1],[1318,6,1318,7],[1319,0,1319,1],[1319,6,1319,7],[1320,0,1320,1],[1320,2,1320,4],[1320,6,1320,7],[1320,8,1320,10],[1321,0,1321,1],[1321,6,1321,7],[1322,0,1322,4],[1322,6,1322,10],[1326,2,1326,4],[1326,8,1326,10],[1327,2,1327,4],[1327,8,1327,10],[1328,2,1328,4],[1328,8,1328,10],[1332,3,1332,4],[1332,9,1332,10],[1334,0,1335,4],[1334,6,1335,10],[1342,0,1342,1],[1342,6,1342,7],[1343,0,1343,1],[1343,6,1343,7],[1344,0,1344,1],[1344,6,1344,7],[1345,0,1345,1],[1345,6,1345,7],[1346,0,1346,1],[1346,6,1346,7],[1347,0,1347,1],[1347,6,1347,7],[1348,0,1348,1],[1348,6,1348,7],[1349,0,1349,1],[1349,2,1349,4],[1349,6,1349,7],[1349,8,1349,10],[1350,0,1350,1],[1350,6,1350,7],[1351,0,1351,4],[1351,6,1351,10],[1355,2,1355,4],[1355,8,1355,10],[1356,2,1356,4],[1356,8,1356,10],[1357,2,1357,4],[1357,8,1357,10],[1361,3,1361,4],[1361,9,1361,10],[1363,0,1364,4],[1363,6,1364,10],[1371,0,1371,1],[1371,6,1371,7],[1372,0,1372,1],[1372,6,1372,7],[1373,0,1373,1],[1373,6,1373,7],[1374,0,1374,1],[1374,6,1374,7],[1375,0,1375,1],[1375,6,1375,7],[1376,0,1376,1],[1376,6,1376,7],[1377,0,1377,1],[1377,6,1377,7],[1378,0,1378,1],[1378,2,1378,4],[1378,6,1378,7],[1378,8,1378,10],[1379,0,1379,1],[1379,6,1379,7],[1380,0,1380,4],[1380,6,1380,10],[1384,2,1384,4],[1384,8,1384,10],[1385,2,1385,4],[1385,8,1385,10],[1386,2,1386,4],[1386,8,1386,10],[1390,3,1390,4],[1390,9,1390,10],[1392,0,1393,4],[1392,6,1393,10],[1400,0,1400,1],[1400,6,1400,7],[1401,0,1401,1],[1401,6,1401,7],[1402,0,1402,1],[1402,6,1402,7],[1403,0,1403,1],[1403,6,1403,7],[1404,0,1404,1],[1404,6,1404,7],[1405,0,1405,1],[1405,6,1405,7],[1406,0,1406,1],[1406,6,1406,7],[1407,0,1407,1],[1407,2,1407,4],[1407,6,1407,7],[1407,8,1407,10],[1408,0,1408,1],[1408,6,1408,7],[1409,0,1409,4],[1409,6,1409,10],[1413,2,1413,4],[1413,8,1413,10],[1414,2,1414,4],[1414,8,1414,10],[1415,2,1415,4],[1415,8,1415,10],[1419,3,1419,4],[1419,9,1419,10],[1421,0,1422,4],[1421,6,1422,10],[1429,0,1429,1],[1429,6,1429,7],[1430,0,1430,1],[1430,6,1430,7],[1431,0,1431,1],[1431,6,1431,7],[1432,0,1432,1],[1432,6,1432,7],[1433,0,1433,1],[1433,6,1433,7],[1434,0,1434,1],[1434,6,1434,7],[1435,0,1435,1],[1435,6,1435,7],[1436,0,1436,1],[1436,2,1436,4],[1436,6,1436,7],[1436,8,1436,10],[1437,0,1437,1],[1437,6,1437,7],[1438,0,1438,4],[1438,6,1438,10],[1442,2,1442,4],[1442,8,1442,10],[1443,2,1443,4],[1443,8,1443,10],[1444,2,1444,4],[1444,8,1444,10],[1448,3,1448,4],[1448,9,1448,10]],"merged_total":3200,"flags":["merged_cut"]}
["LAPTOP TESTING RECORD",{"$nulls":5},"LAPTOP TESTING RECORD"]
[]
[{"$nulls":3},"ITEM #",1,{"$nulls":4},"ITEM #",{"$f":"E3+1","v":2}]
["Tester: ","RR","Date:",{"$f":"NOW()","v":"2025-12-15T11:00:59.760"},null,null,"Tester: ","RR","Date:",{"$f":"NOW()","v":"2025-12-15T11:00:59.760"}]
["Type: ","LAPTOP","SN:",{"$f":"VLOOKUP(E3,INVENTORYDATA,10,FALSE)","v":"PW055EYX"},null,null,"Type: ","LAPTOP","SN:",{"$f":"VLOOKUP(K3,INVENTORYDATA,10,FALSE)","v":"PW055EZY"}]
[{"$f":"\"Make: \"","v":"Make: "},{"$f":"VLOOKUP(E3,INVENTORYDATA,2,FALSE)","v":"LENOVO"},{"$f":"\"Model: \"","v":"Model: "},{"$f":"VLOOKUP(E3,INVENTORYDATA,3,FALSE)","v":"THINKPAD L13 YOGA G3"},null,null,{"$f":"\"Make: \"","v":"Make: "},{"$f":"VLOOKUP(K3,INVENTORYDATA,2,FALSE)","v":"LENOVO"},{"$f":"\"Model: \"","v":"Model: "},{"$f":"VLOOKUP(K3,INVENTORYDATA,3,FALSE)","v":"THINKPAD L13 YOGA G3"}]
[{"$f":"\"CPU/Speed: \"","v":"CPU/Speed: "},{"$f":"VLOOKUP(E3,INVENTORYDATA,4,FALSE)&\" / \"&VLOOKUP(E3,INVENTORYDATA,5,FALSE)&\"GHz\"","v":"RYZEN7 PRO 5875U / 2GHz"},null,{"$f":"\"Memory: \"","v":"Memory: "},{"$f":"VLOOKUP(E3,INVENTORYDATA,6,FALSE)","v":"16G"},null,{"$f":"\"CPU/Speed: \"","v":"CPU/Speed: "},{"$f":"VLOOKUP(K3,INVENTORYDATA,4,FALSE)&\" / \"&VLOOKUP(K3,INVENTORYDATA,5,FALSE)&\"GHz\"","v":"RYZEN7 PRO 5875U / 2GHz"},null,{"$f":"\"Memory: \"","v":"Memory: "},{"$f":"VLOOKUP(K3,INVENTORYDATA,6,FALSE)","v":"16G"}]
[]
["Key Function",null,"Pass","Fail ","Comments",null,"Key Function",null,"Pass","Fail ","Comments"]
["Hard Drive Removed",null,{"$f":"IF(ISBLANK(VLOOKUP(E3,INVENTORYDATA,13,FALSE)),\"X\",\"\")","v":""},null,{"$f":"IF(ISBLANK(VLOOKUP(E3,INVENTORYDATA,13,FALSE)),\"\",VLOOKUP(E3,INVENTORYDATA,13,FALSE))","v":"512G"},null,"Hard Drive Removed",null,{"$f":"IF(ISBLANK(VLOOKUP(K3,INVENTORYDATA,13,FALSE)),\"X\",\"\")","v":""},null,{"$f":"IF(ISBLANK(VLOOKUP(K3,INVENTORYDATA,13,FALSE)),\"\",VLOOKUP(K3,INVENTORYDATA,13,FALSE))","v":"512G"}]
["Install Memory",null,"X",{"$nulls":3},"Install Memory",null,"X"]
["Power ON",null,"X",{"$nulls":3},"Power ON",null,"X"]
["Record BIOS info",null,"X",{"$nulls":3},"Record BIOS info",null,"X"]
["Check Optical Drive",null,{"$f":"IF((VLOOKUP(E3,INVENTORYDATA,7,FALSE))=\"YES\",\"X\",\"\")","v":""},{"$f":"IF((VLOOKUP(E3,INVENTORYDATA,7,FALSE))=\"NO\",\"X\",\"\")","v":"X"},null,null,"Check Optical Drive",null,{"$f":"IF((VLOOKUP(K3,INVENTORYDATA,7,FALSE))=\"YES\",\"X\",\"\")","v":""},{"$f":"IF((VLOOKUP(K3,INVENTORYDATA,7,FALSE))=\"NO\",\"X\",\"\")","v":"X"}]
["Power Off",null,"X",{"$nulls":3},"Power Off",null,"X"]
["HDD Serial No.",null,{"$f":"IF(ISBLANK(VLOOKUP(E3,INVENTORYDATA,12,FALSE)),\"\",VLOOKUP(E3,INVENTORYDATA,12,FALSE))","v":"sn9AN86841150B51Y"},{"$nulls":3},"HDD Serial No.",null,{"$f":"IF(ISBLANK(VLOOKUP(K3,INVENTORYDATA,12,FALSE)),\"\",VLOOKUP(K3,INVENTORYDATA,12,FALSE))","v":"TW07YGY09DH0002J00XM"}]
[]
["Tested for key functions,R2/Ready for Resale",{"$nulls":5},"Tested for key functions,R2/Ready for Resale"]
["BIOS Lock","Caddy","Optical","WebCam","Battery",null,"BIOS Lock","Caddy","Optical","WebCam","Battery"]
[null,null,{"$f":"VLOOKUP(E3,INVENTORYDATA,7,FALSE)","v":"NO"},{"$f":"VLOOKUP(E3,INVENTORYDATA,8,FALSE)","v":"YES"},{"$f":"VLOOKUP(E3,INVENTORYDATA,9,FALSE)","v":"YES"},{"$nulls":3},{"$f":"VLOOKUP(K3,INVENTORY!$A$2:$N$100,7,FALSE)","v":"NO"},{"$f":"VLOOKUP(K3,INVENTORY!$A$2:$N$100,8,FALSE)","v":"YES"},{"$f":"VLOOKUP(K3,INVENTORY!$A$2:$N$100,9,FALSE)","v":"YES"}]
[]
["CPU Cosmetics Defects:",null,{"$f":"\"Function Code: \"&VLOOKUP(E3,INVENTORY!$A$2:$Q$100,14,FALSE)","v":"Function Code: F3"},{"$nulls":3},"CPU Cosmetics Defects:",null,{"$f":"\"Function Code: \"&VLOOKUP(K3,INVENTORY!$A$2:$Q$100,14,FALSE)","v":"Function Code: F3"}]
[]
[null,null,{"$f":"\"Cosmetic Code: \"&VLOOKUP(E3,INVENTORY!$A$2:$Q$100,15,FALSE)","v":"Cosmetic Code: C5"},{"$nulls":5},{"$f":"\"Cosmetic Code: \"&VLOOKUP(K3,INVENTORY!$A$2:$Q$100,15,FALSE)","v":"Cosmetic Code: C5"}]
[]
["Casing","Plugs/Ports",{"$nulls":4},"Casing","Plugs/Ports"]
["Pass","Pass",{"$nulls":4},"Pass","Pass"]
["Fail","Fail",null,"TRRC#:L.T.R.",null,null,"Fail","Fail",null,"TRRC#:L.T.R."]
[]
["LAPTOP TESTING RECORD",{"$nulls":5},"LAPTOP TESTING RECORD"]
[]
[{"$nulls":3},"ITEM #",{"$f":"E3+2","v":3},{"$nulls":4},"ITEM #",{"$f":"K3+2","v":4}]
["Tester: ","RR","Date:",{"$f":"NOW()","v":"2025-12-15T11:00:59.760"},null,null,"Tester: ","RR","Date:",{"$f":"NOW()","v":"2025-12-15T11:00:59.760"}]
["Type: ","LAPTOP","SN:",{"$f":"VLOOKUP(E32,INVENTORYDATA,10,FALSE)","v":"PW058CLB"},null,null,"Type: ","LAPTOP","SN:",{"$f":"VLOOKUP(K32,INVENTORYDATA,10,FALSE)","v":"PW058CLE"}]
[{"$f":"\"Make: \"","v":"Make: "},{"$f":"VLOOKUP(E32,INVENTORYDATA,2,FALSE)","v":"LENOVO"},{"$f":"\"Model: \"","v":"Model: "},{"$f":"VLOOKUP(E32,INVENTORYDATA,3,FALSE)","v":"THINKPAD L13 YOGA G3"},null,null,{"$f":"\"Make: \"","v":"Make: "},{"$f":"VLOOKUP(K32,INVENTORYDATA,2,FALSE)","v":"LENOVO"},{"$f":"\"Model: \"","v":"Model: "},{"$f":"VLOOKUP(K32,INVENTORYDATA,3,FALSE)","v":"THINKPAD L13 YOGA G3"}]
[{"$f":"\"CPU/Speed: \"","v":"CPU/Speed: "},{"$f":"VLOOKUP(E32,INVENTORYDATA,4,FALSE)&\" / \"&VLOOKUP(E32,INVENTORYDATA,5,FALSE)&\"GHz\"","v":"RYZEN7 PRO 5875U / 2GHz"},null,{"$f":"\"Memory: \"","v":"Memory: "},{"$f":"VLOOKUP(E32,INVENTORYDATA,6,FALSE)","v":"16G"},null,{"$f":"\"CPU/Speed: \"","v":"CPU/Speed: "},{"$f":"VLOOKUP(K32,INVENTORYDATA,4,FALSE)&\" / \"&VLOOKUP(K32,INVENTORYDATA,5,FALSE)&\"GHz\"","v":"RYZEN7 PRO 5875U / 2GHz"},null,{"$f":"\"Memory: \"","v":"Memory: "},{"$f":"VLOOKUP(K32,INVENTORYDATA,6,FALSE)","v":"16G"}]
[]
["Key Function",null,"Pass","Fail ","Comments",null,"Key Function",null,"Pass","Fail ","Comments"]
["Hard Drive Removed",null,{"$f":"IF(ISBLANK(VLOOKUP(E32,INVENTORYDATA,13,FALSE)),\"X\",\"\")","v":""},null,{"$f":"IF(ISBLANK(VLOOKUP(E32,INVENTORYDATA,13,FALSE)),\"\",VLOOKUP(E32,INVENTORYDATA,13,FALSE))","v":"512G"},null,"Hard Drive Removed",null,{"$f":"IF(ISBLANK(VLOOKUP(K32,INVENTORYDATA,13,FALSE)),\"X\",\"\")","v":""},null,{"$f":"IF(ISBLANK(VLOOKUP(K32,INVENTORYDATA,13,FALSE)),\"\",VLOOKUP(K32,INVENTORYDATA,13,FALSE))","v":"512G"}]
["Install Memory",null,"X",{"$nulls":3},"Install Memory",null,"X"]
["Power ON",null,"X",{"$nulls":3},"Power ON",null,"X"]
["Record BIOS info",null,"X",{"$nulls":3},"Record BIOS info",null,"X"]
["Check Optical Drive",null,{"$f":"IF((VLOOKUP(E32,INVENTORYDATA,7,FALSE))=\"YES\",\"X\",\"\")","v":""},{"$f":"IF((VLOOKUP(E32,INVENTORYDATA,7,FALSE))=\"NO\",\"X\",\"\")","v":"X"},null,null,"Check Optical Drive",null,{"$f":"IF((VLOOKUP(K32,INVENTORYDATA,7,FALSE))=\"YES\",\"X\",\"\")","v":""},{"$f":"IF((VLOOKUP(K32,INVENTORYDATA,7,FALSE))=\"NO\",\"X\",\"\")","v":"X"}]
["Power Off",null,"X",{"$nulls":3},"Power Off",null,"X"]
["HDD Serial No.",null,{"$f":"IF(ISBLANK(VLOOKUP(E32,INVENTORYDATA,12,FALSE)),\"\",VLOOKUP(E32,INVENTORYDATA,12,FALSE))","v":"SN9AN90191030B65H"},{"$nulls":3},"HDD Serial No.",null,{"$f":"IF(ISBLANK(VLOOKUP(K32,INVENTORYDATA,12,FALSE)),\"\",VLOOKUP(K32,INVENTORYDATA,12,FALSE))","v":"tw07YGY09DH0002O02CM"}]
[]
["Tested for key functions,R2/Ready for Resale",{"$nulls":5},"Tested for key functions,R2/Ready for Resale"]
["BIOS Lock","Caddy","Optical","WebCam","Battery",null,"BIOS Lock","Caddy","Optical","WebCam","Battery"]
[null,null,{"$f":"VLOOKUP(E32,INVENTORY!$A$2:$N$100,7,FALSE)","v":"NO"},{"$f":"VLOOKUP(E32,INVENTORY!$A$2:$N$100,8,FALSE)","v":"YES"},{"$f":"VLOOKUP(E32,INVENTORY!$A$2:$N$100,9,FALSE)","v":"YES"},{"$nulls":3},{"$f":"VLOOKUP(K32,INVENTORY!$A$2:$N$100,7,FALSE)","v":"NO"},{"$f":"VLOOKUP(K32,INVENTORY!$A$2:$N$100,8,FALSE)","v":"YES"},{"$f":"VLOOKUP(K32,INVENTORY!$A$2:$N$100,9,FALSE)","v":"YES"}]
[]
["CPU Cosmetics Defects:",null,{"$f":"\"Function Code: \"&VLOOKUP(E32,INVENTORY!$A$2:$Q$100,14,FALSE)","v":"Function Code: F3"},{"$nulls":3},"CPU Cosmetics Defects:",null,{"$f":"\"Function Code: \"&VLOOKUP(K32,INVENTORY!$A$2:$Q$100,14,FALSE)","v":"Function Code: F3"}]
[]
[null,null,{"$f":"\"Cosmetic Code: \"&VLOOKUP(E32,INVENTORY!$A$2:$Q$100,15,FALSE)","v":"Cosmetic Code: C5"},{"$nulls":5},{"$f":"\"Cosmetic Code: \"&VLOOKUP(K32,INVENTORY!$A$2:$Q$100,15,FALSE)","v":"Cosmetic Code: C5"}]
[]
["Casing","Plugs/Ports",{"$nulls":4},"Casing","Plugs/Ports"]
["Pass","Pass",{"$nulls":4},"Pass","Pass"]
["Fail","Fail",null,"TRRC#:L.T.R.",null,null,"Fail","Fail",null,"TRRC#:L.T.R."]
[]
["LAPTOP TESTING RECORD",{"$nulls":5},"LAPTOP TESTING RECORD"]
[]
[{"$nulls":3},"ITEM #",{"$f":"E32+2","v":5},{"$nulls":4},"ITEM #",{"$f":"K32+2","v":6}]
["Tester: ","RR","Date:",{"$f":"NOW()","v":"2025-12-15T11:00:59.760"},null,null,"Tester: ","RR","Date:",{"$f":"NOW()","v":"2025-12-15T11:00:59.760"}]
["Type: ","LAPTOP","SN:",{"$f":"VLOOKUP(E61,INVENTORYDATA,10,FALSE)","v":"PW058CLS"},null,null,"Type: ","LAPTOP","SN:",{"$f":"VLOOKUP(K61,INVENTORYDATA,10,FALSE)","v":"PW05HGKX"}]
[{"$f":"\"Make: \"","v":"Make: "},{"$f":"VLOOKUP(E61,INVENTORYDATA,2,FALSE)","v":"LENOVO"},{"$f":"\"Model: \"","v":"Model: "},{"$f":"VLOOKUP(E61,INVENTORYDATA,3,FALSE)","v":"THINKPAD L13 YOGA G3"},null,null,{"$f":"\"Make: \"","v":"Make: "},{"$f":"VLOOKUP(K61,INVENTORYDATA,2,FALSE)","v":"LENOVO"},{"$f":"\"Model: \"","v":"Model: "},{"$f":"VLOOKUP(K61,INVENTORYDATA,3,FALSE)","v":"THINKPAD L13 YOGA G3"}]
[{"$f":"\"CPU/Speed: \"","v":"CPU/Speed: "},{"$f":"VLOOKUP(E61,INVENTORYDATA,4,FALSE)&\" / \"&VLOOKUP(E61,INVENTORYDATA,5,FALSE)&\"GHz\"","v":"RYZEN7 PRO 5875U / 2GHz"},null,{"$f":"\"Memory: \"","v":"Memory: "},{"$f":"VLOOKUP(E61,INVENTORYDATA,6,FALSE)","v":"16G"},null,{"$f":"\"CPU/Speed: \"","v":"CPU/Speed: "},{"$f":"VLOOKUP(K61,INVENTORYDATA,4,FALSE)&\" / \"&VLOOKUP(K61,INVENTORYDATA,5,FALSE)&\"GHz\"","v":"RYZEN7 PRO 5875U / 2GHz"},null,{"$f":"\"Memory: \"","v":"Memory: "},{"$f":"VLOOKUP(K61,INVENTORYDATA,6,FALSE)","v":"16G"}]
[]
["Key Function",null,"Pass","Fail ","Comments",null,"Key Function",null,"Pass","Fail ","Comments"]
["Hard Drive Removed",null,{"$f":"IF(ISBLANK(VLOOKUP(E61,INVENTORYDATA,13,FALSE)),\"X\",\"\")","v":""},null,{"$f":"IF(ISBLANK(VLOOKUP(E61,INVENTORYDATA,13,FALSE)),\"\",VLOOKUP(E61,INVENTORYDATA,13,FALSE))","v":"512G"},null,"Hard Drive Removed",null,{"$f":"IF(ISBLANK(VLOOKUP(K61,INVENTORYDATA,13,FALSE)),\"X\",\"\")","v":""},null,{"$f":"IF(ISBLANK(VLOOKUP(K61,INVENTORYDATA,13,FALSE)),\"\",VLOOKUP(K61,INVENTORYDATA,13,FALSE))","v":"512G"}]
["Install Memory",null,"X",{"$nulls":3},"Install Memory",null,"X"]
["Power ON",null,"X",{"$nulls":3},"Power ON",null,"X"]
["Record BIOS info",null,"X",{"$nulls":3},"Record BIOS info",null,"X"]
["Check Optical Drive",null,{"$f":"IF((VLOOKUP(E61,INVENTORYDATA,7,FALSE))=\"YES\",\"X\",\"\")","v":""},{"$f":"IF((VLOOKUP(E61,INVENTORYDATA,7,FALSE))=\"NO\",\"X\",\"\")","v":"X"},null,null,"Check Optical Drive",null,{"$f":"IF((VLOOKUP(K61,INVENTORYDATA,7,FALSE))=\"YES\",\"X\",\"\")","v":""},{"$f":"IF((VLOOKUP(K61,INVENTORYDATA,7,FALSE))=\"NO\",\"X\",\"\")","v":"X"}]
["Power Off",null,"X",{"$nulls":3},"Power Off",null,"X"]
["HDD Serial No.",null,{"$f":"IF(ISBLANK(VLOOKUP(E61,INVENTORYDATA,12,FALSE)),\"\",VLOOKUP(E61,INVENTORYDATA,12,FALSE))","v":"sn9AN82571020AU28"},{"$nulls":3},"HDD Serial No.",null,{"$f":"IF(ISBLANK(VLOOKUP(K61,INVENTORYDATA,12,FALSE)),\"\",VLOOKUP(K61,INVENTORYDATA,12,FALSE))","v":"z9FPC6EUPTML"}]
[]
["Tested for key functions,R2/Ready for Resale",{"$nulls":5},"Tested for key functions,R2/Ready for Resale"]
["BIOS Lock","Caddy","Optical","WebCam","Battery",null,"BIOS Lock","Caddy","Optical","WebCam","Battery"]
[null,null,{"$f":"VLOOKUP(E61,INVENTORY!$A$2:$N$100,7,FALSE)","v":"NO"},{"$f":"VLOOKUP(E61,INVENTORY!$A$2:$N$100,8,FALSE)","v":"YES"},{"$f":"VLOOKUP(E61,INVENTORY!$A$2:$N$100,9,FALSE)","v":"YES"},{"$nulls":3},{"$f":"VLOOKUP(K61,INVENTORY!$A$2:$N$100,7,FALSE)","v":"NO"},{"$f":"VLOOKUP(K61,INVENTORY!$A$2:$N$100,8,FALSE)","v":"YES"},{"$f":"VLOOKUP(K61,INVENTORY!$A$2:$N$100,9,FALSE)","v":"YES"}]
[]
["CPU Cosmetics Defects:",null,{"$f":"\"Function Code: \"&VLOOKUP(E61,INVENTORY!$A$2:$Q$100,14,FALSE)","v":"Function Code: F3"},{"$nulls":3},"CPU Cosmetics Defects:",null,{"$f":"\"Function Code: \"&VLOOKUP(K61,INVENTORY!$A$2:$Q$100,14,FALSE)","v":"Function Code: F3"}]
[]
[null,null,{"$f":"\"Cosmetic Code: \"&VLOOKUP(E61,INVENTORY!$A$2:$Q$100,15,FALSE)","v":"Cosmetic Code: C5"},{"$nulls":5},{"$f":"\"Cosmetic Code: \"&VLOOKUP(K61,INVENTORY!$A$2:$Q$100,15,FALSE)","v":"Cosmetic Code: C5"}]
[]
["Casing","Plugs/Ports",{"$nulls":4},"Casing","Plugs/Ports"]
["Pass","Pass",{"$nulls":4},"Pass","Pass"]
["Fail","Fail",null,"TRRC#:L.T.R.",null,null,"Fail","Fail",null,"TRRC#:L.T.R."]
[]
["LAPTOP TESTING RECORD",{"$nulls":5},"LAPTOP TESTING RECORD"]
[]
[{"$nulls":3},"ITEM #",{"$f":"E61+2","v":7},{"$nulls":4},"ITEM #",{"$f":"K61+2","v":8}]
["Tester: ","RR","Date:",{"$f":"NOW()","v":"2025-12-15T11:00:59.760"},null,null,"Tester: ","RR","Date:",{"$f":"NOW()","v":"2025-12-15T11:00:59.760"}]
["Type: ","LAPTOP","SN:",{"$f":"VLOOKUP(E90,INVENTORYDATA,10,FALSE)","v":"PW05HHTW"},null,null,"Type: ","LAPTOP","SN:",{"$f":"VLOOKUP(K90,INVENTORYDATA,10,FALSE)","v":"PW05HHVS"}]
[{"$f":"\"Make: \"","v":"Make: "},{"$f":"VLOOKUP(E90,INVENTORYDATA,2,FALSE)","v":"LENOVO"},{"$f":"\"Model: \"","v":"Model: "},{"$f":"VLOOKUP(E90,INVENTORYDATA,3,FALSE)","v":"THINKPAD L13 YOGA G3"},null,null,{"$f":"\"Make: \"","v":"Make: "},{"$f":"VLOOKUP(K90,INVENTORYDATA,2,FALSE)","v":"LENOVO"},{"$f":"\"Model: \"","v":"Model: "},{"$f":"VLOOKUP(K90,INVENTORYDATA,3,FALSE)","v":"THINKPAD L13 YOGA G3"}]
[{"$f":"\"CPU/Speed: \"","v":"CPU/Speed: "},{"$f":"VLOOKUP(E90,INVENTORYDATA,4,FALSE)&\" / \"&VLOOKUP(E90,INVENTORYDATA,5,FALSE)&\"GHz\"","v":"RYZEN7 PRO 5875U / 2GHz"},null,{"$f":"\"Memory: \"","v":"Memory: "},{"$f":"VLOOKUP(E90,INVENTORYDATA,6,FALSE)","v":"16G"},null,{"$f":"\"CPU/Speed: \"","v":"CPU/Speed: "},{"$f":"VLOOKUP(K90,INVENTORYDATA,4,FALSE)&\" / \"&VLOOKUP(K90,INVENTORYDATA,5,FALSE)&\"GHz\"","v":"RYZEN7 PRO 5875U / 2GHz"},null,{"$f":"\"Memory: \"","v":"Memory: "},{"$f":"VLOOKUP(K90,INVENTORYDATA,6,FALSE)","v":"16G"}]
[]
["Key Function",null,"Pass","Fail ","Comments",null,"Key Function",null,"Pass","Fail ","Comments"]
["Hard Drive Removed",null,{"$f":"IF(ISBLANK(VLOOKUP(E90,INVENTORYDATA,13,FALSE)),\"X\",\"\")","v":""},null,{"$f":"IF(ISBLANK(VLOOKUP(E90,INVENTORYDATA,13,FALSE)),\"\",VLOOKUP(E90,INVENTORYDATA,13,FALSE))","v":"512G"},null,"Hard Drive Removed",null,{"$f":"IF(ISBLANK(VLOOKUP(K90,INVENTORYDATA,13,FALSE)),\"X\",\"\")","v":""},null,{"$f":"IF(ISBLANK(VLOOKUP(K90,INVENTORYDATA,13,FALSE)),\"\",VLOOKUP(K90,INVENTORYDATA,13,FALSE))","v":"512G"}]
["Install Memory",null,"X",{"$nulls":3},"Install Memory",null,"X"]
["Power ON",null,"X",{"$nulls":3},"Power ON",null,"X"]
["Record BIOS info",null,"X",{"$nulls":3},"Record BIOS info",null,"X"]
["Check Optical Drive",null,{"$f":"IF((VLOOKUP(E90,INVENTORYDATA,7,FALSE))=\"YES\",\"X\",\"\")","v":""},{"$f":"IF((VLOOKUP(E90,INVENTORYDATA,7,FALSE))=\"NO\",\"X\",\"\")","v":"X"},null,null,"Check Optical Drive",null,{"$f":"IF((VLOOKUP(K90,INVENTORYDATA,7,FALSE))=\"YES\",\"X\",\"\")","v":""},{"$f":"IF((VLOOKUP(K90,INVENTORYDATA,7,FALSE))=\"NO\",\"X\",\"\")","v":"X"}]
["Power Off",null,"X",{"$nulls":3},"Power Off",null,"X"]
["HDD Serial No.",null,{"$f":"IF(ISBLANK(VLOOKUP(E90,INVENTORYDATA,12,FALSE)),\"\",VLOOKUP(E90,INVENTORYDATA,12,FALSE))","v":"605PE0DEPTML"},{"$nulls":3},"HDD Serial No.",null,{"$f":"IF(ISBLANK(VLOOKUP(K90,INVENTORYDATA,12,FALSE)),\"\",VLOOKUP(K90,INVENTORYDATA,12,FALSE))","v":"tw07YGY09DH0002J00WY"}]
[]
["Tested for key functions,R2/Ready for Resale",{"$nulls":5},"Tested for key functions,R2/Ready for Resale"]
["BIOS Lock","Caddy","Optical","WebCam","Battery",null,"BIOS Lock","Caddy","Optical","WebCam","Battery"]
[null,null,{"$f":"VLOOKUP(E90,INVENTORY!$A$2:$N$100,7,FALSE)","v":"NO"},{"$f":"VLOOKUP(E90,INVENTORY!$A$2:$N$100,8,FALSE)","v":"YES"},{"$f":"VLOOKUP(E90,INVENTORY!$A$2:$N$100,9,FALSE)","v":"YES"},{"$nulls":3},{"$f":"VLOOKUP(K90,INVENTORY!$A$2:$N$100,7,FALSE)","v":"NO"},{"$f":"VLOOKUP(K90,INVENTORY!$A$2:$N$100,8,FALSE)","v":"YES"},{"$f":"VLOOKUP(K90,INVENTORY!$A$2:$N$100,9,FALSE)","v":"YES"}]
[]
["CPU Cosmetics Defects:",null,{"$f":"\"Function Code: \"&VLOOKUP(E90,INVENTORY!$A$2:$Q$100,14,FALSE)","v":"Function Code: F3"},{"$nulls":3},"CPU Cosmetics Defects:",null,{"$f":"\"Function Code: \"&VLOOKUP(K90,INVENTORY!$A$2:$Q$100,14,FALSE)","v":"Function Code: F3"}]
[]
[null,null,{"$f":"\"Cosmetic Code: \"&VLOOKUP(E90,INVENTORY!$A$2:$Q$100,15,FALSE)","v":"Cosmetic Code: C5"},{"$nulls":5},{"$f":"\"Cosmetic Code: \"&VLOOKUP(K90,INVENTORY!$A$2:$Q$100,15,FALSE)","v":"Cosmetic Code: C5"}]
[]
["Casing","Plugs/Ports",{"$nulls":4},"Casing","Plugs/Ports"]
["Pass","Pass",{"$nulls":4},"Pass","Pass"]
["Fail","Fail",null,"TRRC#:L.T.R.",null,null,"Fail","Fail",null,"TRRC#:L.T.R."]
[]
["LAPTOP TESTING RECORD",{"$nulls":5},"LAPTOP TESTING RECORD"]
[]
[{"$nulls":3},"ITEM #",{"$f":"E90+2","v":9},{"$nulls":4},"ITEM #",{"$f":"K90+2","v":10}]
["Tester: ","RR","Date:",{"$f":"NOW()","v":"2025-12-15T11:00:59.760"},null,null,"Tester: ","RR","Date:",{"$f":"NOW()","v":"2025-12-15T11:00:59.760"}]
["Type: ","LAPTOP","SN:",{"$f":"VLOOKUP(E119,INVENTORYDATA,10,FALSE)","v":"PW05HYWA"},null,null,"Type: ","LAPTOP","SN:",{"$f":"VLOOKUP(K119,INVENTORYDATA,10,FALSE)","v":"PW05RRYA"}]
[{"$f":"\"Make: \"","v":"Make: "},{"$f":"VLOOKUP(E119,INVENTORYDATA,2,FALSE)","v":"LENOVO"},{"$f":"\"Model: \"","v":"Model: "},{"$f":"VLOOKUP(E119,INVENTORYDATA,3,FALSE)","v":"THINKPAD L13 YOGA G3"},null,null,{"$f":"\"Make: \"","v":"Make: "},{"$f":"VLOOKUP(K119,INVENTORYDATA,2,FALSE)","v":"LENOVO"},{"$f":"\"Model: \"","v":"Model: "},{"$f":"VLOOKUP(K119,INVENTORYDATA,3,FALSE)","v":"THINKPAD L13 YOGA G3"}]
[{"$f":"\"CPU/Speed: \"","v":"CPU/Speed: "},{"$f":"VLOOKUP(E119,INVENTORYDATA,4,FALSE)&\" / \"&VLOOKUP(E119,INVENTORYDATA,5,FALSE)&\"GHz\"","v":"RYZEN7 PRO 5875U / 2GHz"},null,{"$f":"\"Memory: \"","v":"Memory: "},{"$f":"VLOOKUP(E119,INVENTORYDATA,6,FALSE)","v":"16G"},null,{"$f":"\"CPU/Speed: \"","v":"CPU/Speed: "},{"$f":"VLOOKUP(K119,INVENTORYDATA,4,FALSE)&\" / \"&VLOOKUP(K119,INVENTORYDATA,5,FALSE)&\"GHz\"","v":"RYZEN7 PRO 5875U / 2GHz"},null,{"$f":"\"Memory: \"","v":"Memory: "},{"$f":"VLOOKUP(K119,INVENTORYDATA,6,FALSE)","v":"16G"}]
[]
["Key Function",null,"Pass","Fail ","Comments",null,"Key Function",null,"Pass","Fail ","Comments"]
["Hard Drive Removed",null,{"$f":"IF(ISBLANK(VLOOKUP(E119,INVENTORYDATA,13,FALSE)),\"X\",\"\")","v":""},null,{"$f":"IF(ISBLANK(VLOOKUP(E119,INVENTORYDATA,13,FALSE)),\"\",VLOOKUP(E119,INVENTORYDATA,13,FALSE))","v":"512G"},null,"Hard Drive Removed",null,{"$f":"IF(ISBLANK(VLOOKUP(K119,INVENTORYDATA,13,FALSE)),\"X\",\"\")","v":""},null,{"$f":"IF(ISBLANK(VLOOKUP(K119,INVENTORYDATA,13,FALSE)),\"\",VLOOKUP(K119,INVENTORYDATA,13,FALSE))","v":"512G"}]
["Install Memory",null,"X",{"$nulls":3},"Install Memory",null,"X"]
["Power ON",null,"X",{"$nulls":3},"Power ON",null,"X"]
["Record BIOS info",null,"X",{"$nulls":3},"Record BIOS info",null,"X"]
["Check Optical Drive",null,{"$f":"IF((VLOOKUP(E119,INVENTORYDATA,7,FALSE))=\"YES\",\"X\",\"\")","v":""},{"$f":"IF((VLOOKUP(E119,INVENTORYDATA,7,FALSE))=\"NO\",\"X\",\"\")","v":"X"},null,null,"Check Optical Drive",null,{"$f":"IF((VLOOKUP(K119,INVENTORYDATA,7,FALSE))=\"YES\",\"X\",\"\")","v":""},{"$f":"IF((VLOOKUP(K119,INVENTORYDATA,7,FALSE))=\"NO\",\"X\",\"\")","v":"X"}]
["Power Off",null,"X",{"$nulls":3},"Power Off",null,"X"]
["HDD Serial No.",null,{"$f":"IF(ISBLANK(VLOOKUP(E119,INVENTORYDATA,12,FALSE)),\"\",VLOOKUP(E119,INVENTORYDATA,12,FALSE))","v":"SN9BN44181010B74R"},{"$nulls":3},"HDD Serial No.",null,{"$f":"IF(ISBLANK(VLOOKUP(K119,INVENTORYDATA,12,FALSE)),\"\",VLOOKUP(K119,INVENTORYDATA,12,FALSE))","v":"sn9AN82631130B445"}]
[]
["Tested for key functions,R2/Ready for Resale",{"$nulls":5},"Tested for key functions,R2/Ready for Resale"]
["BIOS Lock","Caddy","Optical","WebCam","Battery",null,"BIOS Lock","Caddy","Optical","WebCam","Battery"]
[null,null,{"$f":"VLOOKUP(E119,INVENTORY!$A$2:$N$100,7,FALSE)","v":"NO"},{"$f":"VLOOKUP(E119,INVENTORY!$A$2:$N$100,8,FALSE)","v":"YES"},{"$f":"VLOOKUP(E119,INVENTORY!$A$2:$N$100,9,FALSE)","v":"YES"},{"$nulls":3},{"$f":"VLOOKUP(K119,INVENTORY!$A$2:$N$100,7,FALSE)","v":"NO"},{"$f":"VLOOKUP(K119,INVENTORY!$A$2:$N$100,8,FALSE)","v":"YES"},{"$f":"VLOOKUP(K119,INVENTORY!$A$2:$N$100,9,FALSE)","v":"YES"}]
[]
["CPU Cosmetics Defects:",null,{"$f":"\"Function Code: \"&VLOOKUP(E119,INVENTORY!$A$2:$Q$100,14,FALSE)","v":"Function Code: F3"},{"$nulls":3},"CPU Cosmetics Defects:",null,{"$f":"\"Function Code: \"&VLOOKUP(K119,INVENTORY!$A$2:$Q$100,14,FALSE)","v":"Function Code: F3"}]
[]
[null,null,{"$f":"\"Cosmetic Code: \"&VLOOKUP(E119,INVENTORY!$A$2:$Q$100,15,FALSE)","v":"Cosmetic Code: C5"},{"$nulls":5},{"$f":"\"Cosmetic Code: \"&VLOOKUP(K119,INVENTORY!$A$2:$Q$100,15,FALSE)","v":"Cosmetic Code: C5"}]
[]
["Casing","Plugs/Ports",{"$nulls":4},"Casing","Plugs/Ports"]
["Pass","Pass",{"$nulls":4},"Pass","Pass"]
["Fail","Fail",null,"TRRC#:L.T.R.",null,null,"Fail","Fail",null,"TRRC#:L.T.R."]
[]
["LAPTOP TESTING RECORD",{"$nulls":5},"LAPTOP TESTING RECORD"]
[]
[{"$nulls":3},"ITEM #",{"$f":"E119+2","v":11},{"$nulls":4},"ITEM #",{"$f":"K119+2","v":12}]
["Tester: ","RR","Date:",{"$f":"NOW()","v":"2025-12-15T11:00:59.760"},null,null,"Tester: ","RR","Date:",{"$f":"NOW()","v":"2025-12-15T11:00:59.760"}]
["Type: ","LAPTOP","SN:",{"$f":"VLOOKUP(E148,INVENTORYDATA,10,FALSE)","v":"PW05RTH4"},null,null,"Type: ","LAPTOP","SN:",{"$f":"VLOOKUP(K148,INVENTORYDATA,10,FALSE)","v":"PW05SGT5"}]
[{"$f":"\"Make: \"","v":"Make: "},{"$f":"VLOOKUP(E148,INVENTORYDATA,2,FALSE)","v":"LENOVO"},{"$f":"\"Model: \"","v":"Model: "},{"$f":"VLOOKUP(E148,INVENTORYDATA,3,FALSE)","v":"THINKPAD L13 YOGA G3"},null,null,{"$f":"\"Make: \"","v":"Make: "},{"$f":"VLOOKUP(K148,INVENTORYDATA,2,FALSE)","v":"LENOVO"},{"$f":"\"Model: \"","v":"Model: "},{"$f":"VLOOKUP(K148,INVENTORYDATA,3,FALSE)","v":"THINKPAD L13 YOGA G3"}]
[{"$f":"\"CPU/Speed: \"","v":"CPU/Speed: "},{"$f":"VLOOKUP(E148,INVENTORYDATA,4,FALSE)&\" / \"&VLOOKUP(E148,INVENTORYDATA,5,FALSE)&\"GHz\"","v":"RYZEN7 PRO 5875U / 2GHz"},null,{"$f":"\"Memory: \"","v":"Memory: "},{"$f":"VLOOKUP(E148,INVENTORYDATA,6,FALSE)","v":"16G"},null,{"$f":"\"CPU/Speed: \"","v":"CPU/Speed: "},{"$f":"VLOOKUP(K148,INVENTORYDATA,4,FALSE)&\" / \"&VLOOKUP(K148,INVENTORYDATA,5,FALSE)&\"GHz\"","v":"RYZEN7 PRO 5875U / 2GHz"},null,{"$f":"\"Memory: \"","v":"Memory: "},{"$f":"VLOOKUP(K148,INVENTORYDATA,6,FALSE)","v":"16G"}]
[]
["Key Function",null,"Pass","Fail ","Comments",null,"Key Function",null,"Pass","Fail ","Comments"]
["Hard Drive Removed",null,{"$f":"IF(ISBLANK(VLOOKUP(E148,INVENTORYDATA,13,FALSE)),\"X\",\"\")","v":""},null,{"$f":"IF(ISBLANK(VLOOKUP(E148,INVENTORYDATA,13,FALSE)),\"\",VLOOKUP(E148,INVENTORYDATA,13,FALSE))","v":"512G"},null,"Hard Drive Removed",null,{"$f":"IF(ISBLANK(VLOOKUP(K148,INVENTORYDATA,13,FALSE)),\"X\",\"\")","v":""},null,{"$f":"IF(ISBLANK(VLOOKUP(K148,INVENTORYDATA,13,FALSE)),\"\",VLOOKUP(K148,INVENTORYDATA,13,FALSE))","v":"512G"}]
["Install Memory",null,"X",{"$nulls":3},"Install Memory",null,"X"]
["Power ON",null,"X",{"$nulls":3},"Power ON",null,"X"]
["Record BIOS info",null,"X",{"$nulls":3},"Record BIOS info",null,"X"]
["Check Optical Drive",null,{"$f":"IF((VLOOKUP(E148,INVENTORYDATA,7,FALSE))=\"YES\",\"X\",\"\")","v":""},{"$f":"IF((VLOOKUP(E148,INVENTORYDATA,7,FALSE))=\"NO\",\"X\",\"\")","v":"X"},null,null,"Check Optical Drive",null,{"$f":"IF((VLOOKUP(K148,INVENTORYDATA,7,FALSE))=\"YES\",\"X\",\"\")","v":""},{"$f":"IF((VLOOKUP(K148,INVENTORYDATA,7,FALSE))=\"NO\",\"X\",\"\")","v":"X"}]
["Power Off",null,"X",{"$nulls":3},"Power Off",null,"X"]
["HDD Serial No.",null,{"$f":"IF(ISBLANK(VLOOKUP(E148,INVENTORYDATA,12,FALSE)),\"\",VLOOKUP(E148,INVENTORYDATA,12,FALSE))","v":"TW07YGY09DH0002O02EG"},{"$nulls":3},"HDD Serial No.",null,{"$f":"IF(ISBLANK(VLOOKUP(K148,INVENTORYDATA,12,FALSE)),\"\",VLOOKUP(K148,INVENTORYDATA,12,FALSE))","v":"606PG96IPTML"}]
[]
["Tested for key functions,R2/Ready for Resale",{"$nulls":5},"Tested for key functions,R2/Ready for Resale"]
["BIOS Lock","Caddy","Optical","WebCam","Battery",null,"BIOS Lock","Caddy","Optical","WebCam","Battery"]
[null,null,{"$f":"VLOOKUP(E148,INVENTORY!$A$2:$N$100,7,FALSE)","v":"NO"},{"$f":"VLOOKUP(E148,INVENTORY!$A$2:$N$100,8,FALSE)","v":"YES"},{"$f":"VLOOKUP(E148,INVENTORY!$A$2:$N$100,9,FALSE)","v":"YES"},{"$nulls":3},{"$f":"VLOOKUP(K148,INVENTORY!$A$2:$N$100,7,FALSE)","v":"NO"},{"$f":"VLOOKUP(K148,INVENTORY!$A$2:$N$100,8,FALSE)","v":"YES"},{"$f":"VLOOKUP(K148,INVENTORY!$A$2:$N$100,9,FALSE)","v":"YES"}]
[]
["CPU Cosmetics Defects:",null,{"$f":"\"Function Code: \"&VLOOKUP(E148,INVENTORY!$A$2:$Q$100,14,FALSE)","v":"Function Code: F3"},{"$nulls":3},"CPU Cosmetics Defects:",null,{"$f":"\"Function Code: \"&VLOOKUP(K148,INVENTORY!$A$2:$Q$100,14,FALSE)","v":"Function Code: F3"}]
[]
[null,null,{"$f":"\"Cosmetic Code: \"&VLOOKUP(E148,INVENTORY!$A$2:$Q$100,15,FALSE)","v":"Cosmetic Code: C5"},{"$nulls":5},{"$f":"\"Cosmetic Code: \"&VLOOKUP(K148,INVENTORY!$A$2:$Q$100,15,FALSE)","v":"Cosmetic Code: C5"}]
[]
["Casing","Plugs/Ports",{"$nulls":4},"Casing","Plugs/Ports"]
["Pass","Pass",{"$nulls":4},"Pass","Pass"]
["Fail","Fail",null,"TRRC#:L.T.R.",null,null,"Fail","Fail",null,"TRRC#:L.T.R."]
[]
["LAPTOP TESTING RECORD",{"$nulls":5},"LAPTOP TESTING RECORD"]
[]
[{"$nulls":3},"ITEM #",{"$f":"E148+2","v":13},{"$nulls":4},"ITEM #",{"$f":"K148+2","v":14}]
["Tester: ","RR","Date:",{"$f":"NOW()","v":"2025-12-15T11:00:59.760"},null,null,"Tester: ","RR","Date:",{"$f":"NOW()","v":"2025-12-15T11:00:59.760"}]
["Type: ","LAPTOP","SN:",{"$f":"VLOOKUP(E177,INVENTORYDATA,10,FALSE)","v":"PW05SJHK"},null,null,"Type: ","LAPTOP","SN:",{"$f":"VLOOKUP(K177,INVENTORYDATA,10,FALSE)","v":"PW05SJHS"}]
[{"$f":"\"Make: \"","v":"Make: "},{"$f":"VLOOKUP(E177,INVENTORYDATA,2,FALSE)","v":"LENOVO"},{"$f":"\"Model: \"","v":"Model: "},{"$f":"VLOOKUP(E177,INVENTORYDATA,3,FALSE)","v":"THINKPAD L13 YOGA G3"},null,null,{"$f":"\"Make: \"","v":"Make: "},{"$f":"VLOOKUP(K177,INVENTORYDATA,2,FALSE)","v":"LENOVO"},{"$f":"\"Model: \"","v":"Model: "},{"$f":"VLOOKUP(K177,INVENTORYDATA,3,FALSE)","v":"THINKPAD L13 YOGA G3"}]
[{"$f":"\"CPU/Speed: \"","v":"CPU/Speed: "},{"$f":"VLOOKUP(E177,INVENTORYDATA,4,FALSE)&\" / \"&VLOOKUP(E177,INVENTORYDATA,5,FALSE)&\"GHz\"","v":"RYZEN7 PRO 5875U / 2GHz"},null,{"$f":"\"Memory: \"","v":"Memory: "},{"$f":"VLOOKUP(E177,INVENTORYDATA,6,FALSE)","v":"16G"},null,{"$f":"\"CPU/Speed: \"","v":"CPU/Speed: "},{"$f":"VLOOKUP(K177,INVENTORYDATA,4,FALSE)&\" / \"&VLOOKUP(K177,INVENTORYDATA,5,FALSE)&\"GHz\"","v":"RYZEN7 PRO 5875U / 2GHz"},null,{"$f":"\"Memory: \"","v":"Memory: "},{"$f":"VLOOKUP(K177,INVENTORYDATA,6,FALSE)","v":"16G"}]
[]
["Key Function",null,"Pass","Fail ","Comments",null,"Key Function",null,"Pass","Fail ","Comments"]
["Hard Drive Removed",null,{"$f":"IF(ISBLANK(VLOOKUP(E177,INVENTORYDATA,13,FALSE)),\"X\",\"\")","v":""},null,{"$f":"IF(ISBLANK(VLOOKUP(E177,INVENTORYDATA,13,FALSE)),\"\",VLOOKUP(E177,INVENTORYDATA,13,FALSE))","v":"512G"},null,"Hard Drive Removed",null,{"$f":"IF(ISBLANK(VLOOKUP(K177,INVENTORYDATA,13,FALSE)),\"X\",\"\")","v":""},null,{"$f":"IF(ISBLANK(VLOOKUP(K177,INVENTORYDATA,13,FALSE)),\"\",VLOOKUP(K177,INVENTORYDATA,13,FALSE))","v":"512G"}]
["Install Memory",null,"X",{"$nulls":3},"Install Memory",null,"X"]
["Power ON",null,"X",{"$nulls":3},"Power ON",null,"X"]
["Record BIOS info",null,"X",{"$nulls":3},"Record BIOS info",null,"X"]
["Check Optical Drive",null,{"$f":"IF((VLOOKUP(E177,INVENTORYDATA,7,FALSE))=\"YES\",\"X\",\"\")","v":""},{"$f":"IF((VLOOKUP(E177,INVENTORYDATA,7,FALSE))=\"NO\",\"X\",\"\")","v":"X"},null,null,"Check Optical Drive",null,{"$f":"IF((VLOOKUP(K177,INVENTORYDATA,7,FALSE))=\"YES\",\"X\",\"\")","v":""},{"$f":"IF((VLOOKUP(K177,INVENTORYDATA,7,FALSE))=\"NO\",\"X\",\"\")","v":"X"}]
["Power Off",null,"X",{"$nulls":3},"Power Off",null,"X"]
["HDD Serial No.",null,{"$f":"IF(ISBLANK(VLOOKUP(E177,INVENTORYDATA,12,FALSE)),\"\",VLOOKUP(E177,INVENTORYDATA,12,FALSE))","v":"sd01N670910301U0X"},{"$nulls":3},"HDD Serial No.",null,{"$f":"IF(ISBLANK(VLOOKUP(K177,INVENTORYDATA,12,FALSE)),\"\",VLOOKUP(K177,INVENTORYDATA,12,FALSE))","v":"sn9AN79251110AU6C"}]
[]
["Tested for key functions,R2/Ready for Resale",{"$nulls":5},"Tested for key functions,R2/Ready for Resale"]
["BIOS Lock","Caddy","Optical","WebCam","Battery",null,"BIOS Lock","Caddy","Optical","WebCam","Battery"]
[null,null,{"$f":"VLOOKUP(E177,INVENTORY!$A$2:$N$100,7,FALSE)","v":"NO"},{"$f":"VLOOKUP(E177,INVENTORY!$A$2:$N$100,8,FALSE)","v":"YES"},{"$f":"VLOOKUP(E177,INVENTORY!$A$2:$N$100,9,FALSE)","v":"YES"},{"$nulls":3},{"$f":"VLOOKUP(K177,INVENTORY!$A$2:$N$100,7,FALSE)","v":"NO"},{"$f":"VLOOKUP(K177,INVENTORY!$A$2:$N$100,8,FALSE)","v":"YES"},{"$f":"VLOOKUP(K177,INVENTORY!$A$2:$N$100,9,FALSE)","v":"YES"}]
[]
["CPU Cosmetics Defects:",null,{"$f":"\"Function Code: \"&VLOOKUP(E177,INVENTORY!$A$2:$Q$100,14,FALSE)","v":"Function Code: F3"},{"$nulls":3},"CPU Cosmetics Defects:",null,{"$f":"\"Function Code: \"&VLOOKUP(K177,INVENTORY!$A$2:$Q$100,14,FALSE)","v":"Function Code: F3"}]
[]
[null,null,{"$f":"\"Cosmetic Code: \"&VLOOKUP(E177,INVENTORY!$A$2:$Q$100,15,FALSE)","v":"Cosmetic Code: C5"},{"$nulls":5},{"$f":"\"Cosmetic Code: \"&VLOOKUP(K177,INVENTORY!$A$2:$Q$100,15,FALSE)","v":"Cosmetic Code: C5"}]
[]
["Casing","Plugs/Ports",{"$nulls":4},"Casing","Plugs/Ports"]
["Pass","Pass",{"$nulls":4},"Pass","Pass"]
["Fail","Fail",null,"TRRC#:L.T.R.",null,null,"Fail","Fail",null,"TRRC#:L.T.R."]
[]
["LAPTOP TESTING RECORD",{"$nulls":5},"LAPTOP TESTING RECORD"]
[]
[{"$nulls":3},"ITEM #",{"$f":"E177+2","v":15},{"$nulls":4},"ITEM #",{"$f":"K177+2","v":16}]
["Tester: ","RR","Date:",{"$f":"NOW()","v":"2025-12-15T11:00:59.760"},null,null,"Tester: ","RR","Date:",{"$f":"NOW()","v":"2025-12-15T11:00:59.760"}]
["Type: ","LAPTOP","SN:",{"$f":"VLOOKUP(E206,INVENTORYDATA,10,FALSE)","v":"PW05TP9N"},null,null,"Type: ","LAPTOP","SN:",{"$f":"VLOOKUP(K206,INVENTORYDATA,10,FALSE)","v":{"$error":"#N/A"}}]
[{"$f":"\"Make: \"","v":"Make: "},{"$f":"VLOOKUP(E206,INVENTORYDATA,2,FALSE)","v":"LENOVO"},{"$f":"\"Model: \"","v":"Model: "},{"$f":"VLOOKUP(E206,INVENTORYDATA,3,FALSE)","v":"THINKPAD L13 YOGA G3"},null,null,{"$f":"\"Make: \"","v":"Make: "},{"$f":"VLOOKUP(K206,INVENTORYDATA,2,FALSE)","v":{"$error":"#N/A"}},{"$f":"\"Model: \"","v":"Model: "},{"$f":"VLOOKUP(K206,INVENTORYDATA,3,FALSE)","v":{"$error":"#N/A"}}]
[{"$f":"\"CPU/Speed: \"","v":"CPU/Speed: "},{"$f":"VLOOKUP(E206,INVENTORYDATA,4,FALSE)&\" / \"&VLOOKUP(E206,INVENTORYDATA,5,FALSE)&\"GHz\"","v":"RYZEN7 PRO 5875U / 2GHz"},null,{"$f":"\"Memory: \"","v":"Memory: "},{"$f":"VLOOKUP(E206,INVENTORYDATA,6,FALSE)","v":"16G"},null,{"$f":"\"CPU/Speed: \"","v":"CPU/Speed: "},{"$f":"VLOOKUP(K206,INVENTORYDATA,4,FALSE)&\" / \"&VLOOKUP(K206,INVENTORYDATA,5,FALSE)&\"GHz\"","v":{"$error":"#N/A"}},null,{"$f":"\"Memory: \"","v":"Memory: "},{"$f":"VLOOKUP(K206,INVENTORYDATA,6,FALSE)","v":{"$error":"#N/A"}}]
[]
["Key Function",null,"Pass","Fail ","Comments",null,"Key Function",null,"Pass","Fail ","Comments"]
["Hard Drive Removed",null,{"$f":"IF(ISBLANK(VLOOKUP(E206,INVENTORYDATA,13,FALSE)),\"X\",\"\")","v":""},null,{"$f":"IF(ISBLANK(VLOOKUP(E206,INVENTORYDATA,13,FALSE)),\"\",VLOOKUP(E206,INVENTORYDATA,13,FALSE))","v":"512G"},null,"Hard Drive Removed",null,{"$f":"IF(ISBLANK(VLOOKUP(K206,INVENTORYDATA,13,FALSE)),\"X\",\"\")","v":""},null,{"$f":"IF(ISBLANK(VLOOKUP(K206,INVENTORYDATA,13,FALSE)),\"\",VLOOKUP(K206,INVENTORYDATA,13,FALSE))","v":{"$error":"#N/A"}}]
["Install Memory",null,"X",{"$nulls":3},"Install Memory",null,"X"]
["Power ON",null,"X",{"$nulls":3},"Power ON",null,"X"]
["Record BIOS info",null,"X",{"$nulls":3},"Record BIOS info",null,"X"]
["Check Optical Drive",null,{"$f":"IF((VLOOKUP(E206,INVENTORYDATA,7,FALSE))=\"YES\",\"X\",\"\")","v":""},{"$f":"IF((VLOOKUP(E206,INVENTORYDATA,7,FALSE))=\"NO\",\"X\",\"\")","v":"X"},null,null,"Check Optical Drive",null,{"$f":"IF((VLOOKUP(K206,INVENTORYDATA,7,FALSE))=\"YES\",\"X\",\"\")","v":{"$error":"#N/A"}},{"$f":"IF((VLOOKUP(K206,INVENTORYDATA,7,FALSE))=\"NO\",\"X\",\"\")","v":{"$error":"#N/A"}}]
["Power Off",null,"X",{"$nulls":3},"Power Off",null,"X"]
["HDD Serial No.",null,{"$f":"IF(ISBLANK(VLOOKUP(E206,INVENTORYDATA,12,FALSE)),\"\",VLOOKUP(E206,INVENTORYDATA,12,FALSE))","v":"SN9AN74551100AU06"},{"$nulls":3},"HDD Serial No.",null,{"$f":"IF(ISBLANK(VLOOKUP(K206,INVENTORYDATA,12,FALSE)),\"\",VLOOKUP(K206,INVENTORYDATA,12,FALSE))","v":{"$error":"#N/A"}}]
[]
["Tested for key functions,R2/Ready for Resale",{"$nulls":5},"Tested for key functions,R2/Ready for Resale"]
["BIOS Lock","Caddy","Optical","WebCam","Battery",null,"BIOS Lock","Caddy","Optical","WebCam","Battery"]
[null,null,{"$f":"VLOOKUP(E206,INVENTORY!$A$2:$N$100,7,FALSE)","v":"NO"},{"$f":"VLOOKUP(E206,INVENTORY!$A$2:$N$100,8,FALSE)","v":"YES"},{"$f":"VLOOKUP(E206,INVENTORY!$A$2:$N$100,9,FALSE)","v":"YES"},{"$nulls":3},{"$f":"VLOOKUP(K206,INVENTORY!$A$2:$N$100,7,FALSE)","v":{"$error":"#N/A"}},{"$f":"VLOOKUP(K206,INVENTORY!$A$2:$N$100,8,FALSE)","v":{"$error":"#N/A"}},{"$f":"VLOOKUP(K206,INVENTORY!$A$2:$N$100,9,FALSE)","v":{"$error":"#N/A"}}]
[]
["CPU Cosmetics Defects:",null,{"$f":"\"Function Code: \"&VLOOKUP(E206,INVENTORY!$A$2:$Q$100,14,FALSE)","v":"Function Code: F3"},{"$nulls":3},"CPU Cosmetics Defects:",null,{"$f":"\"Function Code: \"&VLOOKUP(K206,INVENTORY!$A$2:$Q$100,14,FALSE)","v":{"$error":"#N/A"}}]
[]
[null,null,{"$f":"\"Cosmetic Code: \"&VLOOKUP(E206,INVENTORY!$A$2:$Q$100,15,FALSE)","v":"Cosmetic Code: C5"},{"$nulls":5},{"$f":"\"Cosmetic Code: \"&VLOOKUP(K206,INVENTORY!$A$2:$Q$100,15,FALSE)","v":{"$error":"#N/A"}}]
[]
["Casing","Plugs/Ports",{"$nulls":4},"Casing","Plugs/Ports"]
["Pass","Pass",{"$nulls":4},"Pass","Pass"]
["Fail","Fail",null,"TRRC#:L.T.R.",null,null,"Fail","Fail",null,"TRRC#:L.T.R."]
[]
["LAPTOP TESTING RECORD",{"$nulls":5},"LAPTOP TESTING RECORD"]
[]
[{"$nulls":3},"ITEM #",{"$f":"E206+2","v":17},{"$nulls":4},"ITEM #",{"$f":"K206+2","v":18}]
["Tester: ","RR","Date:",{"$f":"NOW()","v":"2025-12-15T11:00:59.760"},null,null,"Tester: ","RR","Date:",{"$f":"NOW()","v":"2025-12-15T11:00:59.760"}]
["Type: ","LAPTOP","SN:",{"$f":"VLOOKUP(E235,INVENTORYDATA,10,FALSE)","v":{"$error":"#N/A"}},null,null,"Type: ","LAPTOP","SN:",{"$f":"VLOOKUP(K235,INVENTORYDATA,10,FALSE)","v":{"$error":"#N/A"}}]
[{"$f":"\"Make: \"","v":"Make: "},{"$f":"VLOOKUP(E235,INVENTORYDATA,2,FALSE)","v":{"$error":"#N/A"}},{"$f":"\"Model: \"","v":"Model: "},{"$f":"VLOOKUP(E235,INVENTORYDATA,3,FALSE)","v":{"$error":"#N/A"}},null,null,{"$f":"\"Make: \"","v":"Make: "},{"$f":"VLOOKUP(K235,INVENTORYDATA,2,FALSE)","v":{"$error":"#N/A"}},{"$f":"\"Model: \"","v":"Model: "},{"$f":"VLOOKUP(K235,INVENTORYDATA,3,FALSE)","v":{"$error":"#N/A"}}]
[{"$f":"\"CPU/Speed: \"","v":"CPU/Speed: "},{"$f":"VLOOKUP(E235,INVENTORYDATA,4,FALSE)&\" / \"&VLOOKUP(E235,INVENTORYDATA,5,FALSE)&\"GHz\"","v":{"$error":"#N/A"}},null,{"$f":"\"Memory: \"","v":"Memory: "},{"$f":"VLOOKUP(E235,INVENTORYDATA,6,FALSE)","v":{"$error":"#N/A"}},null,{"$f":"\"CPU/Speed: \"","v":"CPU/Speed: "},{"$f":"VLOOKUP(K235,INVENTORYDATA,4,FALSE)&\" / \"&VLOOKUP(K235,INVENTORYDATA,5,FALSE)&\"GHz\"","v":{"$error":"#N/A"}},null,{"$f":"\"Memory: \"","v":"Memory: "},{"$f":"VLOOKUP(K235,INVENTORYDATA,6,FALSE)","v":{"$error":"#N/A"}}]
[]
["Key Function",null,"Pass","Fail ","Comments",null,"Key Function",null,"Pass","Fail ","Comments"]
["Hard Drive Removed",null,{"$f":"IF(ISBLANK(VLOOKUP(E235,INVENTORYDATA,13,FALSE)),\"X\",\"\")","v":""},null,{"$f":"IF(ISBLANK(VLOOKUP(E235,INVENTORYDATA,13,FALSE)),\"\",VLOOKUP(E235,INVENTORYDATA,13,FALSE))","v":{"$error":"#N/A"}},null,"Hard Drive Removed",null,{"$f":"IF(ISBLANK(VLOOKUP(K235,INVENTORYDATA,13,FALSE)),\"X\",\"\")","v":""},null,{"$f":"IF(ISBLANK(VLOOKUP(K235,INVENTORYDATA,13,FALSE)),\"\",VLOOKUP(K235,INVENTORYDATA,13,FALSE))","v":{"$error":"#N/A"}}]
["Install Memory",null,"X",{"$nulls":3},"Install Memory",null,"X"]
["Power ON",null,"X",{"$nulls":3},"Power ON",null,"X"]
["Record BIOS info",null,"X",{"$nulls":3},"Record BIOS info",null,"X"]
["Check Optical Drive",null,{"$f":"IF((VLOOKUP(E235,INVENTORYDATA,7,FALSE))=\"YES\",\"X\",\"\")","v":{"$error":"#N/A"}},{"$f":"IF((VLOOKUP(E235,INVENTORYDATA,7,FALSE))=\"NO\",\"X\",\"\")","v":{"$error":"#N/A"}},null,null,"Check Optical Drive",null,{"$f":"IF((VLOOKUP(K235,INVENTORYDATA,7,FALSE))=\"YES\",\"X\",\"\")","v":{"$error":"#N/A"}},{"$f":"IF((VLOOKUP(K235,INVENTORYDATA,7,FALSE))=\"NO\",\"X\",\"\")","v":{"$error":"#N/A"}}]
["Power Off",null,"X",{"$nulls":3},"Power Off",null,"X"]
["HDD Serial No.",null,{"$f":"IF(ISBLANK(VLOOKUP(E235,INVENTORYDATA,12,FALSE)),\"\",VLOOKUP(E235,INVENTORYDATA,12,FALSE))","v":{"$error":"#N/A"}},{"$nulls":3},"HDD Serial No.",null,{"$f":"IF(ISBLANK(VLOOKUP(K235,INVENTORYDATA,12,FALSE)),\"\",VLOOKUP(K235,INVENTORYDATA,12,FALSE))","v":{"$error":"#N/A"}}]
[]
["Tested for key functions,R2/Ready for Resale",{"$nulls":5},"Tested for key functions,R2/Ready for Resale"]
["BIOS Lock","Caddy","Optical","WebCam","Battery",null,"BIOS Lock","Caddy","Optical","WebCam","Battery"]
[null,null,{"$f":"VLOOKUP(E235,INVENTORY!$A$2:$N$100,7,FALSE)","v":{"$error":"#N/A"}},{"$f":"VLOOKUP(E235,INVENTORY!$A$2:$N$100,8,FALSE)","v":{"$error":"#N/A"}},{"$f":"VLOOKUP(E235,INVENTORY!$A$2:$N$100,9,FALSE)","v":{"$error":"#N/A"}},{"$nulls":3},{"$f":"VLOOKUP(K235,INVENTORY!$A$2:$N$100,7,FALSE)","v":{"$error":"#N/A"}},{"$f":"VLOOKUP(K235,INVENTORY!$A$2:$N$100,8,FALSE)","v":{"$error":"#N/A"}},{"$f":"VLOOKUP(K235,INVENTORY!$A$2:$N$100,9,FALSE)","v":{"$error":"#N/A"}}]
[]
["CPU Cosmetics Defects:",null,{"$f":"\"Function Code: \"&VLOOKUP(E235,INVENTORY!$A$2:$Q$100,14,FALSE)","v":{"$error":"#N/A"}},{"$nulls":3},"CPU Cosmetics Defects:",null,{"$f":"\"Function Code: \"&VLOOKUP(K235,INVENTORY!$A$2:$Q$100,14,FALSE)","v":{"$error":"#N/A"}}]
[]
[null,null,{"$f":"\"Cosmetic Code: \"&VLOOKUP(E235,INVENTORY!$A$2:$Q$100,15,FALSE)","v":{"$error":"#N/A"}},{"$nulls":5},{"$f":"\"Cosmetic Code: \"&VLOOKUP(K235,INVENTORY!$A$2:$Q$100,15,FALSE)","v":{"$error":"#N/A"}}]
[]
["Casing","Plugs/Ports",{"$nulls":4},"Casing","Plugs/Ports"]
["Pass","Pass",{"$nulls":4},"Pass","Pass"]
["Fail","Fail",null,"TRRC#:L.T.R.",null,null,"Fail","Fail",null,"TRRC#:L.T.R."]
[]
["LAPTOP TESTING RECORD",{"$nulls":5},"LAPTOP TESTING RECORD"]
[]
[{"$nulls":3},"ITEM #",{"$f":"E235+2","v":19},{"$nulls":4},"ITEM #",{"$f":"K235+2","v":20}]
["Tester: ","RR","Date:",{"$f":"NOW()","v":"2025-12-15T11:00:59.760"},null,null,"Tester: ","RR","Date:",{"$f":"NOW()","v":"2025-12-15T11:00:59.760"}]
["Type: ","LAPTOP","SN:",{"$f":"VLOOKUP(E264,INVENTORYDATA,10,FALSE)","v":{"$error":"#N/A"}},null,null,"Type: ","LAPTOP","SN:",{"$f":"VLOOKUP(K264,INVENTORYDATA,10,FALSE)","v":{"$error":"#N/A"}}]
[{"$f":"\"Make: \"","v":"Make: "},{"$f":"VLOOKUP(E264,INVENTORYDATA,2,FALSE)","v":{"$error":"#N/A"}},{"$f":"\"Model: \"","v":"Model: "},{"$f":"VLOOKUP(E264,INVENTORYDATA,3,FALSE)","v":{"$error":"#N/A"}},null,null,{"$f":"\"Make: \"","v":"Make: "},{"$f":"VLOOKUP(K264,INVENTORYDATA,2,FALSE)","v":{"$error":"#N/A"}},{"$f":"\"Model: \"","v":"Model: "},{"$f":"VLOOKUP(K264,INVENTORYDATA,3,FALSE)","v":{"$error":"#N/A"}}]
[{"$f":"\"CPU/Speed: \"","v":"CPU/Speed: "},{"$f":"VLOOKUP(E264,INVENTORYDATA,4,FALSE)&\" / \"&VLOOKUP(E264,INVENTORYDATA,5,FALSE)&\"GHz\"","v":{"$error":"#N/A"}},null,{"$f":"\"Memory: \"","v":"Memory: "},{"$f":"VLOOKUP(E264,INVENTORYDATA,6,FALSE)","v":{"$error":"#N/A"}},null,{"$f":"\"CPU/Speed: \"","v":"CPU/Speed: "},{"$f":"VLOOKUP(K264,INVENTORYDATA,4,FALSE)&\" / \"&VLOOKUP(K264,INVENTORYDATA,5,FALSE)&\"GHz\"","v":{"$error":"#N/A"}},null,{"$f":"\"Memory: \"","v":"Memory: "},{"$f":"VLOOKUP(K264,INVENTORYDATA,6,FALSE)","v":{"$error":"#N/A"}}]
[]
["Key Function",null,"Pass","Fail ","Comments",null,"Key Function",null,"Pass","Fail ","Comments"]
["Hard Drive Removed",null,{"$f":"IF(ISBLANK(VLOOKUP(E264,INVENTORYDATA,13,FALSE)),\"X\",\"\")","v":""},null,{"$f":"IF(ISBLANK(VLOOKUP(E264,INVENTORYDATA,13,FALSE)),\"\",VLOOKUP(E264,INVENTORYDATA,13,FALSE))","v":{"$error":"#N/A"}},null,"Hard Drive Removed",null,{"$f":"IF(ISBLANK(VLOOKUP(K264,INVENTORYDATA,13,FALSE)),\"X\",\"\")","v":""},null,{"$f":"IF(ISBLANK(VLOOKUP(K264,INVENTORYDATA,13,FALSE)),\"\",VLOOKUP(K264,INVENTORYDATA,13,FALSE))","v":{"$error":"#N/A"}}]
["Install Memory",null,"X",{"$nulls":3},"Install Memory",null,"X"]
["Power ON",null,"X",{"$nulls":3},"Power ON",null,"X"]
["Record BIOS info",null,"X",{"$nulls":3},"Record BIOS info",null,"X"]
["Check Optical Drive",null,{"$f":"IF((VLOOKUP(E264,INVENTORYDATA,7,FALSE))=\"YES\",\"X\",\"\")","v":{"$error":"#N/A"}},{"$f":"IF((VLOOKUP(E264,INVENTORYDATA,7,FALSE))=\"NO\",\"X\",\"\")","v":{"$error":"#N/A"}},null,null,"Check Optical Drive",null,{"$f":"IF((VLOOKUP(K264,INVENTORYDATA,7,FALSE))=\"YES\",\"X\",\"\")","v":{"$error":"#N/A"}},{"$f":"IF((VLOOKUP(K264,INVENTORYDATA,7,FALSE))=\"NO\",\"X\",\"\")","v":{"$error":"#N/A"}}]
["Power Off",null,"X",{"$nulls":3},"Power Off",null,"X"]
["HDD Serial No.",null,{"$f":"IF(ISBLANK(VLOOKUP(E264,INVENTORYDATA,12,FALSE)),\"\",VLOOKUP(E264,INVENTORYDATA,12,FALSE))","v":{"$error":"#N/A"}},{"$nulls":3},"HDD Serial No.",null,{"$f":"IF(ISBLANK(VLOOKUP(K264,INVENTORYDATA,12,FALSE)),\"\",VLOOKUP(K264,INVENTORYDATA,12,FALSE))","v":{"$error":"#N/A"}}]
[]
["Tested for key functions,R2/Ready for Resale",{"$nulls":5},"Tested for key functions,R2/Ready for Resale"]
["BIOS Lock","Caddy","Optical","WebCam","Battery",null,"BIOS Lock","Caddy","Optical","WebCam","Battery"]
[null,null,{"$f":"VLOOKUP(E264,INVENTORY!$A$2:$N$100,7,FALSE)","v":{"$error":"#N/A"}},{"$f":"VLOOKUP(E264,INVENTORY!$A$2:$N$100,8,FALSE)","v":{"$error":"#N/A"}},{"$f":"VLOOKUP(E264,INVENTORY!$A$2:$N$100,9,FALSE)","v":{"$error":"#N/A"}},{"$nulls":3},{"$f":"VLOOKUP(K264,INVENTORY!$A$2:$N$100,7,FALSE)","v":{"$error":"#N/A"}},{"$f":"VLOOKUP(K264,INVENTORY!$A$2:$N$100,8,FALSE)","v":{"$error":"#N/A"}},{"$f":"VLOOKUP(K264,INVENTORY!$A$2:$N$100,9,FALSE)","v":{"$error":"#N/A"}}]
[]
["CPU Cosmetics Defects:",null,{"$f":"\"Function Code: \"&VLOOKUP(E264,INVENTORY!$A$2:$Q$100,14,FALSE)","v":{"$error":"#N/A"}},{"$nulls":3},"CPU Cosmetics Defects:",null,{"$f":"\"Function Code: \"&VLOOKUP(K264,INVENTORY!$A$2:$Q$100,14,FALSE)","v":{"$error":"#N/A"}}]
[]
[null,null,{"$f":"\"Cosmetic Code: \"&VLOOKUP(E264,INVENTORY!$A$2:$Q$100,15,FALSE)","v":{"$error":"#N/A"}},{"$nulls":5},{"$f":"\"Cosmetic Code: \"&VLOOKUP(K264,INVENTORY!$A$2:$Q$100,15,FALSE)","v":{"$error":"#N/A"}}]
[]
["Casing","Plugs/Ports",{"$nulls":4},"Casing","Plugs/Ports"]
["Pass","Pass",{"$nulls":4},"Pass","Pass"]
["Fail","Fail",null,"TRRC#:L.T.R.",null,null,"Fail","Fail",null,"TRRC#:L.T.R."]
[]
["LAPTOP TESTING RECORD",{"$nulls":5},"LAPTOP TESTING RECORD"]
[]
[{"$nulls":3},"ITEM #",{"$f":"E264+2","v":21},{"$nulls":4},"ITEM #",{"$f":"K264+2","v":22}]
["Tester: ","RR","Date:",{"$f":"NOW()","v":"2025-12-15T11:00:59.760"},null,null,"Tester: ","RR","Date:",{"$f":"NOW()","v":"2025-12-15T11:00:59.760"}]
["Type: ","LAPTOP","SN:",{"$f":"VLOOKUP(E293,INVENTORYDATA,10,FALSE)","v":{"$error":"#N/A"}},null,null,"Type: ","LAPTOP","SN:",{"$f":"VLOOKUP(K293,INVENTORYDATA,10,FALSE)","v":{"$error":"#N/A"}}]
[{"$f":"\"Make: \"","v":"Make: "},{"$f":"VLOOKUP(E293,INVENTORYDATA,2,FALSE)","v":{"$error":"#N/A"}},{"$f":"\"Model: \"","v":"Model: "},{"$f":"VLOOKUP(E293,INVENTORYDATA,3,FALSE)","v":{"$error":"#N/A"}},null,null,{"$f":"\"Make: \"","v":"Make: "},{"$f":"VLOOKUP(K293,INVENTORYDATA,2,FALSE)","v":{"$error":"#N/A"}},{"$f":"\"Model: \"","v":"Model: "},{"$f":"VLOOKUP(K293,INVENTORYDATA,3,FALSE)","v":{"$error":"#N/A"}}]
[{"$f":"\"CPU/Speed: \"","v":"CPU/Speed: "},{"$f":"VLOOKUP(E293,INVENTORYDATA,4,FALSE)&\" / \"&VLOOKUP(E293,INVENTORYDATA,5,FALSE)&\"GHz\"","v":{"$error":"#N/A"}},null,{"$f":"\"Memory: \"","v":"Memory: "},{"$f":"VLOOKUP(E293,INVENTORYDATA,6,FALSE)","v":{"$error":"#N/A"}},null,{"$f":"\"CPU/Speed: \"","v":"CPU/Speed: "},{"$f":"VLOOKUP(K293,INVENTORYDATA,4,FALSE)&\" / \"&VLOOKUP(K293,INVENTORYDATA,5,FALSE)&\"GHz\"","v":{"$error":"#N/A"}},null,{"$f":"\"Memory: \"","v":"Memory: "},{"$f":"VLOOKUP(K293,INVENTORYDATA,6,FALSE)","v":{"$error":"#N/A"}}]
[]
["Key Function",null,"Pass","Fail ","Comments",null,"Key Function",null,"Pass","Fail ","Comments"]
["Hard Drive Removed",null,{"$f":"IF(ISBLANK(VLOOKUP(E293,INVENTORYDATA,13,FALSE)),\"X\",\"\")","v":""},null,{"$f":"IF(ISBLANK(VLOOKUP(E293,INVENTORYDATA,13,FALSE)),\"\",VLOOKUP(E293,INVENTORYDATA,13,FALSE))","v":{"$error":"#N/A"}},null,"Hard Drive Removed",null,{"$f":"IF(ISBLANK(VLOOKUP(K293,INVENTORYDATA,13,FALSE)),\"X\",\"\")","v":""},null,{"$f":"IF(ISBLANK(VLOOKUP(K293,INVENTORYDATA,13,FALSE)),\"\",VLOOKUP(K293,INVENTORYDATA,13,FALSE))","v":{"$error":"#N/A"}}]
["Install Memory",null,"X",{"$nulls":3},"Install Memory",null,"X"]
["Power ON",null,"X",{"$nulls":3},"Power ON",null,"X"]
["Record BIOS info",null,"X",{"$nulls":3},"Record BIOS info",null,"X"]
["Check Optical Drive",null,{"$f":"IF((VLOOKUP(E293,INVENTORYDATA,7,FALSE))=\"YES\",\"X\",\"\")","v":{"$error":"#N/A"}},{"$f":"IF((VLOOKUP(E293,INVENTORYDATA,7,FALSE))=\"NO\",\"X\",\"\")","v":{"$error":"#N/A"}},null,null,"Check Optical Drive",null,{"$f":"IF((VLOOKUP(K293,INVENTORYDATA,7,FALSE))=\"YES\",\"X\",\"\")","v":{"$error":"#N/A"}},{"$f":"IF((VLOOKUP(K293,INVENTORYDATA,7,FALSE))=\"NO\",\"X\",\"\")","v":{"$error":"#N/A"}}]
["Power Off",null,"X",{"$nulls":3},"Power Off",null,"X"]
["HDD Serial No.",null,{"$f":"IF(ISBLANK(VLOOKUP(E293,INVENTORYDATA,12,FALSE)),\"\",VLOOKUP(E293,INVENTORYDATA,12,FALSE))","v":{"$error":"#N/A"}},{"$nulls":3},"HDD Serial No.",null,{"$f":"IF(ISBLANK(VLOOKUP(K293,INVENTORYDATA,12,FALSE)),\"\",VLOOKUP(K293,INVENTORYDATA,12,FALSE))","v":{"$error":"#N/A"}}]
[]
["Tested for key functions,R2/Ready for Resale",{"$nulls":5},"Tested for key functions,R2/Ready for Resale"]
["BIOS Lock","Caddy","Optical","WebCam","Battery",null,"BIOS Lock","Caddy","Optical","WebCam","Battery"]
[null,null,{"$f":"VLOOKUP(E293,INVENTORY!$A$2:$N$100,7,FALSE)","v":{"$error":"#N/A"}},{"$f":"VLOOKUP(E293,INVENTORY!$A$2:$N$100,8,FALSE)","v":{"$error":"#N/A"}},{"$f":"VLOOKUP(E293,INVENTORY!$A$2:$N$100,9,FALSE)","v":{"$error":"#N/A"}},{"$nulls":3},{"$f":"VLOOKUP(K293,INVENTORY!$A$2:$N$100,7,FALSE)","v":{"$error":"#N/A"}},{"$f":"VLOOKUP(K293,INVENTORY!$A$2:$N$100,8,FALSE)","v":{"$error":"#N/A"}},{"$f":"VLOOKUP(K293,INVENTORY!$A$2:$N$100,9,FALSE)","v":{"$error":"#N/A"}}]
[]
["CPU Cosmetics Defects:",null,{"$f":"\"Function Code: \"&VLOOKUP(E293,INVENTORY!$A$2:$Q$100,14,FALSE)","v":{"$error":"#N/A"}},{"$nulls":3},"CPU Cosmetics Defects:",null,{"$f":"\"Function Code: \"&VLOOKUP(K293,INVENTORY!$A$2:$Q$100,14,FALSE)","v":{"$error":"#N/A"}}]
[]
[null,null,{"$f":"\"Cosmetic Code: \"&VLOOKUP(E293,INVENTORY!$A$2:$Q$100,15,FALSE)","v":{"$error":"#N/A"}},{"$nulls":5},{"$f":"\"Cosmetic Code: \"&VLOOKUP(K293,INVENTORY!$A$2:$Q$100,15,FALSE)","v":{"$error":"#N/A"}}]
[]
["Casing","Plugs/Ports",{"$nulls":4},"Casing","Plugs/Ports"]
["Pass","Pass",{"$nulls":4},"Pass","Pass"]
["Fail","Fail",null,"TRRC#:L.T.R.",null,null,"Fail","Fail",null,"TRRC#:L.T.R."]
[]
["LAPTOP TESTING RECORD",{"$nulls":5},"LAPTOP TESTING RECORD"]
[]
[{"$nulls":3},"ITEM #",{"$f":"E293+2","v":23},{"$nulls":4},"ITEM #",{"$f":"K293+2","v":24}]
["Tester: ","RR","Date:",{"$f":"NOW()","v":"2025-12-15T11:00:59.760"},null,null,"Tester: ","RR","Date:",{"$f":"NOW()","v":"2025-12-15T11:00:59.760"}]
["Type: ","LAPTOP","SN:",{"$f":"VLOOKUP(E322,INVENTORYDATA,10,FALSE)","v":{"$error":"#N/A"}},null,null,"Type: ","LAPTOP","SN:",{"$f":"VLOOKUP(K322,INVENTORYDATA,10,FALSE)","v":{"$error":"#N/A"}}]
[{"$f":"\"Make: \"","v":"Make: "},{"$f":"VLOOKUP(E322,INVENTORYDATA,2,FALSE)","v":{"$error":"#N/A"}},{"$f":"\"Model: \"","v":"Model: "},{"$f":"VLOOKUP(E322,INVENTORYDATA,3,FALSE)","v":{"$error":"#N/A"}},null,null,{"$f":"\"Make: \"","v":"Make: "},{"$f":"VLOOKUP(K322,INVENTORYDATA,2,FALSE)","v":{"$error":"#N/A"}},{"$f":"\"Model: \"","v":"Model: "},{"$f":"VLOOKUP(K322,INVENTORYDATA,3,FALSE)","v":{"$error":"#N/A"}}]
[{"$f":"\"CPU/Speed: \"","v":"CPU/Speed: "},{"$f":"VLOOKUP(E322,INVENTORYDATA,4,FALSE)&\" / \"&VLOOKUP(E322,INVENTORYDATA,5,FALSE)&\"GHz\"","v":{"$error":"#N/A"}},null,{"$f":"\"Memory: \"","v":"Memory: "},{"$f":"VLOOKUP(E322,INVENTORYDATA,6,FALSE)","v":{"$error":"#N/A"}},null,{"$f":"\"CPU/Speed: \"","v":"CPU/Speed: "},{"$f":"VLOOKUP(K322,INVENTORYDATA,4,FALSE)&\" / \"&VLOOKUP(K322,INVENTORYDATA,5,FALSE)&\"GHz\"","v":{"$error":"#N/A"}},null,{"$f":"\"Memory: \"","v":"Memory: "},{"$f":"VLOOKUP(K322,INVENTORYDATA,6,FALSE)","v":{"$error":"#N/A"}}]
[]
["Key Function",null,"Pass","Fail ","Comments",null,"Key Function",null,"Pass","Fail ","Comments"]
["Hard Drive Removed",null,{"$f":"IF(ISBLANK(VLOOKUP(E322,INVENTORYDATA,13,FALSE)),\"X\",\"\")","v":""},null,{"$f":"IF(ISBLANK(VLOOKUP(E322,INVENTORYDATA,13,FALSE)),\"\",VLOOKUP(E322,INVENTORYDATA,13,FALSE))","v":{"$error":"#N/A"}},null,"Hard Drive Removed",null,{"$f":"IF(ISBLANK(VLOOKUP(K322,INVENTORYDATA,13,FALSE)),\"X\",\"\")","v":""},null,{"$f":"IF(ISBLANK(VLOOKUP(K322,INVENTORYDATA,13,FALSE)),\"\",VLOOKUP(K322,INVENTORYDATA,13,FALSE))","v":{"$error":"#N/A"}}]
["Install Memory",null,"X",{"$nulls":3},"Install Memory",null,"X"]
["Power ON",null,"X",{"$nulls":3},"Power ON",null,"X"]
["Record BIOS info",null,"X",{"$nulls":3},"Record BIOS info",null,"X"]
["Check Optical Drive",null,{"$f":"IF((VLOOKUP(E322,INVENTORYDATA,7,FALSE))=\"YES\",\"X\",\"\")","v":{"$error":"#N/A"}},{"$f":"IF((VLOOKUP(E322,INVENTORYDATA,7,FALSE))=\"NO\",\"X\",\"\")","v":{"$error":"#N/A"}},null,null,"Check Optical Drive",null,{"$f":"IF((VLOOKUP(K322,INVENTORYDATA,7,FALSE))=\"YES\",\"X\",\"\")","v":{"$error":"#N/A"}},{"$f":"IF((VLOOKUP(K322,INVENTORYDATA,7,FALSE))=\"NO\",\"X\",\"\")","v":{"$error":"#N/A"}}]
["Power Off",null,"X",{"$nulls":3},"Power Off",null,"X"]
["HDD Serial No.",null,{"$f":"IF(ISBLANK(VLOOKUP(E322,INVENTORYDATA,12,FALSE)),\"\",VLOOKUP(E322,INVENTORYDATA,12,FALSE))","v":{"$error":"#N/A"}},{"$nulls":3},"HDD Serial No.",null,{"$f":"IF(ISBLANK(VLOOKUP(K322,INVENTORYDATA,12,FALSE)),\"\",VLOOKUP(K322,INVENTORYDATA,12,FALSE))","v":{"$error":"#N/A"}}]
[]
["Tested for key functions,R2/Ready for Resale",{"$nulls":5},"Tested for key functions,R2/Ready for Resale"]
["BIOS Lock","Caddy","Optical","WebCam","Battery",null,"BIOS Lock","Caddy","Optical","WebCam","Battery"]
[null,null,{"$f":"VLOOKUP(E322,INVENTORY!$A$2:$N$100,7,FALSE)","v":{"$error":"#N/A"}},{"$f":"VLOOKUP(E322,INVENTORY!$A$2:$N$100,8,FALSE)","v":{"$error":"#N/A"}},{"$f":"VLOOKUP(E322,INVENTORY!$A$2:$N$100,9,FALSE)","v":{"$error":"#N/A"}},{"$nulls":3},{"$f":"VLOOKUP(K322,INVENTORY!$A$2:$N$100,7,FALSE)","v":{"$error":"#N/A"}},{"$f":"VLOOKUP(K322,INVENTORY!$A$2:$N$100,8,FALSE)","v":{"$error":"#N/A"}},{"$f":"VLOOKUP(K322,INVENTORY!$A$2:$N$100,9,FALSE)","v":{"$error":"#N/A"}}]
[]
["CPU Cosmetics Defects:",null,{"$f":"\"Function Code: \"&VLOOKUP(E322,INVENTORY!$A$2:$Q$100,14,FALSE)","v":{"$error":"#N/A"}},{"$nulls":3},"CPU Cosmetics Defects:",null,{"$f":"\"Function Code: \"&VLOOKUP(K322,INVENTORY!$A$2:$Q$100,14,FALSE)","v":{"$error":"#N/A"}}]
[]
[null,null,{"$f":"\"Cosmetic Code: \"&VLOOKUP(E322,INVENTORY!$A$2:$Q$100,15,FALSE)","v":{"$error":"#N/A"}},{"$nulls":5},{"$f":"\"Cosmetic Code: \"&VLOOKUP(K322,INVENTORY!$A$2:$Q$100,15,FALSE)","v":{"$error":"#N/A"}}]
[]
["Casing","Plugs/Ports",{"$nulls":4},"Casing","Plugs/Ports"]
["Pass","Pass",{"$nulls":4},"Pass","Pass"]
["Fail","Fail",null,"TRRC#:L.T.R.",null,null,"Fail","Fail",null,"TRRC#:L.T.R."]
[]
["LAPTOP TESTING RECORD",{"$nulls":5},"LAPTOP TESTING RECORD"]
[]
[{"$nulls":3},"ITEM #",{"$f":"E322+2","v":25},{"$nulls":4},"ITEM #",{"$f":"K322+2","v":26}]
["Tester: ","RR","Date:",{"$f":"NOW()","v":"2025-12-15T11:00:59.760"},null,null,"Tester: ","RR","Date:",{"$f":"NOW()","v":"2025-12-15T11:00:59.760"}]
["Type: ","LAPTOP","SN:",{"$f":"VLOOKUP(E351,INVENTORYDATA,10,FALSE)","v":{"$error":"#N/A"}},null,null,"Type: ","LAPTOP","SN:",{"$f":"VLOOKUP(K351,INVENTORYDATA,10,FALSE)","v":{"$error":"#N/A"}}]
[{"$f":"\"Make: \"","v":"Make: "},{"$f":"VLOOKUP(E351,INVENTORYDATA,2,FALSE)","v":{"$error":"#N/A"}},{"$f":"\"Model: \"","v":"Model: "},{"$f":"VLOOKUP(E351,INVENTORYDATA,3,FALSE)","v":{"$error":"#N/A"}},null,null,{"$f":"\"Make: \"","v":"Make: "},{"$f":"VLOOKUP(K351,INVENTORYDATA,2,FALSE)","v":{"$error":"#N/A"}},{"$f":"\"Model: \"","v":"Model: "},{"$f":"VLOOKUP(K351,INVENTORYDATA,3,FALSE)","v":{"$error":"#N/A"}}]
[{"$f":"\"CPU/Speed: \"","v":"CPU/Speed: "},{"$f":"VLOOKUP(E351,INVENTORYDATA,4,FALSE)&\" / \"&VLOOKUP(E351,INVENTORYDATA,5,FALSE)&\"GHz\"","v":{"$error":"#N/A"}},null,{"$f":"\"Memory: \"","v":"Memory: "},{"$f":"VLOOKUP(E351,INVENTORYDATA,6,FALSE)","v":{"$error":"#N/A"}},null,{"$f":"\"CPU/Speed: \"","v":"CPU/Speed: "},{"$f":"VLOOKUP(K351,INVENTORYDATA,4,FALSE)&\" / \"&VLOOKUP(K351,INVENTORYDATA,5,FALSE)&\"GHz\"","v":{"$error":"#N/A"}},null,{"$f":"\"Memory: \"","v":"Memory: "},{"$f":"VLOOKUP(K351,INVENTORYDATA,6,FALSE)","v":{"$error":"#N/A"}}]
[]
["Key Function",null,"Pass","Fail ","Comments",null,"Key Function",null,"Pass","Fail ","Comments"]
["Hard Drive Removed",null,{"$f":"IF(ISBLANK(VLOOKUP(E351,INVENTORYDATA,13,FALSE)),\"X\",\"\")","v":""},null,{"$f":"IF(ISBLANK(VLOOKUP(E351,INVENTORYDATA,13,FALSE)),\"\",VLOOKUP(E351,INVENTORYDATA,13,FALSE))","v":{"$error":"#N/A"}},null,"Hard Drive Removed",null,{"$f":"IF(ISBLANK(VLOOKUP(K351,INVENTORYDATA,13,FALSE)),\"X\",\"\")","v":""},null,{"$f":"IF(ISBLANK(VLOOKUP(K351,INVENTORYDATA,13,FALSE)),\"\",VLOOKUP(K351,INVENTORYDATA,13,FALSE))","v":{"$error":"#N/A"}}]
["Install Memory",null,"X",{"$nulls":3},"Install Memory",null,"X"]
["Power ON",null,"X",{"$nulls":3},"Power ON",null,"X"]
["Record BIOS info",null,"X",{"$nulls":3},"Record BIOS info",null,"X"]
["Check Optical Drive",null,{"$f":"IF((VLOOKUP(E351,INVENTORYDATA,7,FALSE))=\"YES\",\"X\",\"\")","v":{"$error":"#N/A"}},{"$f":"IF((VLOOKUP(E351,INVENTORYDATA,7,FALSE))=\"NO\",\"X\",\"\")","v":{"$error":"#N/A"}},null,null,"Check Optical Drive",null,{"$f":"IF((VLOOKUP(K351,INVENTORYDATA,7,FALSE))=\"YES\",\"X\",\"\")","v":{"$error":"#N/A"}},{"$f":"IF((VLOOKUP(K351,INVENTORYDATA,7,FALSE))=\"NO\",\"X\",\"\")","v":{"$error":"#N/A"}}]
["Power Off",null,"X",{"$nulls":3},"Power Off",null,"X"]
["HDD Serial No.",null,{"$f":"IF(ISBLANK(VLOOKUP(E351,INVENTORYDATA,12,FALSE)),\"\",VLOOKUP(E351,INVENTORYDATA,12,FALSE))","v":{"$error":"#N/A"}},{"$nulls":3},"HDD Serial No.",null,{"$f":"IF(ISBLANK(VLOOKUP(K351,INVENTORYDATA,12,FALSE)),\"\",VLOOKUP(K351,INVENTORYDATA,12,FALSE))","v":{"$error":"#N/A"}}]
[]
["Tested for key functions,R2/Ready for Resale",{"$nulls":5},"Tested for key functions,R2/Ready for Resale"]
["BIOS Lock","Caddy","Optical","WebCam","Battery",null,"BIOS Lock","Caddy","Optical","WebCam","Battery"]
[null,null,{"$f":"VLOOKUP(E351,INVENTORY!$A$2:$N$100,7,FALSE)","v":{"$error":"#N/A"}},{"$f":"VLOOKUP(E351,INVENTORY!$A$2:$N$100,8,FALSE)","v":{"$error":"#N/A"}},{"$f":"VLOOKUP(E351,INVENTORY!$A$2:$N$100,9,FALSE)","v":{"$error":"#N/A"}},{"$nulls":3},{"$f":"VLOOKUP(K351,INVENTORY!$A$2:$N$100,7,FALSE)","v":{"$error":"#N/A"}},{"$f":"VLOOKUP(K351,INVENTORY!$A$2:$N$100,8,FALSE)","v":{"$error":"#N/A"}},{"$f":"VLOOKUP(K351,INVENTORY!$A$2:$N$100,9,FALSE)","v":{"$error":"#N/A"}}]
[]
["CPU Cosmetics Defects:",null,{"$f":"\"Function Code: \"&VLOOKUP(E351,INVENTORY!$A$2:$Q$100,14,FALSE)","v":{"$error":"#N/A"}},{"$nulls":3},"CPU Cosmetics Defects:",null,{"$f":"\"Function Code: \"&VLOOKUP(K351,INVENTORY!$A$2:$Q$100,14,FALSE)","v":{"$error":"#N/A"}}]
[]
[null,null,{"$f":"\"Cosmetic Code: \"&VLOOKUP(E351,INVENTORY!$A$2:$Q$100,15,FALSE)","v":{"$error":"#N/A"}},{"$nulls":5},{"$f":"\"Cosmetic Code: \"&VLOOKUP(K351,INVENTORY!$A$2:$Q$100,15,FALSE)","v":{"$error":"#N/A"}}]
[]
["Casing","Plugs/Ports",{"$nulls":4},"Casing","Plugs/Ports"]
["Pass","Pass",{"$nulls":4},"Pass","Pass"]
["Fail","Fail",null,"TRRC#:L.T.R.",null,null,"Fail","Fail",null,"TRRC#:L.T.R."]
[]
["LAPTOP TESTING RECORD",{"$nulls":5},"LAPTOP TESTING RECORD"]
[]
[{"$nulls":3},"ITEM #",{"$f":"E351+2","v":27},{"$nulls":4},"ITEM #",{"$f":"K351+2","v":28}]
["Tester: ","RR","Date:",{"$f":"NOW()","v":"2025-12-15T11:00:59.760"},null,null,"Tester: ","RR","Date:",{"$f":"NOW()","v":"2025-12-15T11:00:59.760"}]
["Type: ","LAPTOP","SN:",{"$f":"VLOOKUP(E380,INVENTORYDATA,10,FALSE)","v":{"$error":"#N/A"}},null,null,"Type: ","LAPTOP","SN:",{"$f":"VLOOKUP(K380,INVENTORYDATA,10,FALSE)","v":{"$error":"#N/A"}}]
[{"$f":"\"Make: \"","v":"Make: "},{"$f":"VLOOKUP(E380,INVENTORYDATA,2,FALSE)","v":{"$error":"#N/A"}},{"$f":"\"Model: \"","v":"Model: "},{"$f":"VLOOKUP(E380,INVENTORYDATA,3,FALSE)","v":{"$error":"#N/A"}},null,null,{"$f":"\"Make: \"","v":"Make: "},{"$f":"VLOOKUP(K380,INVENTORYDATA,2,FALSE)","v":{"$error":"#N/A"}},{"$f":"\"Model: \"","v":"Model: "},{"$f":"VLOOKUP(K380,INVENTORYDATA,3,FALSE)","v":{"$error":"#N/A"}}]
[{"$f":"\"CPU/Speed: \"","v":"CPU/Speed: "},{"$f":"VLOOKUP(E380,INVENTORYDATA,4,FALSE)&\" / \"&VLOOKUP(E380,INVENTORYDATA,5,FALSE)&\"GHz\"","v":{"$error":"#N/A"}},null,{"$f":"\"Memory: \"","v":"Memory: "},{"$f":"VLOOKUP(E380,INVENTORYDATA,6,FALSE)","v":{"$error":"#N/A"}},null,{"$f":"\"CPU/Speed: \"","v":"CPU/Speed: "},{"$f":"VLOOKUP(K380,INVENTORYDATA,4,FALSE)&\" / \"&VLOOKUP(K380,INVENTORYDATA,5,FALSE)&\"GHz\"","v":{"$error":"#N/A"}},null,{"$f":"\"Memory: \"","v":"Memory: "},{"$f":"VLOOKUP(K380,INVENTORYDATA,6,FALSE)","v":{"$error":"#N/A"}}]
[]
["Key Function",null,"Pass","Fail ","Comments",null,"Key Function",null,"Pass","Fail ","Comments"]
["Hard Drive Removed",null,{"$f":"IF(ISBLANK(VLOOKUP(E380,INVENTORYDATA,13,FALSE)),\"X\",\"\")","v":""},null,{"$f":"IF(ISBLANK(VLOOKUP(E380,INVENTORYDATA,13,FALSE)),\"\",VLOOKUP(E380,INVENTORYDATA,13,FALSE))","v":{"$error":"#N/A"}},null,"Hard Drive Removed",null,{"$f":"IF(ISBLANK(VLOOKUP(K380,INVENTORYDATA,13,FALSE)),\"X\",\"\")","v":""},null,{"$f":"IF(ISBLANK(VLOOKUP(K380,INVENTORYDATA,13,FALSE)),\"\",VLOOKUP(K380,INVENTORYDATA,13,FALSE))","v":{"$error":"#N/A"}}]
["Install Memory",null,"X",{"$nulls":3},"Install Memory",null,"X"]
["Power ON",null,"X",{"$nulls":3},"Power ON",null,"X"]
["Record BIOS info",null,"X",{"$nulls":3},"Record BIOS info",null,"X"]
["Check Optical Drive",null,{"$f":"IF((VLOOKUP(E380,INVENTORYDATA,7,FALSE))=\"YES\",\"X\",\"\")","v":{"$error":"#N/A"}},{"$f":"IF((VLOOKUP(E380,INVENTORYDATA,7,FALSE))=\"NO\",\"X\",\"\")","v":{"$error":"#N/A"}},null,null,"Check Optical Drive",null,{"$f":"IF((VLOOKUP(K380,INVENTORYDATA,7,FALSE))=\"YES\",\"X\",\"\")","v":{"$error":"#N/A"}},{"$f":"IF((VLOOKUP(K380,INVENTORYDATA,7,FALSE))=\"NO\",\"X\",\"\")","v":{"$error":"#N/A"}}]
["Power Off",null,"X",{"$nulls":3},"Power Off",null,"X"]
["HDD Serial No.",null,{"$f":"IF(ISBLANK(VLOOKUP(E380,INVENTORYDATA,12,FALSE)),\"\",VLOOKUP(E380,INVENTORYDATA,12,FALSE))","v":{"$error":"#N/A"}},{"$nulls":3},"HDD Serial No.",null,{"$f":"IF(ISBLANK(VLOOKUP(K380,INVENTORYDATA,12,FALSE)),\"\",VLOOKUP(K380,INVENTORYDATA,12,FALSE))","v":{"$error":"#N/A"}}]
[]
["Tested for key functions,R2/Ready for Resale",{"$nulls":5},"Tested for key functions,R2/Ready for Resale"]
["BIOS Lock","Caddy","Optical","WebCam","Battery",null,"BIOS Lock","Caddy","Optical","WebCam","Battery"]
[null,null,{"$f":"VLOOKUP(E380,INVENTORY!$A$2:$N$100,7,FALSE)","v":{"$error":"#N/A"}},{"$f":"VLOOKUP(E380,INVENTORY!$A$2:$N$100,8,FALSE)","v":{"$error":"#N/A"}},{"$f":"VLOOKUP(E380,INVENTORY!$A$2:$N$100,9,FALSE)","v":{"$error":"#N/A"}},{"$nulls":3},{"$f":"VLOOKUP(K380,INVENTORY!$A$2:$N$100,7,FALSE)","v":{"$error":"#N/A"}},{"$f":"VLOOKUP(K380,INVENTORY!$A$2:$N$100,8,FALSE)","v":{"$error":"#N/A"}},{"$f":"VLOOKUP(K380,INVENTORY!$A$2:$N$100,9,FALSE)","v":{"$error":"#N/A"}}]
[]
["CPU Cosmetics Defects:",null,{"$f":"\"Function Code: \"&VLOOKUP(E380,INVENTORY!$A$2:$Q$100,14,FALSE)","v":{"$error":"#N/A"}},{"$nulls":3},"CPU Cosmetics Defects:",null,{"$f":"\"Function Code: \"&VLOOKUP(K380,INVENTORY!$A$2:$Q$100,14,FALSE)","v":{"$error":"#N/A"}}]
[]
[null,null,{"$f":"\"Cosmetic Code: \"&VLOOKUP(E380,INVENTORY!$A$2:$Q$100,15,FALSE)","v":{"$error":"#N/A"}},{"$nulls":5},{"$f":"\"Cosmetic Code: \"&VLOOKUP(K380,INVENTORY!$A$2:$Q$100,15,FALSE)","v":{"$error":"#N/A"}}]
[]
["Casing","Plugs/Ports",{"$nulls":4},"Casing","Plugs/Ports"]
["Pass","Pass",{"$nulls":4},"Pass","Pass"]
["Fail","Fail",null,"TRRC#:L.T.R.",null,null,"Fail","Fail",null,"TRRC#:L.T.R."]
[]
["LAPTOP TESTING RECORD",{"$nulls":5},"LAPTOP TESTING RECORD"]
[]
[{"$nulls":3},"ITEM #",{"$f":"E380+2","v":29},{"$nulls":4},"ITEM #",{"$f":"K380+2","v":30}]
["Tester: ","RR","Date:",{"$f":"NOW()","v":"2025-12-15T11:00:59.760"},null,null,"Tester: ","RR","Date:",{"$f":"NOW()","v":"2025-12-15T11:00:59.760"}]
["Type: ","LAPTOP","SN:",{"$f":"VLOOKUP(E409,INVENTORYDATA,10,FALSE)","v":{"$error":"#N/A"}},null,null,"Type: ","LAPTOP","SN:",{"$f":"VLOOKUP(K409,INVENTORYDATA,10,FALSE)","v":{"$error":"#N/A"}}]
[{"$f":"\"Make: \"","v":"Make: "},{"$f":"VLOOKUP(E409,INVENTORYDATA,2,FALSE)","v":{"$error":"#N/A"}},{"$f":"\"Model: \"","v":"Model: "},{"$f":"VLOOKUP(E409,INVENTORYDATA,3,FALSE)","v":{"$error":"#N/A"}},null,null,{"$f":"\"Make: \"","v":"Make: "},{"$f":"VLOOKUP(K409,INVENTORYDATA,2,FALSE)","v":{"$error":"#N/A"}},{"$f":"\"Model: \"","v":"Model: "},{"$f":"VLOOKUP(K409,INVENTORYDATA,3,FALSE)","v":{"$error":"#N/A"}}]
[{"$f":"\"CPU/Speed: \"","v":"CPU/Speed: "},{"$f":"VLOOKUP(E409,INVENTORYDATA,4,FALSE)&\" / \"&VLOOKUP(E409,INVENTORYDATA,5,FALSE)&\"GHz\"","v":{"$error":"#N/A"}},null,{"$f":"\"Memory: \"","v":"Memory: "},{"$f":"VLOOKUP(E409,INVENTORYDATA,6,FALSE)","v":{"$error":"#N/A"}},null,{"$f":"\"CPU/Speed: \"","v":"CPU/Speed: "},{"$f":"VLOOKUP(K409,INVENTORYDATA,4,FALSE)&\" / \"&VLOOKUP(K409,INVENTORYDATA,5,FALSE)&\"GHz\"","v":{"$error":"#N/A"}},null,{"$f":"\"Memory: \"","v":"Memory: "},{"$f":"VLOOKUP(K409,INVENTORYDATA,6,FALSE)","v":{"$error":"#N/A"}}]
[]
["Key Function",null,"Pass","Fail ","Comments",null,"Key Function",null,"Pass","Fail ","Comments"]
["Hard Drive Removed",null,{"$f":"IF(ISBLANK(VLOOKUP(E409,INVENTORYDATA,13,FALSE)),\"X\",\"\")","v":""},null,{"$f":"IF(ISBLANK(VLOOKUP(E409,INVENTORYDATA,13,FALSE)),\"\",VLOOKUP(E409,INVENTORYDATA,13,FALSE))","v":{"$error":"#N/A"}},null,"Hard Drive Removed",null,{"$f":"IF(ISBLANK(VLOOKUP(K409,INVENTORYDATA,13,FALSE)),\"X\",\"\")","v":""},null,{"$f":"IF(ISBLANK(VLOOKUP(K409,INVENTORYDATA,13,FALSE)),\"\",VLOOKUP(K409,INVENTORYDATA,13,FALSE))","v":{"$error":"#N/A"}}]
["Install Memory",null,"X",{"$nulls":3},"Install Memory",null,"X"]
["Power ON",null,"X",{"$nulls":3},"Power ON",null,"X"]
["Record BIOS info",null,"X",{"$nulls":3},"Record BIOS info",null,"X"]
["Check Optical Drive",null,{"$f":"IF((VLOOKUP(E409,INVENTORYDATA,7,FALSE))=\"YES\",\"X\",\"\")","v":{"$error":"#N/A"}},{"$f":"IF((VLOOKUP(E409,INVENTORYDATA,7,FALSE))=\"NO\",\"X\",\"\")","v":{"$error":"#N/A"}},null,null,"Check Optical Drive",null,{"$f":"IF((VLOOKUP(K409,INVENTORYDATA,7,FALSE))=\"YES\",\"X\",\"\")","v":{"$error":"#N/A"}},{"$f":"IF((VLOOKUP(K409,INVENTORYDATA,7,FALSE))=\"NO\",\"X\",\"\")","v":{"$error":"#N/A"}}]
["Power Off",null,"X",{"$nulls":3},"Power Off",null,"X"]
["HDD Serial No.",null,{"$f":"IF(ISBLANK(VLOOKUP(E409,INVENTORYDATA,12,FALSE)),\"\",VLOOKUP(E409,INVENTORYDATA,12,FALSE))","v":{"$error":"#N/A"}},{"$nulls":3},"HDD Serial No.",null,{"$f":"IF(ISBLANK(VLOOKUP(K409,INVENTORYDATA,12,FALSE)),\"\",VLOOKUP(K409,INVENTORYDATA,12,FALSE))","v":{"$error":"#N/A"}}]
[]
["Tested for key functions,R2/Ready for Resale",{"$nulls":5},"Tested for key functions,R2/Ready for Resale"]
["BIOS Lock","Caddy","Optical","WebCam","Battery",null,"BIOS Lock","Caddy","Optical","WebCam","Battery"]
[null,null,{"$f":"VLOOKUP(E409,INVENTORY!$A$2:$N$100,7,FALSE)","v":{"$error":"#N/A"}},{"$f":"VLOOKUP(E409,INVENTORY!$A$2:$N$100,8,FALSE)","v":{"$error":"#N/A"}},{"$f":"VLOOKUP(E409,INVENTORY!$A$2:$N$100,9,FALSE)","v":{"$error":"#N/A"}},{"$nulls":3},{"$f":"VLOOKUP(K409,INVENTORY!$A$2:$N$100,7,FALSE)","v":{"$error":"#N/A"}},{"$f":"VLOOKUP(K409,INVENTORY!$A$2:$N$100,8,FALSE)","v":{"$error":"#N/A"}},{"$f":"VLOOKUP(K409,INVENTORY!$A$2:$N$100,9,FALSE)","v":{"$error":"#N/A"}}]
[]
["CPU Cosmetics Defects:",null,{"$f":"\"Function Code: \"&VLOOKUP(E409,INVENTORY!$A$2:$Q$100,14,FALSE)","v":{"$error":"#N/A"}},{"$nulls":3},"CPU Cosmetics Defects:",null,{"$f":"\"Function Code: \"&VLOOKUP(K409,INVENTORY!$A$2:$Q$100,14,FALSE)","v":{"$error":"#N/A"}}]
[]
[null,null,{"$f":"\"Cosmetic Code: \"&VLOOKUP(E409,INVENTORY!$A$2:$Q$100,15,FALSE)","v":{"$error":"#N/A"}},{"$nulls":5},{"$f":"\"Cosmetic Code: \"&VLOOKUP(K409,INVENTORY!$A$2:$Q$100,15,FALSE)","v":{"$error":"#N/A"}}]
[]
["Casing","Plugs/Ports",{"$nulls":4},"Casing","Plugs/Ports"]
["Pass","Pass",{"$nulls":4},"Pass","Pass"]
["Fail","Fail",null,"TRRC#:L.T.R.",null,null,"Fail","Fail",null,"TRRC#:L.T.R."]
[]
["LAPTOP TESTING RECORD",{"$nulls":5},"LAPTOP TESTING RECORD"]
[]
[{"$nulls":3},"ITEM #",{"$f":"E409+2","v":31},{"$nulls":4},"ITEM #",{"$f":"K409+2","v":32}]
["Tester: ","RR","Date:",{"$f":"NOW()","v":"2025-12-15T11:00:59.760"},null,null,"Tester: ","RR","Date:",{"$f":"NOW()","v":"2025-12-15T11:00:59.760"}]
["Type: ","LAPTOP","SN:",{"$f":"VLOOKUP(E438,INVENTORYDATA,10,FALSE)","v":{"$error":"#N/A"}},null,null,"Type: ","LAPTOP","SN:",{"$f":"VLOOKUP(K438,INVENTORYDATA,10,FALSE)","v":{"$error":"#N/A"}}]
[{"$f":"\"Make: \"","v":"Make: "},{"$f":"VLOOKUP(E438,INVENTORYDATA,2,FALSE)","v":{"$error":"#N/A"}},{"$f":"\"Model: \"","v":"Model: "},{"$f":"VLOOKUP(E438,INVENTORYDATA,3,FALSE)","v":{"$error":"#N/A"}},null,null,{"$f":"\"Make: \"","v":"Make: "},{"$f":"VLOOKUP(K438,INVENTORYDATA,2,FALSE)","v":{"$error":"#N/A"}},{"$f":"\"Model: \"","v":"Model: "},{"$f":"VLOOKUP(K438,INVENTORYDATA,3,FALSE)","v":{"$error":"#N/A"}}]
[{"$f":"\"CPU/Speed: \"","v":"CPU/Speed: "},{"$f":"VLOOKUP(E438,INVENTORYDATA,4,FALSE)&\" / \"&VLOOKUP(E438,INVENTORYDATA,5,FALSE)&\"GHz\"","v":{"$error":"#N/A"}},null,{"$f":"\"Memory: \"","v":"Memory: "},{"$f":"VLOOKUP(E438,INVENTORYDATA,6,FALSE)","v":{"$error":"#N/A"}},null,{"$f":"\"CPU/Speed: \"","v":"CPU/Speed: "},{"$f":"VLOOKUP(K438,INVENTORYDATA,4,FALSE)&\" / \"&VLOOKUP(K438,INVENTORYDATA,5,FALSE)&\"GHz\"","v":{"$error":"#N/A"}},null,{"$f":"\"Memory: \"","v":"Memory: "},{"$f":"VLOOKUP(K438,INVENTORYDATA,6,FALSE)","v":{"$error":"#N/A"}}]
[]
["Key Function",null,"Pass","Fail ","Comments",null,"Key Function",null,"Pass","Fail ","Comments"]
["Hard Drive Removed",null,{"$f":"IF(ISBLANK(VLOOKUP(E438,INVENTORYDATA,13,FALSE)),\"X\",\"\")","v":""},null,{"$f":"IF(ISBLANK(VLOOKUP(E438,INVENTORYDATA,13,FALSE)),\"\",VLOOKUP(E438,INVENTORYDATA,13,FALSE))","v":{"$error":"#N/A"}},null,"Hard Drive Removed",null,{"$f":"IF(ISBLANK(VLOOKUP(K438,INVENTORYDATA,13,FALSE)),\"X\",\"\")","v":""},null,{"$f":"IF(ISBLANK(VLOOKUP(K438,INVENTORYDATA,13,FALSE)),\"\",VLOOKUP(K438,INVENTORYDATA,13,FALSE))","v":{"$error":"#N/A"}}]
["Install Memory",null,"X",{"$nulls":3},"Install Memory",null,"X"]
["Power ON",null,"X",{"$nulls":3},"Power ON",null,"X"]
["Record BIOS info",null,"X",{"$nulls":3},"Record BIOS info",null,"X"]
["Check Optical Drive",null,{"$f":"IF((VLOOKUP(E438,INVENTORYDATA,7,FALSE))=\"YES\",\"X\",\"\")","v":{"$error":"#N/A"}},{"$f":"IF((VLOOKUP(E438,INVENTORYDATA,7,FALSE))=\"NO\",\"X\",\"\")","v":{"$error":"#N/A"}},null,null,"Check Optical Drive",null,{"$f":"IF((VLOOKUP(K438,INVENTORYDATA,7,FALSE))=\"YES\",\"X\",\"\")","v":{"$error":"#N/A"}},{"$f":"IF((VLOOKUP(K438,INVENTORYDATA,7,FALSE))=\"NO\",\"X\",\"\")","v":{"$error":"#N/A"}}]
["Power Off",null,"X",{"$nulls":3},"Power Off",null,"X"]
["HDD Serial No.",null,{"$f":"IF(ISBLANK(VLOOKUP(E438,INVENTORYDATA,12,FALSE)),\"\",VLOOKUP(E438,INVENTORYDATA,12,FALSE))","v":{"$error":"#N/A"}},{"$nulls":3},"HDD Serial No.",null,{"$f":"IF(ISBLANK(VLOOKUP(K438,INVENTORYDATA,12,FALSE)),\"\",VLOOKUP(K438,INVENTORYDATA,12,FALSE))","v":{"$error":"#N/A"}}]
[]
["Tested for key functions,R2/Ready for Resale",{"$nulls":5},"Tested for key functions,R2/Ready for Resale"]
["BIOS Lock","Caddy","Optical","WebCam","Battery",null,"BIOS Lock","Caddy","Optical","WebCam","Battery"]
[null,null,{"$f":"VLOOKUP(E438,INVENTORY!$A$2:$N$100,7,FALSE)","v":{"$error":"#N/A"}},{"$f":"VLOOKUP(E438,INVENTORY!$A$2:$N$100,8,FALSE)","v":{"$error":"#N/A"}},{"$f":"VLOOKUP(E438,INVENTORY!$A$2:$N$100,9,FALSE)","v":{"$error":"#N/A"}},{"$nulls":3},{"$f":"VLOOKUP(K438,INVENTORY!$A$2:$N$100,7,FALSE)","v":{"$error":"#N/A"}},{"$f":"VLOOKUP(K438,INVENTORY!$A$2:$N$100,8,FALSE)","v":{"$error":"#N/A"}},{"$f":"VLOOKUP(K438,INVENTORY!$A$2:$N$100,9,FALSE)","v":{"$error":"#N/A"}}]
[]
["CPU Cosmetics Defects:",null,{"$f":"\"Function Code: \"&VLOOKUP(E438,INVENTORY!$A$2:$Q$100,14,FALSE)","v":{"$error":"#N/A"}},{"$nulls":3},"CPU Cosmetics Defects:",null,{"$f":"\"Function Code: \"&VLOOKUP(K438,INVENTORY!$A$2:$Q$100,14,FALSE)","v":{"$error":"#N/A"}}]
[]
[null,null,{"$f":"\"Cosmetic Code: \"&VLOOKUP(E438,INVENTORY!$A$2:$Q$100,15,FALSE)","v":{"$error":"#N/A"}},{"$nulls":5},{"$f":"\"Cosmetic Code: \"&VLOOKUP(K438,INVENTORY!$A$2:$Q$100,15,FALSE)","v":{"$error":"#N/A"}}]
[]
["Casing","Plugs/Ports",{"$nulls":4},"Casing","Plugs/Ports"]
["Pass","Pass",{"$nulls":4},"Pass","Pass"]
["Fail","Fail",null,"TRRC#:L.T.R.",null,null,"Fail","Fail",null,"TRRC#:L.T.R."]
[]
["LAPTOP TESTING RECORD",{"$nulls":5},"LAPTOP TESTING RECORD"]
[]
[{"$nulls":3},"ITEM #",{"$f":"E438+2","v":33},{"$nulls":4},"ITEM #",{"$f":"K438+2","v":34}]
["Tester: ","RR","Date:",{"$f":"NOW()","v":"2025-12-15T11:00:59.760"},null,null,"Tester: ","RR","Date:",{"$f":"NOW()","v":"2025-12-15T11:00:59.760"}]
["Type: ","LAPTOP","SN:",{"$f":"VLOOKUP(E467,INVENTORYDATA,10,FALSE)","v":{"$error":"#N/A"}},null,null,"Type: ","LAPTOP","SN:",{"$f":"VLOOKUP(K467,INVENTORYDATA,10,FALSE)","v":{"$error":"#N/A"}}]
[{"$f":"\"Make: \"","v":"Make: "},{"$f":"VLOOKUP(E467,INVENTORYDATA,2,FALSE)","v":{"$error":"#N/A"}},{"$f":"\"Model: \"","v":"Model: "},{"$f":"VLOOKUP(E467,INVENTORYDATA,3,FALSE)","v":{"$error":"#N/A"}},null,null,{"$f":"\"Make: \"","v":"Make: "},{"$f":"VLOOKUP(K467,INVENTORYDATA,2,FALSE)","v":{"$error":"#N/A"}},{"$f":"\"Model: \"","v":"Model: "},{"$f":"VLOOKUP(K467,INVENTORYDATA,3,FALSE)","v":{"$error":"#N/A"}}]
[{"$f":"\"CPU/Speed: \"","v":"CPU/Speed: "},{"$f":"VLOOKUP(E467,INVENTORYDATA,4,FALSE)&\" / \"&VLOOKUP(E467,INVENTORYDATA,5,FALSE)&\"GHz\"","v":{"$error":"#N/A"}},null,{"$f":"\"Memory: \"","v":"Memory: "},{"$f":"VLOOKUP(E467,INVENTORYDATA,6,FALSE)","v":{"$error":"#N/A"}},null,{"$f":"\"CPU/Speed: \"","v":"CPU/Speed: "},{"$f":"VLOOKUP(K467,INVENTORYDATA,4,FALSE)&\" / \"&VLOOKUP(K467,INVENTORYDATA,5,FALSE)&\"GHz\"","v":{"$error":"#N/A"}},null,{"$f":"\"Memory: \"","v":"Memory: "},{"$f":"VLOOKUP(K467,INVENTORYDATA,6,FALSE)","v":{"$error":"#N/A"}}]
[]
["Key Function",null,"Pass","Fail ","Comments",null,"Key Function",null,"Pass","Fail ","Comments"]
["Hard Drive Removed",null,{"$f":"IF(ISBLANK(VLOOKUP(E467,INVENTORYDATA,13,FALSE)),\"X\",\"\")","v":""},null,{"$f":"IF(ISBLANK(VLOOKUP(E467,INVENTORYDATA,13,FALSE)),\"\",VLOOKUP(E467,INVENTORYDATA,13,FALSE))","v":{"$error":"#N/A"}},null,"Hard Drive Removed",null,{"$f":"IF(ISBLANK(VLOOKUP(K467,INVENTORYDATA,13,FALSE)),\"X\",\"\")","v":""},null,{"$f":"IF(ISBLANK(VLOOKUP(K467,INVENTORYDATA,13,FALSE)),\"\",VLOOKUP(K467,INVENTORYDATA,13,FALSE))","v":{"$error":"#N/A"}}]
["Install Memory",null,"X",{"$nulls":3},"Install Memory",null,"X"]
["Power ON",null,"X",{"$nulls":3},"Power ON",null,"X"]
["Record BIOS info",null,"X",{"$nulls":3},"Record BIOS info",null,"X"]
["Check Optical Drive",null,{"$f":"IF((VLOOKUP(E467,INVENTORYDATA,7,FALSE))=\"YES\",\"X\",\"\")","v":{"$error":"#N/A"}},{"$f":"IF((VLOOKUP(E467,INVENTORYDATA,7,FALSE))=\"NO\",\"X\",\"\")","v":{"$error":"#N/A"}},null,null,"Check Optical Drive",null,{"$f":"IF((VLOOKUP(K467,INVENTORYDATA,7,FALSE))=\"YES\",\"X\",\"\")","v":{"$error":"#N/A"}},{"$f":"IF((VLOOKUP(K467,INVENTORYDATA,7,FALSE))=\"NO\",\"X\",\"\")","v":{"$error":"#N/A"}}]
["Power Off",null,"X",{"$nulls":3},"Power Off",null,"X"]
["HDD Serial No.",null,{"$f":"IF(ISBLANK(VLOOKUP(E467,INVENTORYDATA,12,FALSE)),\"\",VLOOKUP(E467,INVENTORYDATA,12,FALSE))","v":{"$error":"#N/A"}},{"$nulls":3},"HDD Serial No.",null,{"$f":"IF(ISBLANK(VLOOKUP(K467,INVENTORYDATA,12,FALSE)),\"\",VLOOKUP(K467,INVENTORYDATA,12,FALSE))","v":{"$error":"#N/A"}}]
[]
["Tested for key functions,R2/Ready for Resale",{"$nulls":5},"Tested for key functions,R2/Ready for Resale"]
["BIOS Lock","Caddy","Optical","WebCam","Battery",null,"BIOS Lock","Caddy","Optical","WebCam","Battery"]
[null,null,{"$f":"VLOOKUP(E467,INVENTORY!$A$2:$N$100,7,FALSE)","v":{"$error":"#N/A"}},{"$f":"VLOOKUP(E467,INVENTORY!$A$2:$N$100,8,FALSE)","v":{"$error":"#N/A"}},{"$f":"VLOOKUP(E467,INVENTORY!$A$2:$N$100,9,FALSE)","v":{"$error":"#N/A"}},{"$nulls":3},{"$f":"VLOOKUP(K467,INVENTORY!$A$2:$N$100,7,FALSE)","v":{"$error":"#N/A"}},{"$f":"VLOOKUP(K467,INVENTORY!$A$2:$N$100,8,FALSE)","v":{"$error":"#N/A"}},{"$f":"VLOOKUP(K467,INVENTORY!$A$2:$N$100,9,FALSE)","v":{"$error":"#N/A"}}]
[]
["CPU Cosmetics Defects:",null,{"$f":"\"Function Code: \"&VLOOKUP(E467,INVENTORY!$A$2:$Q$100,14,FALSE)","v":{"$error":"#N/A"}},{"$nulls":3},"CPU Cosmetics Defects:",null,{"$f":"\"Function Code: \"&VLOOKUP(K467,INVENTORY!$A$2:$Q$100,14,FALSE)","v":{"$error":"#N/A"}}]
[]
[null,null,{"$f":"\"Cosmetic Code: \"&VLOOKUP(E467,INVENTORY!$A$2:$Q$100,15,FALSE)","v":{"$error":"#N/A"}},{"$nulls":5},{"$f":"\"Cosmetic Code: \"&VLOOKUP(K467,INVENTORY!$A$2:$Q$100,15,FALSE)","v":{"$error":"#N/A"}}]
[]
["Casing","Plugs/Ports",{"$nulls":4},"Casing","Plugs/Ports"]
["Pass","Pass",{"$nulls":4},"Pass","Pass"]
["Fail","Fail",null,"TRRC#:L.T.R.",null,null,"Fail","Fail",null,"TRRC#:L.T.R."]
[]
["LAPTOP TESTING RECORD",{"$nulls":5},"LAPTOP TESTING RECORD"]
[]
[{"$nulls":3},"ITEM #",{"$f":"E467+2","v":35},{"$nulls":4},"ITEM #",{"$f":"K467+2","v":36}]
["Tester: ","RR","Date:",{"$f":"NOW()","v":"2025-12-15T11:00:59.760"},null,null,"Tester: ","RR","Date:",{"$f":"NOW()","v":"2025-12-15T11:00:59.760"}]
["Type: ","LAPTOP","SN:",{"$f":"VLOOKUP(E496,INVENTORYDATA,10,FALSE)","v":{"$error":"#N/A"}},null,null,"Type: ","LAPTOP","SN:",{"$f":"VLOOKUP(K496,INVENTORYDATA,10,FALSE)","v":{"$error":"#N/A"}}]
[{"$f":"\"Make: \"","v":"Make: "},{"$f":"VLOOKUP(E496,INVENTORYDATA,2,FALSE)","v":{"$error":"#N/A"}},{"$f":"\"Model: \"","v":"Model: "},{"$f":"VLOOKUP(E496,INVENTORYDATA,3,FALSE)","v":{"$error":"#N/A"}},null,null,{"$f":"\"Make: \"","v":"Make: "},{"$f":"VLOOKUP(K496,INVENTORYDATA,2,FALSE)","v":{"$error":"#N/A"}},{"$f":"\"Model: \"","v":"Model: "},{"$f":"VLOOKUP(K496,INVENTORYDATA,3,FALSE)","v":{"$error":"#N/A"}}]
[{"$f":"\"CPU/Speed: \"","v":"CPU/Speed: "},{"$f":"VLOOKUP(E496,INVENTORYDATA,4,FALSE)&\" / \"&VLOOKUP(E496,INVENTORYDATA,5,FALSE)&\"GHz\"","v":{"$error":"#N/A"}},null,{"$f":"\"Memory: \"","v":"Memory: "},{"$f":"VLOOKUP(E496,INVENTORYDATA,6,FALSE)","v":{"$error":"#N/A"}},null,{"$f":"\"CPU/Speed: \"","v":"CPU/Speed: "},{"$f":"VLOOKUP(K496,INVENTORYDATA,4,FALSE)&\" / \"&VLOOKUP(K496,INVENTORYDATA,5,FALSE)&\"GHz\"","v":{"$error":"#N/A"}},null,{"$f":"\"Memory: \"","v":"Memory: "},{"$f":"VLOOKUP(K496,INVENTORYDATA,6,FALSE)","v":{"$error":"#N/A"}}]
[]
["Key Function",null,"Pass","Fail ","Comments",null,"Key Function",null,"Pass","Fail ","Comments"]
["Hard Drive Removed",null,{"$f":"IF(ISBLANK(VLOOKUP(E496,INVENTORYDATA,13,FALSE)),\"X\",\"\")","v":""},null,{"$f":"IF(ISBLANK(VLOOKUP(E496,INVENTORYDATA,13,FALSE)),\"\",VLOOKUP(E496,INVENTORYDATA,13,FALSE))","v":{"$error":"#N/A"}},null,"Hard Drive Removed",null,{"$f":"IF(ISBLANK(VLOOKUP(K496,INVENTORYDATA,13,FALSE)),\"X\",\"\")","v":""},null,{"$f":"IF(ISBLANK(VLOOKUP(K496,INVENTORYDATA,13,FALSE)),\"\",VLOOKUP(K496,INVENTORYDATA,13,FALSE))","v":{"$error":"#N/A"}}]
["Install Memory",null,"X",{"$nulls":3},"Install Memory",null,"X"]
["Power ON",null,"X",{"$nulls":3},"Power ON",null,"X"]
["Record BIOS info",null,"X",{"$nulls":3},"Record BIOS info",null,"X"]
["Check Optical Drive",null,{"$f":"IF((VLOOKUP(E496,INVENTORYDATA,7,FALSE))=\"YES\",\"X\",\"\")","v":{"$error":"#N/A"}},{"$f":"IF((VLOOKUP(E496,INVENTORYDATA,7,FALSE))=\"NO\",\"X\",\"\")","v":{"$error":"#N/A"}},null,null,"Check Optical Drive",null,{"$f":"IF((VLOOKUP(K496,INVENTORYDATA,7,FALSE))=\"YES\",\"X\",\"\")","v":{"$error":"#N/A"}},{"$f":"IF((VLOOKUP(K496,INVENTORYDATA,7,FALSE))=\"NO\",\"X\",\"\")","v":{"$error":"#N/A"}}]
["Power Off",null,"X",{"$nulls":3},"Power Off",null,"X"]
["HDD Serial No.",null,{"$f":"IF(ISBLANK(VLOOKUP(E496,INVENTORYDATA,12,FALSE)),\"\",VLOOKUP(E496,INVENTORYDATA,12,FALSE))","v":{"$error":"#N/A"}},{"$nulls":3},"HDD Serial No.",null,{"$f":"IF(ISBLANK(VLOOKUP(K496,INVENTORYDATA,12,FALSE)),\"\",VLOOKUP(K496,INVENTORYDATA,12,FALSE))","v":{"$error":"#N/A"}}]
[]
["Tested for key functions,R2/Ready for Resale",{"$nulls":5},"Tested for key functions,R2/Ready for Resale"]
["BIOS Lock","Caddy","Optical","WebCam","Battery",null,"BIOS Lock","Caddy","Optical","WebCam","Battery"]
[null,null,{"$f":"VLOOKUP(E496,INVENTORY!$A$2:$N$100,7,FALSE)","v":{"$error":"#N/A"}},{"$f":"VLOOKUP(E496,INVENTORY!$A$2:$N$100,8,FALSE)","v":{"$error":"#N/A"}},{"$f":"VLOOKUP(E496,INVENTORY!$A$2:$N$100,9,FALSE)","v":{"$error":"#N/A"}},{"$nulls":3},{"$f":"VLOOKUP(K496,INVENTORY!$A$2:$N$100,7,FALSE)","v":{"$error":"#N/A"}},{"$f":"VLOOKUP(K496,INVENTORY!$A$2:$N$100,8,FALSE)","v":{"$error":"#N/A"}},{"$f":"VLOOKUP(K496,INVENTORY!$A$2:$N$100,9,FALSE)","v":{"$error":"#N/A"}}]
[]
["CPU Cosmetics Defects:",null,{"$f":"\"Function Code: \"&VLOOKUP(E496,INVENTORY!$A$2:$Q$100,14,FALSE)","v":{"$error":"#N/A"}},{"$nulls":3},"CPU Cosmetics Defects:",null,{"$f":"\"Function Code: \"&VLOOKUP(K496,INVENTORY!$A$2:$Q$100,14,FALSE)","v":{"$error":"#N/A"}}]
[]
[null,null,{"$f":"\"Cosmetic Code: \"&VLOOKUP(E496,INVENTORY!$A$2:$Q$100,15,FALSE)","v":{"$error":"#N/A"}},{"$nulls":5},{"$f":"\"Cosmetic Code: \"&VLOOKUP(K496,INVENTORY!$A$2:$Q$100,15,FALSE)","v":{"$error":"#N/A"}}]
[]
["Casing","Plugs/Ports",{"$nulls":4},"Casing","Plugs/Ports"]
["Pass","Pass",{"$nulls":4},"Pass","Pass"]
["Fail","Fail",null,"TRRC#:L.T.R.",null,null,"Fail","Fail",null,"TRRC#:L.T.R."]
[]
["LAPTOP TESTING RECORD",{"$nulls":5},"LAPTOP TESTING RECORD"]
[]
[{"$nulls":3},"ITEM #",{"$f":"E496+2","v":37},{"$nulls":4},"ITEM #",{"$f":"K496+2","v":38}]
["Tester: ","RR","Date:",{"$f":"NOW()","v":"2025-12-15T11:00:59.760"},null,null,"Tester: ","RR","Date:",{"$f":"NOW()","v":"2025-12-15T11:00:59.760"}]
["Type: ","LAPTOP","SN:",{"$f":"VLOOKUP(E525,INVENTORYDATA,10,FALSE)","v":{"$error":"#N/A"}},null,null,"Type: ","LAPTOP","SN:",{"$f":"VLOOKUP(K525,INVENTORYDATA,10,FALSE)","v":{"$error":"#N/A"}}]
[{"$f":"\"Make: \"","v":"Make: "},{"$f":"VLOOKUP(E525,INVENTORYDATA,2,FALSE)","v":{"$error":"#N/A"}},{"$f":"\"Model: \"","v":"Model: "},{"$f":"VLOOKUP(E525,INVENTORYDATA,3,FALSE)","v":{"$error":"#N/A"}},null,null,{"$f":"\"Make: \"","v":"Make: "},{"$f":"VLOOKUP(K525,INVENTORYDATA,2,FALSE)","v":{"$error":"#N/A"}},{"$f":"\"Model: \"","v":"Model: "},{"$f":"VLOOKUP(K525,INVENTORYDATA,3,FALSE)","v":{"$error":"#N/A"}}]
[{"$f":"\"CPU/Speed: \"","v":"CPU/Speed: "},{"$f":"VLOOKUP(E525,INVENTORYDATA,4,FALSE)&\" / \"&VLOOKUP(E525,INVENTORYDATA,5,FALSE)&\"GHz\"","v":{"$error":"#N/A"}},null,{"$f":"\"Memory: \"","v":"Memory: "},{"$f":"VLOOKUP(E525,INVENTORYDATA,6,FALSE)","v":{"$error":"#N/A"}},null,{"$f":"\"CPU/Speed: \"","v":"CPU/Speed: "},{"$f":"VLOOKUP(K525,INVENTORYDATA,4,FALSE)&\" / \"&VLOOKUP(K525,INVENTORYDATA,5,FALSE)&\"GHz\"","v":{"$error":"#N/A"}},null,{"$f":"\"Memory: \"","v":"Memory: "},{"$f":"VLOOKUP(K525,INVENTORYDATA,6,FALSE)","v":{"$error":"#N/A"}}]
[]
["Key Function",null,"Pass","Fail ","Comments",null,"Key Function",null,"Pass","Fail ","Comments"]
["Hard Drive Removed",null,{"$f":"IF(ISBLANK(VLOOKUP(E525,INVENTORYDATA,13,FALSE)),\"X\",\"\")","v":""},null,{"$f":"IF(ISBLANK(VLOOKUP(E525,INVENTORYDATA,13,FALSE)),\"\",VLOOKUP(E525,INVENTORYDATA,13,FALSE))","v":{"$error":"#N/A"}},null,"Hard Drive Removed",null,{"$f":"IF(ISBLANK(VLOOKUP(K525,INVENTORYDATA,13,FALSE)),\"X\",\"\")","v":""},null,{"$f":"IF(ISBLANK(VLOOKUP(K525,INVENTORYDATA,13,FALSE)),\"\",VLOOKUP(K525,INVENTORYDATA,13,FALSE))","v":{"$error":"#N/A"}}]
["Install Memory",null,"X",{"$nulls":3},"Install Memory",null,"X"]
["Power ON",null,"X",{"$nulls":3},"Power ON",null,"X"]
["Record BIOS info",null,"X",{"$nulls":3},"Record BIOS info",null,"X"]
["Check Optical Drive",null,{"$f":"IF((VLOOKUP(E525,INVENTORYDATA,7,FALSE))=\"YES\",\"X\",\"\")","v":{"$error":"#N/A"}},{"$f":"IF((VLOOKUP(E525,INVENTORYDATA,7,FALSE))=\"NO\",\"X\",\"\")","v":{"$error":"#N/A"}},null,null,"Check Optical Drive",null,{"$f":"IF((VLOOKUP(K525,INVENTORYDATA,7,FALSE))=\"YES\",\"X\",\"\")","v":{"$error":"#N/A"}},{"$f":"IF((VLOOKUP(K525,INVENTORYDATA,7,FALSE))=\"NO\",\"X\",\"\")","v":{"$error":"#N/A"}}]
["Power Off",null,"X",{"$nulls":3},"Power Off",null,"X"]
["HDD Serial No.",null,{"$f":"IF(ISBLANK(VLOOKUP(E525,INVENTORYDATA,12,FALSE)),\"\",VLOOKUP(E525,INVENTORYDATA,12,FALSE))","v":{"$error":"#N/A"}},{"$nulls":3},"HDD Serial No.",null,{"$f":"IF(ISBLANK(VLOOKUP(K525,INVENTORYDATA,12,FALSE)),\"\",VLOOKUP(K525,INVENTORYDATA,12,FALSE))","v":{"$error":"#N/A"}}]
[]
["Tested for key functions,R2/Ready for Resale",{"$nulls":5},"Tested for key functions,R2/Ready for Resale"]
["BIOS Lock","Caddy","Optical","WebCam","Battery",null,"BIOS Lock","Caddy","Optical","WebCam","Battery"]
[null,null,{"$f":"VLOOKUP(E525,INVENTORY!$A$2:$N$100,7,FALSE)","v":{"$error":"#N/A"}},{"$f":"VLOOKUP(E525,INVENTORY!$A$2:$N$100,8,FALSE)","v":{"$error":"#N/A"}},{"$f":"VLOOKUP(E525,INVENTORY!$A$2:$N$100,9,FALSE)","v":{"$error":"#N/A"}},{"$nulls":3},{"$f":"VLOOKUP(K525,INVENTORY!$A$2:$N$100,7,FALSE)","v":{"$error":"#N/A"}},{"$f":"VLOOKUP(K525,INVENTORY!$A$2:$N$100,8,FALSE)","v":{"$error":"#N/A"}},{"$f":"VLOOKUP(K525,INVENTORY!$A$2:$N$100,9,FALSE)","v":{"$error":"#N/A"}}]
[]
["CPU Cosmetics Defects:",null,{"$f":"\"Function Code: \"&VLOOKUP(E525,INVENTORY!$A$2:$Q$100,14,FALSE)","v":{"$error":"#N/A"}},{"$nulls":3},"CPU Cosmetics Defects:",null,{"$f":"\"Function Code: \"&VLOOKUP(K525,INVENTORY!$A$2:$Q$100,14,FALSE)","v":{"$error":"#N/A"}}]
[]
[null,null,{"$f":"\"Cosmetic Code: \"&VLOOKUP(E525,INVENTORY!$A$2:$Q$100,15,FALSE)","v":{"$error":"#N/A"}},{"$nulls":5},{"$f":"\"Cosmetic Code: \"&VLOOKUP(K525,INVENTORY!$A$2:$Q$100,15,FALSE)","v":{"$error":"#N/A"}}]
[]
["Casing","Plugs/Ports",{"$nulls":4},"Casing","Plugs/Ports"]
["Pass","Pass",{"$nulls":4},"Pass","Pass"]
["Fail","Fail",null,"TRRC#:L.T.R.",null,null,"Fail","Fail",null,"TRRC#:L.T.R."]
[]
["LAPTOP TESTING RECORD",{"$nulls":5},"LAPTOP TESTING RECORD"]
[]
[{"$nulls":3},"ITEM #",{"$f":"E525+2","v":39},{"$nulls":4},"ITEM #",{"$f":"K525+2","v":40}]
["Tester: ","RR","Date:",{"$f":"NOW()","v":"2025-12-15T11:00:59.760"},null,null,"Tester: ","RR","Date:",{"$f":"NOW()","v":"2025-12-15T11:00:59.760"}]
["Type: ","LAPTOP","SN:",{"$f":"VLOOKUP(E554,INVENTORYDATA,10,FALSE)","v":{"$error":"#N/A"}},null,null,"Type: ","LAPTOP","SN:",{"$f":"VLOOKUP(K554,INVENTORYDATA,10,FALSE)","v":{"$error":"#N/A"}}]
[{"$f":"\"Make: \"","v":"Make: "},{"$f":"VLOOKUP(E554,INVENTORYDATA,2,FALSE)","v":{"$error":"#N/A"}},{"$f":"\"Model: \"","v":"Model: "},{"$f":"VLOOKUP(E554,INVENTORYDATA,3,FALSE)","v":{"$error":"#N/A"}},null,null,{"$f":"\"Make: \"","v":"Make: "},{"$f":"VLOOKUP(K554,INVENTORYDATA,2,FALSE)","v":{"$error":"#N/A"}},{"$f":"\"Model: \"","v":"Model: "},{"$f":"VLOOKUP(K554,INVENTORYDATA,3,FALSE)","v":{"$error":"#N/A"}}]
[{"$f":"\"CPU/Speed: \"","v":"CPU/Speed: "},{"$f":"VLOOKUP(E554,INVENTORYDATA,4,FALSE)&\" / \"&VLOOKUP(E554,INVENTORYDATA,5,FALSE)&\"GHz\"","v":{"$error":"#N/A"}},null,{"$f":"\"Memory: \"","v":"Memory: "},{"$f":"VLOOKUP(E554,INVENTORYDATA,6,FALSE)","v":{"$error":"#N/A"}},null,{"$f":"\"CPU/Speed: \"","v":"CPU/Speed: "},{"$f":"VLOOKUP(K554,INVENTORYDATA,4,FALSE)&\" / \"&VLOOKUP(K554,INVENTORYDATA,5,FALSE)&\"GHz\"","v":{"$error":"#N/A"}},null,{"$f":"\"Memory: \"","v":"Memory: "},{"$f":"VLOOKUP(K554,INVENTORYDATA,6,FALSE)","v":{"$error":"#N/A"}}]
[]
["Key Function",null,"Pass","Fail ","Comments",null,"Key Function",null,"Pass","Fail ","Comments"]
["Hard Drive Removed",null,{"$f":"IF(ISBLANK(VLOOKUP(E554,INVENTORYDATA,13,FALSE)),\"X\",\"\")","v":""},null,{"$f":"IF(ISBLANK(VLOOKUP(E554,INVENTORYDATA,13,FALSE)),\"\",VLOOKUP(E554,INVENTORYDATA,13,FALSE))","v":{"$error":"#N/A"}},null,"Hard Drive Removed",null,{"$f":"IF(ISBLANK(VLOOKUP(K554,INVENTORYDATA,13,FALSE)),\"X\",\"\")","v":""},null,{"$f":"IF(ISBLANK(VLOOKUP(K554,INVENTORYDATA,13,FALSE)),\"\",VLOOKUP(K554,INVENTORYDATA,13,FALSE))","v":{"$error":"#N/A"}}]
["Install Memory",null,"X",{"$nulls":3},"Install Memory",null,"X"]
["Power ON",null,"X",{"$nulls":3},"Power ON",null,"X"]
["Record BIOS info",null,"X",{"$nulls":3},"Record BIOS info",null,"X"]
["Check Optical Drive",null,{"$f":"IF((VLOOKUP(E554,INVENTORYDATA,7,FALSE))=\"YES\",\"X\",\"\")","v":{"$error":"#N/A"}},{"$f":"IF((VLOOKUP(E554,INVENTORYDATA,7,FALSE))=\"NO\",\"X\",\"\")","v":{"$error":"#N/A"}},null,null,"Check Optical Drive",null,{"$f":"IF((VLOOKUP(K554,INVENTORYDATA,7,FALSE))=\"YES\",\"X\",\"\")","v":{"$error":"#N/A"}},{"$f":"IF((VLOOKUP(K554,INVENTORYDATA,7,FALSE))=\"NO\",\"X\",\"\")","v":{"$error":"#N/A"}}]
["Power Off",null,"X",{"$nulls":3},"Power Off",null,"X"]
["HDD Serial No.",null,{"$f":"IF(ISBLANK(VLOOKUP(E554,INVENTORYDATA,12,FALSE)),\"\",VLOOKUP(E554,INVENTORYDATA,12,FALSE))","v":{"$error":"#N/A"}},{"$nulls":3},"HDD Serial No.",null,{"$f":"IF(ISBLANK(VLOOKUP(K554,INVENTORYDATA,12,FALSE)),\"\",VLOOKUP(K554,INVENTORYDATA,12,FALSE))","v":{"$error":"#N/A"}}]
[]
["Tested for key functions,R2/Ready for Resale",{"$nulls":5},"Tested for key functions,R2/Ready for Resale"]
["BIOS Lock","Caddy","Optical","WebCam","Battery",null,"BIOS Lock","Caddy","Optical","WebCam","Battery"]
[null,null,{"$f":"VLOOKUP(E554,INVENTORY!$A$2:$N$100,7,FALSE)","v":{"$error":"#N/A"}},{"$f":"VLOOKUP(E554,INVENTORY!$A$2:$N$100,8,FALSE)","v":{"$error":"#N/A"}},{"$f":"VLOOKUP(E554,INVENTORY!$A$2:$N$100,9,FALSE)","v":{"$error":"#N/A"}},{"$nulls":3},{"$f":"VLOOKUP(K554,INVENTORY!$A$2:$N$100,7,FALSE)","v":{"$error":"#N/A"}},{"$f":"VLOOKUP(K554,INVENTORY!$A$2:$N$100,8,FALSE)","v":{"$error":"#N/A"}},{"$f":"VLOOKUP(K554,INVENTORY!$A$2:$N$100,9,FALSE)","v":{"$error":"#N/A"}}]
[]
["CPU Cosmetics Defects:",null,{"$f":"\"Function Code: \"&VLOOKUP(E554,INVENTORY!$A$2:$Q$100,14,FALSE)","v":{"$error":"#N/A"}},{"$nulls":3},"CPU Cosmetics Defects:",null,{"$f":"\"Function Code: \"&VLOOKUP(K554,INVENTORY!$A$2:$Q$100,14,FALSE)","v":{"$error":"#N/A"}}]
[]
[null,null,{"$f":"\"Cosmetic Code: \"&VLOOKUP(E554,INVENTORY!$A$2:$Q$100,15,FALSE)","v":{"$error":"#N/A"}},{"$nulls":5},{"$f":"\"Cosmetic Code: \"&VLOOKUP(K554,INVENTORY!$A$2:$Q$100,15,FALSE)","v":{"$error":"#N/A"}}]
[]
["Casing","Plugs/Ports",{"$nulls":4},"Casing","Plugs/Ports"]
["Pass","Pass",{"$nulls":4},"Pass","Pass"]
["Fail","Fail",null,"TRRC#:L.T.R.",null,null,"Fail","Fail",null,"TRRC#:L.T.R."]
[]
["LAPTOP TESTING RECORD",{"$nulls":5},"LAPTOP TESTING RECORD"]
[]
[{"$nulls":3},"ITEM #",{"$f":"E554+2","v":41},{"$nulls":4},"ITEM #",{"$f":"K554+2","v":42}]
["Tester: ","RR","Date:",{"$f":"NOW()","v":"2025-12-15T11:00:59.760"},null,null,"Tester: ","RR","Date:",{"$f":"NOW()","v":"2025-12-15T11:00:59.760"}]
["Type: ","LAPTOP","SN:",{"$f":"VLOOKUP(E583,INVENTORYDATA,10,FALSE)","v":{"$error":"#N/A"}},null,null,"Type: ","LAPTOP","SN:",{"$f":"VLOOKUP(K583,INVENTORYDATA,10,FALSE)","v":{"$error":"#N/A"}}]
[{"$f":"\"Make: \"","v":"Make: "},{"$f":"VLOOKUP(E583,INVENTORYDATA,2,FALSE)","v":{"$error":"#N/A"}},{"$f":"\"Model: \"","v":"Model: "},{"$f":"VLOOKUP(E583,INVENTORYDATA,3,FALSE)","v":{"$error":"#N/A"}},null,null,{"$f":"\"Make: \"","v":"Make: "},{"$f":"VLOOKUP(K583,INVENTORYDATA,2,FALSE)","v":{"$error":"#N/A"}},{"$f":"\"Model: \"","v":"Model: "},{"$f":"VLOOKUP(K583,INVENTORYDATA,3,FALSE)","v":{"$error":"#N/A"}}]
[{"$f":"\"CPU/Speed: \"","v":"CPU/Speed: "},{"$f":"VLOOKUP(E583,INVENTORYDATA,4,FALSE)&\" / \"&VLOOKUP(E583,INVENTORYDATA,5,FALSE)&\"GHz\"","v":{"$error":"#N/A"}},null,{"$f":"\"Memory: \"","v":"Memory: "},{"$f":"VLOOKUP(E583,INVENTORYDATA,6,FALSE)","v":{"$error":"#N/A"}},null,{"$f":"\"CPU/Speed: \"","v":"CPU/Speed: "},{"$f":"VLOOKUP(K583,INVENTORYDATA,4,FALSE)&\" / \"&VLOOKUP(K583,INVENTORYDATA,5,FALSE)&\"GHz\"","v":{"$error":"#N/A"}},null,{"$f":"\"Memory: \"","v":"Memory: "},{"$f":"VLOOKUP(K583,INVENTORYDATA,6,FALSE)","v":{"$error":"#N/A"}}]
[]
["Key Function",null,"Pass","Fail ","Comments",null,"Key Function",null,"Pass","Fail ","Comments"]
["Hard Drive Removed",null,{"$f":"IF(ISBLANK(VLOOKUP(E583,INVENTORYDATA,13,FALSE)),\"X\",\"\")","v":""},null,{"$f":"IF(ISBLANK(VLOOKUP(E583,INVENTORYDATA,13,FALSE)),\"\",VLOOKUP(E583,INVENTORYDATA,13,FALSE))","v":{"$error":"#N/A"}},null,"Hard Drive Removed",null,{"$f":"IF(ISBLANK(VLOOKUP(K583,INVENTORYDATA,13,FALSE)),\"X\",\"\")","v":""},null,{"$f":"IF(ISBLANK(VLOOKUP(K583,INVENTORYDATA,13,FALSE)),\"\",VLOOKUP(K583,INVENTORYDATA,13,FALSE))","v":{"$error":"#N/A"}}]
["Install Memory",null,"X",{"$nulls":3},"Install Memory",null,"X"]
["Power ON",null,"X",{"$nulls":3},"Power ON",null,"X"]
["Record BIOS info",null,"X",{"$nulls":3},"Record BIOS info",null,"X"]
["Check Optical Drive",null,{"$f":"IF((VLOOKUP(E583,INVENTORYDATA,7,FALSE))=\"YES\",\"X\",\"\")","v":{"$error":"#N/A"}},{"$f":"IF((VLOOKUP(E583,INVENTORYDATA,7,FALSE))=\"NO\",\"X\",\"\")","v":{"$error":"#N/A"}},null,null,"Check Optical Drive",null,{"$f":"IF((VLOOKUP(K583,INVENTORYDATA,7,FALSE))=\"YES\",\"X\",\"\")","v":{"$error":"#N/A"}},{"$f":"IF((VLOOKUP(K583,INVENTORYDATA,7,FALSE))=\"NO\",\"X\",\"\")","v":{"$error":"#N/A"}}]
["Power Off",null,"X",{"$nulls":3},"Power Off",null,"X"]
["HDD Serial No.",null,{"$f":"IF(ISBLANK(VLOOKUP(E583,INVENTORYDATA,12,FALSE)),\"\",VLOOKUP(E583,INVENTORYDATA,12,FALSE))","v":{"$error":"#N/A"}},{"$nulls":3},"HDD Serial No.",null,{"$f":"IF(ISBLANK(VLOOKUP(K583,INVENTORYDATA,12,FALSE)),\"\",VLOOKUP(K583,INVENTORYDATA,12,FALSE))","v":{"$error":"#N/A"}}]
[]
["Tested for key functions,R2/Ready for Resale",{"$nulls":5},"Tested for key functions,R2/Ready for Resale"]
["BIOS Lock","Caddy","Optical","WebCam","Battery",null,"BIOS Lock","Caddy","Optical","WebCam","Battery"]
[null,null,{"$f":"VLOOKUP(E583,INVENTORY!$A$2:$N$100,7,FALSE)","v":{"$error":"#N/A"}},{"$f":"VLOOKUP(E583,INVENTORY!$A$2:$N$100,8,FALSE)","v":{"$error":"#N/A"}},{"$f":"VLOOKUP(E583,INVENTORY!$A$2:$N$100,9,FALSE)","v":{"$error":"#N/A"}},{"$nulls":3},{"$f":"VLOOKUP(K583,INVENTORY!$A$2:$N$100,7,FALSE)","v":{"$error":"#N/A"}},{"$f":"VLOOKUP(K583,INVENTORY!$A$2:$N$100,8,FALSE)","v":{"$error":"#N/A"}},{"$f":"VLOOKUP(K583,INVENTORY!$A$2:$N$100,9,FALSE)","v":{"$error":"#N/A"}}]
[]
["CPU Cosmetics Defects:",null,{"$f":"\"Function Code: \"&VLOOKUP(E583,INVENTORY!$A$2:$Q$100,14,FALSE)","v":{"$error":"#N/A"}},{"$nulls":3},"CPU Cosmetics Defects:",null,{"$f":"\"Function Code: \"&VLOOKUP(K583,INVENTORY!$A$2:$Q$100,14,FALSE)","v":{"$error":"#N/A"}}]
[]
[null,null,{"$f":"\"Cosmetic Code: \"&VLOOKUP(E583,INVENTORY!$A$2:$Q$100,15,FALSE)","v":{"$error":"#N/A"}},{"$nulls":5},{"$f":"\"Cosmetic Code: \"&VLOOKUP(K583,INVENTORY!$A$2:$Q$100,15,FALSE)","v":{"$error":"#N/A"}}]
[]
["Casing","Plugs/Ports",{"$nulls":4},"Casing","Plugs/Ports"]
["Pass","Pass",{"$nulls":4},"Pass","Pass"]
["Fail","Fail",null,"TRRC#:L.T.R.",null,null,"Fail","Fail",null,"TRRC#:L.T.R."]
[]
["LAPTOP TESTING RECORD",{"$nulls":5},"LAPTOP TESTING RECORD"]
[]
[{"$nulls":3},"ITEM #",{"$f":"E583+2","v":43},{"$nulls":4},"ITEM #",{"$f":"K583+2","v":44}]
["Tester: ","RR","Date:",{"$f":"NOW()","v":"2025-12-15T11:00:59.760"},null,null,"Tester: ","RR","Date:",{"$f":"NOW()","v":"2025-12-15T11:00:59.760"}]
["Type: ","LAPTOP","SN:",{"$f":"VLOOKUP(E612,INVENTORYDATA,10,FALSE)","v":{"$error":"#N/A"}},null,null,"Type: ","LAPTOP","SN:",{"$f":"VLOOKUP(K612,INVENTORYDATA,10,FALSE)","v":{"$error":"#N/A"}}]
[{"$f":"\"Make: \"","v":"Make: "},{"$f":"VLOOKUP(E612,INVENTORYDATA,2,FALSE)","v":{"$error":"#N/A"}},{"$f":"\"Model: \"","v":"Model: "},{"$f":"VLOOKUP(E612,INVENTORYDATA,3,FALSE)","v":{"$error":"#N/A"}},null,null,{"$f":"\"Make: \"","v":"Make: "},{"$f":"VLOOKUP(K612,INVENTORYDATA,2,FALSE)","v":{"$error":"#N/A"}},{"$f":"\"Model: \"","v":"Model: "},{"$f":"VLOOKUP(K612,INVENTORYDATA,3,FALSE)","v":{"$error":"#N/A"}}]
[{"$f":"\"CPU/Speed: \"","v":"CPU/Speed: "},{"$f":"VLOOKUP(E612,INVENTORYDATA,4,FALSE)&\" / \"&VLOOKUP(E612,INVENTORYDATA,5,FALSE)&\"GHz\"","v":{"$error":"#N/A"}},null,{"$f":"\"Memory: \"","v":"Memory: "},{"$f":"VLOOKUP(E612,INVENTORYDATA,6,FALSE)","v":{"$error":"#N/A"}},null,{"$f":"\"CPU/Speed: \"","v":"CPU/Speed: "},{"$f":"VLOOKUP(K612,INVENTORYDATA,4,FALSE)&\" / \"&VLOOKUP(K612,INVENTORYDATA,5,FALSE)&\"GHz\"","v":{"$error":"#N/A"}},null,{"$f":"\"Memory: \"","v":"Memory: "},{"$f":"VLOOKUP(K612,INVENTORYDATA,6,FALSE)","v":{"$error":"#N/A"}}]
[]
["Key Function",null,"Pass","Fail ","Comments",null,"Key Function",null,"Pass","Fail ","Comments"]
["Hard Drive Removed",null,{"$f":"IF(ISBLANK(VLOOKUP(E612,INVENTORYDATA,13,FALSE)),\"X\",\"\")","v":""},null,{"$f":"IF(ISBLANK(VLOOKUP(E612,INVENTORYDATA,13,FALSE)),\"\",VLOOKUP(E612,INVENTORYDATA,13,FALSE))","v":{"$error":"#N/A"}},null,"Hard Drive Removed",null,{"$f":"IF(ISBLANK(VLOOKUP(K612,INVENTORYDATA,13,FALSE)),\"X\",\"\")","v":""},null,{"$f":"IF(ISBLANK(VLOOKUP(K612,INVENTORYDATA,13,FALSE)),\"\",VLOOKUP(K612,INVENTORYDATA,13,FALSE))","v":{"$error":"#N/A"}}]
["Install Memory",null,"X",{"$nulls":3},"Install Memory",null,"X"]
["Power ON",null,"X",{"$nulls":3},"Power ON",null,"X"]
["Record BIOS info",null,"X",{"$nulls":3},"Record BIOS info",null,"X"]
["Check Optical Drive",null,{"$f":"IF((VLOOKUP(E612,INVENTORYDATA,7,FALSE))=\"YES\",\"X\",\"\")","v":{"$error":"#N/A"}},{"$f":"IF((VLOOKUP(E612,INVENTORYDATA,7,FALSE))=\"NO\",\"X\",\"\")","v":{"$error":"#N/A"}},null,null,"Check Optical Drive",null,{"$f":"IF((VLOOKUP(K612,INVENTORYDATA,7,FALSE))=\"YES\",\"X\",\"\")","v":{"$error":"#N/A"}},{"$f":"IF((VLOOKUP(K612,INVENTORYDATA,7,FALSE))=\"NO\",\"X\",\"\")","v":{"$error":"#N/A"}}]
["Power Off",null,"X",{"$nulls":3},"Power Off",null,"X"]
["HDD Serial No.",null,{"$f":"IF(ISBLANK(VLOOKUP(E612,INVENTORYDATA,12,FALSE)),\"\",VLOOKUP(E612,INVENTORYDATA,12,FALSE))","v":{"$error":"#N/A"}},{"$nulls":3},"HDD Serial No.",null,{"$f":"IF(ISBLANK(VLOOKUP(K612,INVENTORYDATA,12,FALSE)),\"\",VLOOKUP(K612,INVENTORYDATA,12,FALSE))","v":{"$error":"#N/A"}}]
[]
["Tested for key functions,R2/Ready for Resale",{"$nulls":5},"Tested for key functions,R2/Ready for Resale"]
["BIOS Lock","Caddy","Optical","WebCam","Battery",null,"BIOS Lock","Caddy","Optical","WebCam","Battery"]
[null,null,{"$f":"VLOOKUP(E612,INVENTORY!$A$2:$N$100,7,FALSE)","v":{"$error":"#N/A"}},{"$f":"VLOOKUP(E612,INVENTORY!$A$2:$N$100,8,FALSE)","v":{"$error":"#N/A"}},{"$f":"VLOOKUP(E612,INVENTORY!$A$2:$N$100,9,FALSE)","v":{"$error":"#N/A"}},{"$nulls":3},{"$f":"VLOOKUP(K612,INVENTORY!$A$2:$N$100,7,FALSE)","v":{"$error":"#N/A"}},{"$f":"VLOOKUP(K612,INVENTORY!$A$2:$N$100,8,FALSE)","v":{"$error":"#N/A"}},{"$f":"VLOOKUP(K612,INVENTORY!$A$2:$N$100,9,FALSE)","v":{"$error":"#N/A"}}]
[]
["CPU Cosmetics Defects:",null,{"$f":"\"Function Code: \"&VLOOKUP(E612,INVENTORY!$A$2:$Q$100,14,FALSE)","v":{"$error":"#N/A"}},{"$nulls":3},"CPU Cosmetics Defects:",null,{"$f":"\"Function Code: \"&VLOOKUP(K612,INVENTORY!$A$2:$Q$100,14,FALSE)","v":{"$error":"#N/A"}}]
[]
[null,null,{"$f":"\"Cosmetic Code: \"&VLOOKUP(E612,INVENTORY!$A$2:$Q$100,15,FALSE)","v":{"$error":"#N/A"}},{"$nulls":5},{"$f":"\"Cosmetic Code: \"&VLOOKUP(K612,INVENTORY!$A$2:$Q$100,15,FALSE)","v":{"$error":"#N/A"}}]
[]
["Casing","Plugs/Ports",{"$nulls":4},"Casing","Plugs/Ports"]
["Pass","Pass",{"$nulls":4},"Pass","Pass"]
["Fail","Fail",null,"TRRC#:L.T.R.",null,null,"Fail","Fail",null,"TRRC#:L.T.R."]
[]
["LAPTOP TESTING RECORD",{"$nulls":5},"LAPTOP TESTING RECORD"]
[]
[{"$nulls":3},"ITEM #",{"$f":"E612+2","v":45},{"$nulls":4},"ITEM #",{"$f":"K612+2","v":46}]
["Tester: ","RR","Date:",{"$f":"NOW()","v":"2025-12-15T11:00:59.760"},null,null,"Tester: ","RR","Date:",{"$f":"NOW()","v":"2025-12-15T11:00:59.760"}]
["Type: ","LAPTOP","SN:",{"$f":"VLOOKUP(E641,INVENTORYDATA,10,FALSE)","v":{"$error":"#N/A"}},null,null,"Type: ","LAPTOP","SN:",{"$f":"VLOOKUP(K641,INVENTORYDATA,10,FALSE)","v":{"$error":"#N/A"}}]
[{"$f":"\"Make: \"","v":"Make: "},{"$f":"VLOOKUP(E641,INVENTORYDATA,2,FALSE)","v":{"$error":"#N/A"}},{"$f":"\"Model: \"","v":"Model: "},{"$f":"VLOOKUP(E641,INVENTORYDATA,3,FALSE)","v":{"$error":"#N/A"}},null,null,{"$f":"\"Make: \"","v":"Make: "},{"$f":"VLOOKUP(K641,INVENTORYDATA,2,FALSE)","v":{"$error":"#N/A"}},{"$f":"\"Model: \"","v":"Model: "},{"$f":"VLOOKUP(K641,INVENTORYDATA,3,FALSE)","v":{"$error":"#N/A"}}]
[{"$f":"\"CPU/Speed: \"","v":"CPU/Speed: "},{"$f":"VLOOKUP(E641,INVENTORYDATA,4,FALSE)&\" / \"&VLOOKUP(E641,INVENTORYDATA,5,FALSE)&\"GHz\"","v":{"$error":"#N/A"}},null,{"$f":"\"Memory: \"","v":"Memory: "},{"$f":"VLOOKUP(E641,INVENTORYDATA,6,FALSE)","v":{"$error":"#N/A"}},null,{"$f":"\"CPU/Speed: \"","v":"CPU/Speed: "},{"$f":"VLOOKUP(K641,INVENTORYDATA,4,FALSE)&\" / \"&VLOOKUP(K641,INVENTORYDATA,5,FALSE)&\"GHz\"","v":{"$error":"#N/A"}},null,{"$f":"\"Memory: \"","v":"Memory: "},{"$f":"VLOOKUP(K641,INVENTORYDATA,6,FALSE)","v":{"$error":"#N/A"}}]
[]
["Key Function",null,"Pass","Fail ","Comments",null,"Key Function",null,"Pass","Fail ","Comments"]
["Hard Drive Removed",null,{"$f":"IF(ISBLANK(VLOOKUP(E641,INVENTORYDATA,13,FALSE)),\"X\",\"\")","v":""},null,{"$f":"IF(ISBLANK(VLOOKUP(E641,INVENTORYDATA,13,FALSE)),\"\",VLOOKUP(E641,INVENTORYDATA,13,FALSE))","v":{"$error":"#N/A"}},null,"Hard Drive Removed",null,{"$f":"IF(ISBLANK(VLOOKUP(K641,INVENTORYDATA,13,FALSE)),\"X\",\"\")","v":""},null,{"$f":"IF(ISBLANK(VLOOKUP(K641,INVENTORYDATA,13,FALSE)),\"\",VLOOKUP(K641,INVENTORYDATA,13,FALSE))","v":{"$error":"#N/A"}}]
["Install Memory",null,"X",{"$nulls":3},"Install Memory",null,"X"]
["Power ON",null,"X",{"$nulls":3},"Power ON",null,"X"]
["Record BIOS info",null,"X",{"$nulls":3},"Record BIOS info",null,"X"]
["Check Optical Drive",null,{"$f":"IF((VLOOKUP(E641,INVENTORYDATA,7,FALSE))=\"YES\",\"X\",\"\")","v":{"$error":"#N/A"}},{"$f":"IF((VLOOKUP(E641,INVENTORYDATA,7,FALSE))=\"NO\",\"X\",\"\")","v":{"$error":"#N/A"}},null,null,"Check Optical Drive",null,{"$f":"IF((VLOOKUP(K641,INVENTORYDATA,7,FALSE))=\"YES\",\"X\",\"\")","v":{"$error":"#N/A"}},{"$f":"IF((VLOOKUP(K641,INVENTORYDATA,7,FALSE))=\"NO\",\"X\",\"\")","v":{"$error":"#N/A"}}]
["Power Off",null,"X",{"$nulls":3},"Power Off",null,"X"]
["HDD Serial No.",null,{"$f":"IF(ISBLANK(VLOOKUP(E641,INVENTORYDATA,12,FALSE)),\"\",VLOOKUP(E641,INVENTORYDATA,12,FALSE))","v":{"$error":"#N/A"}},{"$nulls":3},"HDD Serial No.",null,{"$f":"IF(ISBLANK(VLOOKUP(K641,INVENTORYDATA,12,FALSE)),\"\",VLOOKUP(K641,INVENTORYDATA,12,FALSE))","v":{"$error":"#N/A"}}]
[]
["Tested for key functions,R2/Ready for Resale",{"$nulls":5},"Tested for key functions,R2/Ready for Resale"]
["BIOS Lock","Caddy","Optical","WebCam","Battery",null,"BIOS Lock","Caddy","Optical","WebCam","Battery"]
[null,null,{"$f":"VLOOKUP(E641,INVENTORY!$A$2:$N$100,7,FALSE)","v":{"$error":"#N/A"}},{"$f":"VLOOKUP(E641,INVENTORY!$A$2:$N$100,8,FALSE)","v":{"$error":"#N/A"}},{"$f":"VLOOKUP(E641,INVENTORY!$A$2:$N$100,9,FALSE)","v":{"$error":"#N/A"}},{"$nulls":3},{"$f":"VLOOKUP(K641,INVENTORY!$A$2:$N$100,7,FALSE)","v":{"$error":"#N/A"}},{"$f":"VLOOKUP(K641,INVENTORY!$A$2:$N$100,8,FALSE)","v":{"$error":"#N/A"}},{"$f":"VLOOKUP(K641,INVENTORY!$A$2:$N$100,9,FALSE)","v":{"$error":"#N/A"}}]
[]
["CPU Cosmetics Defects:",null,{"$f":"\"Function Code: \"&VLOOKUP(E641,INVENTORY!$A$2:$Q$100,14,FALSE)","v":{"$error":"#N/A"}},{"$nulls":3},"CPU Cosmetics Defects:",null,{"$f":"\"Function Code: \"&VLOOKUP(K641,INVENTORY!$A$2:$Q$100,14,FALSE)","v":{"$error":"#N/A"}}]
[]
[null,null,{"$f":"\"Cosmetic Code: \"&VLOOKUP(E641,INVENTORY!$A$2:$Q$100,15,FALSE)","v":{"$error":"#N/A"}},{"$nulls":5},{"$f":"\"Cosmetic Code: \"&VLOOKUP(K641,INVENTORY!$A$2:$Q$100,15,FALSE)","v":{"$error":"#N/A"}}]
[]
["Casing","Plugs/Ports",{"$nulls":4},"Casing","Plugs/Ports"]
["Pass","Pass",{"$nulls":4},"Pass","Pass"]
["Fail","Fail",null,"TRRC#:L.T.R.",null,null,"Fail","Fail",null,"TRRC#:L.T.R."]
[]
["LAPTOP TESTING RECORD",{"$nulls":5},"LAPTOP TESTING RECORD"]
[]
[{"$nulls":3},"ITEM #",{"$f":"E641+2","v":47},{"$nulls":4},"ITEM #",{"$f":"K641+2","v":48}]
["Tester: ","RR","Date:",{"$f":"NOW()","v":"2025-12-15T11:00:59.760"},null,null,"Tester: ","RR","Date:",{"$f":"NOW()","v":"2025-12-15T11:00:59.760"}]
["Type: ","LAPTOP","SN:",{"$f":"VLOOKUP(E670,INVENTORYDATA,10,FALSE)","v":{"$error":"#N/A"}},null,null,"Type: ","LAPTOP","SN:",{"$f":"VLOOKUP(K670,INVENTORYDATA,10,FALSE)","v":{"$error":"#N/A"}}]
[{"$f":"\"Make: \"","v":"Make: "},{"$f":"VLOOKUP(E670,INVENTORYDATA,2,FALSE)","v":{"$error":"#N/A"}},{"$f":"\"Model: \"","v":"Model: "},{"$f":"VLOOKUP(E670,INVENTORYDATA,3,FALSE)","v":{"$error":"#N/A"}},null,null,{"$f":"\"Make: \"","v":"Make: "},{"$f":"VLOOKUP(K670,INVENTORYDATA,2,FALSE)","v":{"$error":"#N/A"}},{"$f":"\"Model: \"","v":"Model: "},{"$f":"VLOOKUP(K670,INVENTORYDATA,3,FALSE)","v":{"$error":"#N/A"}}]
[{"$f":"\"CPU/Speed: \"","v":"CPU/Speed: "},{"$f":"VLOOKUP(E670,INVENTORYDATA,4,FALSE)&\" / \"&VLOOKUP(E670,INVENTORYDATA,5,FALSE)&\"GHz\"","v":{"$error":"#N/A"}},null,{"$f":"\"Memory: \"","v":"Memory: "},{"$f":"VLOOKUP(E670,INVENTORYDATA,6,FALSE)","v":{"$error":"#N/A"}},null,{"$f":"\"CPU/Speed: \"","v":"CPU/Speed: "},{"$f":"VLOOKUP(K670,INVENTORYDATA,4,FALSE)&\" / \"&VLOOKUP(K670,INVENTORYDATA,5,FALSE)&\"GHz\"","v":{"$error":"#N/A"}},null,{"$f":"\"Memory: \"","v":"Memory: "},{"$f":"VLOOKUP(K670,INVENTORYDATA,6,FALSE)","v":{"$error":"#N/A"}}]
[]
["Key Function",null,"Pass","Fail ","Comments",null,"Key Function",null,"Pass","Fail ","Comments"]
["Hard Drive Removed",null,{"$f":"IF(ISBLANK(VLOOKUP(E670,INVENTORYDATA,13,FALSE)),\"X\",\"\")","v":""},null,{"$f":"IF(ISBLANK(VLOOKUP(E670,INVENTORYDATA,13,FALSE)),\"\",VLOOKUP(E670,INVENTORYDATA,13,FALSE))","v":{"$error":"#N/A"}},null,"Hard Drive Removed",null,{"$f":"IF(ISBLANK(VLOOKUP(K670,INVENTORYDATA,13,FALSE)),\"X\",\"\")","v":""},null,{"$f":"IF(ISBLANK(VLOOKUP(K670,INVENTORYDATA,13,FALSE)),\"\",VLOOKUP(K670,INVENTORYDATA,13,FALSE))","v":{"$error":"#N/A"}}]
["Install Memory",null,"X",{"$nulls":3},"Install Memory",null,"X"]
["Power ON",null,"X",{"$nulls":3},"Power ON",null,"X"]
["Record BIOS info",null,"X",{"$nulls":3},"Record BIOS info",null,"X"]
["Check Optical Drive",null,{"$f":"IF((VLOOKUP(E670,INVENTORYDATA,7,FALSE))=\"YES\",\"X\",\"\")","v":{"$error":"#N/A"}},{"$f":"IF((VLOOKUP(E670,INVENTORYDATA,7,FALSE))=\"NO\",\"X\",\"\")","v":{"$error":"#N/A"}},null,null,"Check Optical Drive",null,{"$f":"IF((VLOOKUP(K670,INVENTORYDATA,7,FALSE))=\"YES\",\"X\",\"\")","v":{"$error":"#N/A"}},{"$f":"IF((VLOOKUP(K670,INVENTORYDATA,7,FALSE))=\"NO\",\"X\",\"\")","v":{"$error":"#N/A"}}]
["Power Off",null,"X",{"$nulls":3},"Power Off",null,"X"]
["HDD Serial No.",null,{"$f":"IF(ISBLANK(VLOOKUP(E670,INVENTORYDATA,12,FALSE)),\"\",VLOOKUP(E670,INVENTORYDATA,12,FALSE))","v":{"$error":"#N/A"}},{"$nulls":3},"HDD Serial No.",null,{"$f":"IF(ISBLANK(VLOOKUP(K670,INVENTORYDATA,12,FALSE)),\"\",VLOOKUP(K670,INVENTORYDATA,12,FALSE))","v":{"$error":"#N/A"}}]
[]
["Tested for key functions,R2/Ready for Resale",{"$nulls":5},"Tested for key functions,R2/Ready for Resale"]
["BIOS Lock","Caddy","Optical","WebCam","Battery",null,"BIOS Lock","Caddy","Optical","WebCam","Battery"]
[null,null,{"$f":"VLOOKUP(E670,INVENTORY!$A$2:$N$100,7,FALSE)","v":{"$error":"#N/A"}},{"$f":"VLOOKUP(E670,INVENTORY!$A$2:$N$100,8,FALSE)","v":{"$error":"#N/A"}},{"$f":"VLOOKUP(E670,INVENTORY!$A$2:$N$100,9,FALSE)","v":{"$error":"#N/A"}},{"$nulls":3},{"$f":"VLOOKUP(K670,INVENTORY!$A$2:$N$100,7,FALSE)","v":{"$error":"#N/A"}},{"$f":"VLOOKUP(K670,INVENTORY!$A$2:$N$100,8,FALSE)","v":{"$error":"#N/A"}},{"$f":"VLOOKUP(K670,INVENTORY!$A$2:$N$100,9,FALSE)","v":{"$error":"#N/A"}}]
[]
["CPU Cosmetics Defects:",null,{"$f":"\"Function Code: \"&VLOOKUP(E670,INVENTORY!$A$2:$Q$100,14,FALSE)","v":{"$error":"#N/A"}},{"$nulls":3},"CPU Cosmetics Defects:",null,{"$f":"\"Function Code: \"&VLOOKUP(K670,INVENTORY!$A$2:$Q$100,14,FALSE)","v":{"$error":"#N/A"}}]
[]
[null,null,{"$f":"\"Cosmetic Code: \"&VLOOKUP(E670,INVENTORY!$A$2:$Q$100,15,FALSE)","v":{"$error":"#N/A"}},{"$nulls":5},{"$f":"\"Cosmetic Code: \"&VLOOKUP(K670,INVENTORY!$A$2:$Q$100,15,FALSE)","v":{"$error":"#N/A"}}]
[]
["Casing","Plugs/Ports",{"$nulls":4},"Casing","Plugs/Ports"]
["Pass","Pass",{"$nulls":4},"Pass","Pass"]
["Fail","Fail",null,"TRRC#:L.T.R.",null,null,"Fail","Fail",null,"TRRC#:L.T.R."]
[]
["LAPTOP TESTING RECORD",{"$nulls":5},"LAPTOP TESTING RECORD"]
[]
[{"$nulls":3},"ITEM #",{"$f":"E670+2","v":49},{"$nulls":4},"ITEM #",{"$f":"K670+2","v":50}]
["Tester: ","RR","Date:",{"$f":"NOW()","v":"2025-12-15T11:00:59.760"},null,null,"Tester: ","RR","Date:",{"$f":"NOW()","v":"2025-12-15T11:00:59.760"}]
["Type: ","LAPTOP","SN:",{"$f":"VLOOKUP(E699,INVENTORYDATA,10,FALSE)","v":{"$error":"#N/A"}},null,null,"Type: ","LAPTOP","SN:",{"$f":"VLOOKUP(K699,INVENTORYDATA,10,FALSE)","v":{"$error":"#N/A"}}]
[{"$f":"\"Make: \"","v":"Make: "},{"$f":"VLOOKUP(E699,INVENTORYDATA,2,FALSE)","v":{"$error":"#N/A"}},{"$f":"\"Model: \"","v":"Model: "},{"$f":"VLOOKUP(E699,INVENTORYDATA,3,FALSE)","v":{"$error":"#N/A"}},null,null,{"$f":"\"Make: \"","v":"Make: "},{"$f":"VLOOKUP(K699,INVENTORYDATA,2,FALSE)","v":{"$error":"#N/A"}},{"$f":"\"Model: \"","v":"Model: "},{"$f":"VLOOKUP(K699,INVENTORYDATA,3,FALSE)","v":{"$error":"#N/A"}}]
[{"$f":"\"CPU/Speed: \"","v":"CPU/Speed: "},{"$f":"VLOOKUP(E699,INVENTORYDATA,4,FALSE)&\" / \"&VLOOKUP(E699,INVENTORYDATA,5,FALSE)&\"GHz\"","v":{"$error":"#N/A"}},null,{"$f":"\"Memory: \"","v":"Memory: "},{"$f":"VLOOKUP(E699,INVENTORYDATA,6,FALSE)","v":{"$error":"#N/A"}},null,{"$f":"\"CPU/Speed: \"","v":"CPU/Speed: "},{"$f":"VLOOKUP(K699,INVENTORYDATA,4,FALSE)&\" / \"&VLOOKUP(K699,INVENTORYDATA,5,FALSE)&\"GHz\"","v":{"$error":"#N/A"}},null,{"$f":"\"Memory: \"","v":"Memory: "},{"$f":"VLOOKUP(K699,INVENTORYDATA,6,FALSE)","v":{"$error":"#N/A"}}]
[]
["Key Function",null,"Pass","Fail ","Comments",null,"Key Function",null,"Pass","Fail ","Comments"]
["Hard Drive Removed",null,{"$f":"IF(ISBLANK(VLOOKUP(E699,INVENTORYDATA,13,FALSE)),\"X\",\"\")","v":""},null,{"$f":"IF(ISBLANK(VLOOKUP(E699,INVENTORYDATA,13,FALSE)),\"\",VLOOKUP(E699,INVENTORYDATA,13,FALSE))","v":{"$error":"#N/A"}},null,"Hard Drive Removed",null,{"$f":"IF(ISBLANK(VLOOKUP(K699,INVENTORYDATA,13,FALSE)),\"X\",\"\")","v":""},null,{"$f":"IF(ISBLANK(VLOOKUP(K699,INVENTORYDATA,13,FALSE)),\"\",VLOOKUP(K699,INVENTORYDATA,13,FALSE))","v":{"$error":"#N/A"}}]
["Install Memory",null,"X",{"$nulls":3},"Install Memory",null,"X"]
["Power ON",null,"X",{"$nulls":3},"Power ON",null,"X"]
["Record BIOS info",null,"X",{"$nulls":3},"Record BIOS info",null,"X"]
["Check Optical Drive",null,{"$f":"IF((VLOOKUP(E699,INVENTORYDATA,7,FALSE))=\"YES\",\"X\",\"\")","v":{"$error":"#N/A"}},{"$f":"IF((VLOOKUP(E699,INVENTORYDATA,7,FALSE))=\"NO\",\"X\",\"\")","v":{"$error":"#N/A"}},null,null,"Check Optical Drive",null,{"$f":"IF((VLOOKUP(K699,INVENTORYDATA,7,FALSE))=\"YES\",\"X\",\"\")","v":{"$error":"#N/A"}},{"$f":"IF((VLOOKUP(K699,INVENTORYDATA,7,FALSE))=\"NO\",\"X\",\"\")","v":{"$error":"#N/A"}}]
["Power Off",null,"X",{"$nulls":3},"Power Off",null,"X"]
["HDD Serial No.",null,{"$f":"IF(ISBLANK(VLOOKUP(E699,INVENTORYDATA,12,FALSE)),\"\",VLOOKUP(E699,INVENTORYDATA,12,FALSE))","v":{"$error":"#N/A"}},{"$nulls":3},"HDD Serial No.",null,{"$f":"IF(ISBLANK(VLOOKUP(K699,INVENTORYDATA,12,FALSE)),\"\",VLOOKUP(K699,INVENTORYDATA,12,FALSE))","v":{"$error":"#N/A"}}]
[]
["Tested for key functions,R2/Ready for Resale",{"$nulls":5},"Tested for key functions,R2/Ready for Resale"]
["BIOS Lock","Caddy","Optical","WebCam","Battery",null,"BIOS Lock","Caddy","Optical","WebCam","Battery"]
[null,null,{"$f":"VLOOKUP(E699,INVENTORY!$A$2:$N$100,7,FALSE)","v":{"$error":"#N/A"}},{"$f":"VLOOKUP(E699,INVENTORY!$A$2:$N$100,8,FALSE)","v":{"$error":"#N/A"}},{"$f":"VLOOKUP(E699,INVENTORY!$A$2:$N$100,9,FALSE)","v":{"$error":"#N/A"}},{"$nulls":3},{"$f":"VLOOKUP(K699,INVENTORY!$A$2:$N$100,7,FALSE)","v":{"$error":"#N/A"}},{"$f":"VLOOKUP(K699,INVENTORY!$A$2:$N$100,8,FALSE)","v":{"$error":"#N/A"}},{"$f":"VLOOKUP(K699,INVENTORY!$A$2:$N$100,9,FALSE)","v":{"$error":"#N/A"}}]
[]
["CPU Cosmetics Defects:",null,{"$f":"\"Function Code: \"&VLOOKUP(E699,INVENTORY!$A$2:$Q$100,14,FALSE)","v":{"$error":"#N/A"}},{"$nulls":3},"CPU Cosmetics Defects:",null,{"$f":"\"Function Code: \"&VLOOKUP(K699,INVENTORY!$A$2:$Q$100,14,FALSE)","v":{"$error":"#N/A"}}]
[]
[null,null,{"$f":"\"Cosmetic Code: \"&VLOOKUP(E699,INVENTORY!$A$2:$Q$100,15,FALSE)","v":{"$error":"#N/A"}},{"$nulls":5},{"$f":"\"Cosmetic Code: \"&VLOOKUP(K699,INVENTORY!$A$2:$Q$100,15,FALSE)","v":{"$error":"#N/A"}}]
[]
["Casing","Plugs/Ports",{"$nulls":4},"Casing","Plugs/Ports"]
["Pass","Pass",{"$nulls":4},"Pass","Pass"]
["Fail","Fail",null,"TRRC#:L.T.R.",null,null,"Fail","Fail",null,"TRRC#:L.T.R."]
[]
["LAPTOP TESTING RECORD",{"$nulls":5},"LAPTOP TESTING RECORD"]
[]
[{"$nulls":3},"ITEM #",{"$f":"E699+2","v":51},{"$nulls":4},"ITEM #",{"$f":"K699+2","v":52}]
["Tester: ","RR","Date:",{"$f":"NOW()","v":"2025-12-15T11:00:59.760"},null,null,"Tester: ","RR","Date:",{"$f":"NOW()","v":"2025-12-15T11:00:59.760"}]
["Type: ","LAPTOP","SN:",{"$f":"VLOOKUP(E728,INVENTORYDATA,10,FALSE)","v":{"$error":"#N/A"}},null,null,"Type: ","LAPTOP","SN:",{"$f":"VLOOKUP(K728,INVENTORYDATA,10,FALSE)","v":{"$error":"#N/A"}}]
[{"$f":"\"Make: \"","v":"Make: "},{"$f":"VLOOKUP(E728,INVENTORYDATA,2,FALSE)","v":{"$error":"#N/A"}},{"$f":"\"Model: \"","v":"Model: "},{"$f":"VLOOKUP(E728,INVENTORYDATA,3,FALSE)","v":{"$error":"#N/A"}},null,null,{"$f":"\"Make: \"","v":"Make: "},{"$f":"VLOOKUP(K728,INVENTORYDATA,2,FALSE)","v":{"$error":"#N/A"}},{"$f":"\"Model: \"","v":"Model: "},{"$f":"VLOOKUP(K728,INVENTORYDATA,3,FALSE)","v":{"$error":"#N/A"}}]
[{"$f":"\"CPU/Speed: \"","v":"CPU/Speed: "},{"$f":"VLOOKUP(E728,INVENTORYDATA,4,FALSE)&\" / \"&VLOOKUP(E728,INVENTORYDATA,5,FALSE)&\"GHz\"","v":{"$error":"#N/A"}},null,{"$f":"\"Memory: \"","v":"Memory: "},{"$f":"VLOOKUP(E728,INVENTORYDATA,6,FALSE)","v":{"$error":"#N/A"}},null,{"$f":"\"CPU/Speed: \"","v":"CPU/Speed: "},{"$f":"VLOOKUP(K728,INVENTORYDATA,4,FALSE)&\" / \"&VLOOKUP(K728,INVENTORYDATA,5,FALSE)&\"GHz\"","v":{"$error":"#N/A"}},null,{"$f":"\"Memory: \"","v":"Memory: "},{"$f":"VLOOKUP(K728,INVENTORYDATA,6,FALSE)","v":{"$error":"#N/A"}}]
[]
["Key Function",null,"Pass","Fail ","Comments",null,"Key Function",null,"Pass","Fail ","Comments"]
["Hard Drive Removed",null,{"$f":"IF(ISBLANK(VLOOKUP(E728,INVENTORYDATA,13,FALSE)),\"X\",\"\")","v":""},null,{"$f":"IF(ISBLANK(VLOOKUP(E728,INVENTORYDATA,13,FALSE)),\"\",VLOOKUP(E728,INVENTORYDATA,13,FALSE))","v":{"$error":"#N/A"}},null,"Hard Drive Removed",null,{"$f":"IF(ISBLANK(VLOOKUP(K728,INVENTORYDATA,13,FALSE)),\"X\",\"\")","v":""},null,{"$f":"IF(ISBLANK(VLOOKUP(K728,INVENTORYDATA,13,FALSE)),\"\",VLOOKUP(K728,INVENTORYDATA,13,FALSE))","v":{"$error":"#N/A"}}]
["Install Memory",null,"X",{"$nulls":3},"Install Memory",null,"X"]
["Power ON",null,"X",{"$nulls":3},"Power ON",null,"X"]
["Record BIOS info",null,"X",{"$nulls":3},"Record BIOS info",null,"X"]
["Check Optical Drive",null,{"$f":"IF((VLOOKUP(E728,INVENTORYDATA,7,FALSE))=\"YES\",\"X\",\"\")","v":{"$error":"#N/A"}},{"$f":"IF((VLOOKUP(E728,INVENTORYDATA,7,FALSE))=\"NO\",\"X\",\"\")","v":{"$error":"#N/A"}},null,null,"Check Optical Drive",null,{"$f":"IF((VLOOKUP(K728,INVENTORYDATA,7,FALSE))=\"YES\",\"X\",\"\")","v":{"$error":"#N/A"}},{"$f":"IF((VLOOKUP(K728,INVENTORYDATA,7,FALSE))=\"NO\",\"X\",\"\")","v":{"$error":"#N/A"}}]
["Power Off",null,"X",{"$nulls":3},"Power Off",null,"X"]
["HDD Serial No.",null,{"$f":"IF(ISBLANK(VLOOKUP(E728,INVENTORYDATA,12,FALSE)),\"\",VLOOKUP(E728,INVENTORYDATA,12,FALSE))","v":{"$error":"#N/A"}},{"$nulls":3},"HDD Serial No.",null,{"$f":"IF(ISBLANK(VLOOKUP(K728,INVENTORYDATA,12,FALSE)),\"\",VLOOKUP(K728,INVENTORYDATA,12,FALSE))","v":{"$error":"#N/A"}}]
[]
["Tested for key functions,R2/Ready for Resale",{"$nulls":5},"Tested for key functions,R2/Ready for Resale"]
["BIOS Lock","Caddy","Optical","WebCam","Battery",null,"BIOS Lock","Caddy","Optical","WebCam","Battery"]
[null,null,{"$f":"VLOOKUP(E728,INVENTORY!$A$2:$N$100,7,FALSE)","v":{"$error":"#N/A"}},{"$f":"VLOOKUP(E728,INVENTORY!$A$2:$N$100,8,FALSE)","v":{"$error":"#N/A"}},{"$f":"VLOOKUP(E728,INVENTORY!$A$2:$N$100,9,FALSE)","v":{"$error":"#N/A"}},{"$nulls":3},{"$f":"VLOOKUP(K728,INVENTORY!$A$2:$N$100,7,FALSE)","v":{"$error":"#N/A"}},{"$f":"VLOOKUP(K728,INVENTORY!$A$2:$N$100,8,FALSE)","v":{"$error":"#N/A"}},{"$f":"VLOOKUP(K728,INVENTORY!$A$2:$N$100,9,FALSE)","v":{"$error":"#N/A"}}]
[]
["CPU Cosmetics Defects:",null,{"$f":"\"Function Code: \"&VLOOKUP(E728,INVENTORY!$A$2:$Q$100,14,FALSE)","v":{"$error":"#N/A"}},{"$nulls":3},"CPU Cosmetics Defects:",null,{"$f":"\"Function Code: \"&VLOOKUP(K728,INVENTORY!$A$2:$Q$100,14,FALSE)","v":{"$error":"#N/A"}}]
[]
[null,null,{"$f":"\"Cosmetic Code: \"&VLOOKUP(E728,INVENTORY!$A$2:$Q$100,15,FALSE)","v":{"$error":"#N/A"}},{"$nulls":5},{"$f":"\"Cosmetic Code: \"&VLOOKUP(K728,INVENTORY!$A$2:$Q$100,15,FALSE)","v":{"$error":"#N/A"}}]
[]
["Casing","Plugs/Ports",{"$nulls":4},"Casing","Plugs/Ports"]
["Pass","Pass",{"$nulls":4},"Pass","Pass"]
["Fail","Fail",null,"TRRC#:L.T.R.",null,null,"Fail","Fail",null,"TRRC#:L.T.R."]
[]
["LAPTOP TESTING RECORD",{"$nulls":5},"LAPTOP TESTING RECORD"]
[]
[{"$nulls":3},"ITEM #",{"$f":"E728+2","v":53},{"$nulls":4},"ITEM #",{"$f":"K728+2","v":54}]
["Tester: ","RR","Date:",{"$f":"NOW()","v":"2025-12-15T11:00:59.760"},null,null,"Tester: ","RR","Date:",{"$f":"NOW()","v":"2025-12-15T11:00:59.760"}]
["Type: ","LAPTOP","SN:",{"$f":"VLOOKUP(E757,INVENTORYDATA,10,FALSE)","v":{"$error":"#N/A"}},null,null,"Type: ","LAPTOP","SN:",{"$f":"VLOOKUP(K757,INVENTORYDATA,10,FALSE)","v":{"$error":"#N/A"}}]
[{"$f":"\"Make: \"","v":"Make: "},{"$f":"VLOOKUP(E757,INVENTORYDATA,2,FALSE)","v":{"$error":"#N/A"}},{"$f":"\"Model: \"","v":"Model: "},{"$f":"VLOOKUP(E757,INVENTORYDATA,3,FALSE)","v":{"$error":"#N/A"}},null,null,{"$f":"\"Make: \"","v":"Make: "},{"$f":"VLOOKUP(K757,INVENTORYDATA,2,FALSE)","v":{"$error":"#N/A"}},{"$f":"\"Model: \"","v":"Model: "},{"$f":"VLOOKUP(K757,INVENTORYDATA,3,FALSE)","v":{"$error":"#N/A"}}]
[{"$f":"\"CPU/Speed: \"","v":"CPU/Speed: "},{"$f":"VLOOKUP(E757,INVENTORYDATA,4,FALSE)&\" / \"&VLOOKUP(E757,INVENTORYDATA,5,FALSE)&\"GHz\"","v":{"$error":"#N/A"}},null,{"$f":"\"Memory: \"","v":"Memory: "},{"$f":"VLOOKUP(E757,INVENTORYDATA,6,FALSE)","v":{"$error":"#N/A"}},null,{"$f":"\"CPU/Speed: \"","v":"CPU/Speed: "},{"$f":"VLOOKUP(K757,INVENTORYDATA,4,FALSE)&\" / \"&VLOOKUP(K757,INVENTORYDATA,5,FALSE)&\"GHz\"","v":{"$error":"#N/A"}},null,{"$f":"\"Memory: \"","v":"Memory: "},{"$f":"VLOOKUP(K757,INVENTORYDATA,6,FALSE)","v":{"$error":"#N/A"}}]
[]
["Key Function",null,"Pass","Fail ","Comments",null,"Key Function",null,"Pass","Fail ","Comments"]
["Hard Drive Removed",null,{"$f":"IF(ISBLANK(VLOOKUP(E757,INVENTORYDATA,13,FALSE)),\"X\",\"\")","v":""},null,{"$f":"IF(ISBLANK(VLOOKUP(E757,INVENTORYDATA,13,FALSE)),\"\",VLOOKUP(E757,INVENTORYDATA,13,FALSE))","v":{"$error":"#N/A"}},null,"Hard Drive Removed",null,{"$f":"IF(ISBLANK(VLOOKUP(K757,INVENTORYDATA,13,FALSE)),\"X\",\"\")","v":""},null,{"$f":"IF(ISBLANK(VLOOKUP(K757,INVENTORYDATA,13,FALSE)),\"\",VLOOKUP(K757,INVENTORYDATA,13,FALSE))","v":{"$error":"#N/A"}}]
["Install Memory",null,"X",{"$nulls":3},"Install Memory",null,"X"]
["Power ON",null,"X",{"$nulls":3},"Power ON",null,"X"]
["Record BIOS info",null,"X",{"$nulls":3},"Record BIOS info",null,"X"]
["Check Optical Drive",null,{"$f":"IF((VLOOKUP(E757,INVENTORYDATA,7,FALSE))=\"YES\",\"X\",\"\")","v":{"$error":"#N/A"}},{"$f":"IF((VLOOKUP(E757,INVENTORYDATA,7,FALSE))=\"NO\",\"X\",\"\")","v":{"$error":"#N/A"}},null,null,"Check Optical Drive",null,{"$f":"IF((VLOOKUP(K757,INVENTORYDATA,7,FALSE))=\"YES\",\"X\",\"\")","v":{"$error":"#N/A"}},{"$f":"IF((VLOOKUP(K757,INVENTORYDATA,7,FALSE))=\"NO\",\"X\",\"\")","v":{"$error":"#N/A"}}]
["Power Off",null,"X",{"$nulls":3},"Power Off",null,"X"]
["HDD Serial No.",null,{"$f":"IF(ISBLANK(VLOOKUP(E757,INVENTORYDATA,12,FALSE)),\"\",VLOOKUP(E757,INVENTORYDATA,12,FALSE))","v":{"$error":"#N/A"}},{"$nulls":3},"HDD Serial No.",null,{"$f":"IF(ISBLANK(VLOOKUP(K757,INVENTORYDATA,12,FALSE)),\"\",VLOOKUP(K757,INVENTORYDATA,12,FALSE))","v":{"$error":"#N/A"}}]
[]
["Tested for key functions,R2/Ready for Resale",{"$nulls":5},"Tested for key functions,R2/Ready for Resale"]
["BIOS Lock","Caddy","Optical","WebCam","Battery",null,"BIOS Lock","Caddy","Optical","WebCam","Battery"]
[null,null,{"$f":"VLOOKUP(E757,INVENTORY!$A$2:$N$100,7,FALSE)","v":{"$error":"#N/A"}},{"$f":"VLOOKUP(E757,INVENTORY!$A$2:$N$100,8,FALSE)","v":{"$error":"#N/A"}},{"$f":"VLOOKUP(E757,INVENTORY!$A$2:$N$100,9,FALSE)","v":{"$error":"#N/A"}},{"$nulls":3},{"$f":"VLOOKUP(K757,INVENTORY!$A$2:$N$100,7,FALSE)","v":{"$error":"#N/A"}},{"$f":"VLOOKUP(K757,INVENTORY!$A$2:$N$100,8,FALSE)","v":{"$error":"#N/A"}},{"$f":"VLOOKUP(K757,INVENTORY!$A$2:$N$100,9,FALSE)","v":{"$error":"#N/A"}}]
[]
["CPU Cosmetics Defects:",null,{"$f":"\"Function Code: \"&VLOOKUP(E757,INVENTORY!$A$2:$Q$100,14,FALSE)","v":{"$error":"#N/A"}},{"$nulls":3},"CPU Cosmetics Defects:",null,{"$f":"\"Function Code: \"&VLOOKUP(K757,INVENTORY!$A$2:$Q$100,14,FALSE)","v":{"$error":"#N/A"}}]
[]
[null,null,{"$f":"\"Cosmetic Code: \"&VLOOKUP(E757,INVENTORY!$A$2:$Q$100,15,FALSE)","v":{"$error":"#N/A"}},{"$nulls":5},{"$f":"\"Cosmetic Code: \"&VLOOKUP(K757,INVENTORY!$A$2:$Q$100,15,FALSE)","v":{"$error":"#N/A"}}]
[]
["Casing","Plugs/Ports",{"$nulls":4},"Casing","Plugs/Ports"]
["Pass","Pass",{"$nulls":4},"Pass","Pass"]
["Fail","Fail",null,"TRRC#:L.T.R.",null,null,"Fail","Fail",null,"TRRC#:L.T.R."]
[]
["LAPTOP TESTING RECORD",{"$nulls":5},"LAPTOP TESTING RECORD"]
[]
[{"$nulls":3},"ITEM #",{"$f":"E757+2","v":55},{"$nulls":4},"ITEM #",{"$f":"K757+2","v":56}]
["Tester: ","RR","Date:",{"$f":"NOW()","v":"2025-12-15T11:00:59.760"},null,null,"Tester: ","RR","Date:",{"$f":"NOW()","v":"2025-12-15T11:00:59.760"}]
["Type: ","LAPTOP","SN:",{"$f":"VLOOKUP(E786,INVENTORYDATA,10,FALSE)","v":{"$error":"#N/A"}},null,null,"Type: ","LAPTOP","SN:",{"$f":"VLOOKUP(K786,INVENTORYDATA,10,FALSE)","v":{"$error":"#N/A"}}]
[{"$f":"\"Make: \"","v":"Make: "},{"$f":"VLOOKUP(E786,INVENTORYDATA,2,FALSE)","v":{"$error":"#N/A"}},{"$f":"\"Model: \"","v":"Model: "},{"$f":"VLOOKUP(E786,INVENTORYDATA,3,FALSE)","v":{"$error":"#N/A"}},null,null,{"$f":"\"Make: \"","v":"Make: "},{"$f":"VLOOKUP(K786,INVENTORYDATA,2,FALSE)","v":{"$error":"#N/A"}},{"$f":"\"Model: \"","v":"Model: "},{"$f":"VLOOKUP(K786,INVENTORYDATA,3,FALSE)","v":{"$error":"#N/A"}}]
[{"$f":"\"CPU/Speed: \"","v":"CPU/Speed: "},{"$f":"VLOOKUP(E786,INVENTORYDATA,4,FALSE)&\" / \"&VLOOKUP(E786,INVENTORYDATA,5,FALSE)&\"GHz\"","v":{"$error":"#N/A"}},null,{"$f":"\"Memory: \"","v":"Memory: "},{"$f":"VLOOKUP(E786,INVENTORYDATA,6,FALSE)","v":{"$error":"#N/A"}},null,{"$f":"\"CPU/Speed: \"","v":"CPU/Speed: "},{"$f":"VLOOKUP(K786,INVENTORYDATA,4,FALSE)&\" / \"&VLOOKUP(K786,INVENTORYDATA,5,FALSE)&\"GHz\"","v":{"$error":"#N/A"}},null,{"$f":"\"Memory: \"","v":"Memory: "},{"$f":"VLOOKUP(K786,INVENTORYDATA,6,FALSE)","v":{"$error":"#N/A"}}]
[]
["Key Function",null,"Pass","Fail ","Comments",null,"Key Function",null,"Pass","Fail ","Comments"]
["Hard Drive Removed",null,{"$f":"IF(ISBLANK(VLOOKUP(E786,INVENTORYDATA,13,FALSE)),\"X\",\"\")","v":""},null,{"$f":"IF(ISBLANK(VLOOKUP(E786,INVENTORYDATA,13,FALSE)),\"\",VLOOKUP(E786,INVENTORYDATA,13,FALSE))","v":{"$error":"#N/A"}},null,"Hard Drive Removed",null,{"$f":"IF(ISBLANK(VLOOKUP(K786,INVENTORYDATA,13,FALSE)),\"X\",\"\")","v":""},null,{"$f":"IF(ISBLANK(VLOOKUP(K786,INVENTORYDATA,13,FALSE)),\"\",VLOOKUP(K786,INVENTORYDATA,13,FALSE))","v":{"$error":"#N/A"}}]
["Install Memory",null,"X",{"$nulls":3},"Install Memory",null,"X"]
["Power ON",null,"X",{"$nulls":3},"Power ON",null,"X"]
["Record BIOS info",null,"X",{"$nulls":3},"Record BIOS info",null,"X"]
["Check Optical Drive",null,{"$f":"IF((VLOOKUP(E786,INVENTORYDATA,7,FALSE))=\"YES\",\"X\",\"\")","v":{"$error":"#N/A"}},{"$f":"IF((VLOOKUP(E786,INVENTORYDATA,7,FALSE))=\"NO\",\"X\",\"\")","v":{"$error":"#N/A"}},null,null,"Check Optical Drive",null,{"$f":"IF((VLOOKUP(K786,INVENTORYDATA,7,FALSE))=\"YES\",\"X\",\"\")","v":{"$error":"#N/A"}},{"$f":"IF((VLOOKUP(K786,INVENTORYDATA,7,FALSE))=\"NO\",\"X\",\"\")","v":{"$error":"#N/A"}}]
["Power Off",null,"X",{"$nulls":3},"Power Off",null,"X"]
["HDD Serial No.",null,{"$f":"IF(ISBLANK(VLOOKUP(E786,INVENTORYDATA,12,FALSE)),\"\",VLOOKUP(E786,INVENTORYDATA,12,FALSE))","v":{"$error":"#N/A"}},{"$nulls":3},"HDD Serial No.",null,{"$f":"IF(ISBLANK(VLOOKUP(K786,INVENTORYDATA,12,FALSE)),\"\",VLOOKUP(K786,INVENTORYDATA,12,FALSE))","v":{"$error":"#N/A"}}]
[]
["Tested for key functions,R2/Ready for Resale",{"$nulls":5},"Tested for key functions,R2/Ready for Resale"]
["BIOS Lock","Caddy","Optical","WebCam","Battery",null,"BIOS Lock","Caddy","Optical","WebCam","Battery"]
[null,null,{"$f":"VLOOKUP(E786,INVENTORY!$A$2:$N$100,7,FALSE)","v":{"$error":"#N/A"}},{"$f":"VLOOKUP(E786,INVENTORY!$A$2:$N$100,8,FALSE)","v":{"$error":"#N/A"}},{"$f":"VLOOKUP(E786,INVENTORY!$A$2:$N$100,9,FALSE)","v":{"$error":"#N/A"}},{"$nulls":3},{"$f":"VLOOKUP(K786,INVENTORY!$A$2:$N$100,7,FALSE)","v":{"$error":"#N/A"}},{"$f":"VLOOKUP(K786,INVENTORY!$A$2:$N$100,8,FALSE)","v":{"$error":"#N/A"}},{"$f":"VLOOKUP(K786,INVENTORY!$A$2:$N$100,9,FALSE)","v":{"$error":"#N/A"}}]
[]
["CPU Cosmetics Defects:",null,{"$f":"\"Function Code: \"&VLOOKUP(E786,INVENTORY!$A$2:$Q$100,14,FALSE)","v":{"$error":"#N/A"}},{"$nulls":3},"CPU Cosmetics Defects:",null,{"$f":"\"Function Code: \"&VLOOKUP(K786,INVENTORY!$A$2:$Q$100,14,FALSE)","v":{"$error":"#N/A"}}]
[]
[null,null,{"$f":"\"Cosmetic Code: \"&VLOOKUP(E786,INVENTORY!$A$2:$Q$100,15,FALSE)","v":{"$error":"#N/A"}},{"$nulls":5},{"$f":"\"Cosmetic Code: \"&VLOOKUP(K786,INVENTORY!$A$2:$Q$100,15,FALSE)","v":{"$error":"#N/A"}}]
[]
["Casing","Plugs/Ports",{"$nulls":4},"Casing","Plugs/Ports"]
["Pass","Pass",{"$nulls":4},"Pass","Pass"]
["Fail","Fail",null,"TRRC#:L.T.R.",null,null,"Fail","Fail",null,"TRRC#:L.T.R."]
[]
["LAPTOP TESTING RECORD",{"$nulls":5},"LAPTOP TESTING RECORD"]
[]
[{"$nulls":3},"ITEM #",{"$f":"E786+2","v":57},{"$nulls":4},"ITEM #",{"$f":"K786+2","v":58}]
["Tester: ","RR","Date:",{"$f":"NOW()","v":"2025-12-15T11:00:59.760"},null,null,"Tester: ","RR","Date:",{"$f":"NOW()","v":"2025-12-15T11:00:59.760"}]
["Type: ","LAPTOP","SN:",{"$f":"VLOOKUP(E815,INVENTORYDATA,10,FALSE)","v":{"$error":"#N/A"}},null,null,"Type: ","LAPTOP","SN:",{"$f":"VLOOKUP(K815,INVENTORYDATA,10,FALSE)","v":{"$error":"#N/A"}}]
[{"$f":"\"Make: \"","v":"Make: "},{"$f":"VLOOKUP(E815,INVENTORYDATA,2,FALSE)","v":{"$error":"#N/A"}},{"$f":"\"Model: \"","v":"Model: "},{"$f":"VLOOKUP(E815,INVENTORYDATA,3,FALSE)","v":{"$error":"#N/A"}},null,null,{"$f":"\"Make: \"","v":"Make: "},{"$f":"VLOOKUP(K815,INVENTORYDATA,2,FALSE)","v":{"$error":"#N/A"}},{"$f":"\"Model: \"","v":"Model: "},{"$f":"VLOOKUP(K815,INVENTORYDATA,3,FALSE)","v":{"$error":"#N/A"}}]
[{"$f":"\"CPU/Speed: \"","v":"CPU/Speed: "},{"$f":"VLOOKUP(E815,INVENTORYDATA,4,FALSE)&\" / \"&VLOOKUP(E815,INVENTORYDATA,5,FALSE)&\"GHz\"","v":{"$error":"#N/A"}},null,{"$f":"\"Memory: \"","v":"Memory: "},{"$f":"VLOOKUP(E815,INVENTORYDATA,6,FALSE)","v":{"$error":"#N/A"}},null,{"$f":"\"CPU/Speed: \"","v":"CPU/Speed: "},{"$f":"VLOOKUP(K815,INVENTORYDATA,4,FALSE)&\" / \"&VLOOKUP(K815,INVENTORYDATA,5,FALSE)&\"GHz\"","v":{"$error":"#N/A"}},null,{"$f":"\"Memory: \"","v":"Memory: "},{"$f":"VLOOKUP(K815,INVENTORYDATA,6,FALSE)","v":{"$error":"#N/A"}}]
[]
["Key Function",null,"Pass","Fail ","Comments",null,"Key Function",null,"Pass","Fail ","Comments"]
["Hard Drive Removed",null,{"$f":"IF(ISBLANK(VLOOKUP(E815,INVENTORYDATA,13,FALSE)),\"X\",\"\")","v":""},null,{"$f":"IF(ISBLANK(VLOOKUP(E815,INVENTORYDATA,13,FALSE)),\"\",VLOOKUP(E815,INVENTORYDATA,13,FALSE))","v":{"$error":"#N/A"}},null,"Hard Drive Removed",null,{"$f":"IF(ISBLANK(VLOOKUP(K815,INVENTORYDATA,13,FALSE)),\"X\",\"\")","v":""},null,{"$f":"IF(ISBLANK(VLOOKUP(K815,INVENTORYDATA,13,FALSE)),\"\",VLOOKUP(K815,INVENTORYDATA,13,FALSE))","v":{"$error":"#N/A"}}]
["Install Memory",null,"X",{"$nulls":3},"Install Memory",null,"X"]
["Power ON",null,"X",{"$nulls":3},"Power ON",null,"X"]
["Record BIOS info",null,"X",{"$nulls":3},"Record BIOS info",null,"X"]
["Check Optical Drive",null,{"$f":"IF((VLOOKUP(E815,INVENTORYDATA,7,FALSE))=\"YES\",\"X\",\"\")","v":{"$error":"#N/A"}},{"$f":"IF((VLOOKUP(E815,INVENTORYDATA,7,FALSE))=\"NO\",\"X\",\"\")","v":{"$error":"#N/A"}},null,null,"Check Optical Drive",null,{"$f":"IF((VLOOKUP(K815,INVENTORYDATA,7,FALSE))=\"YES\",\"X\",\"\")","v":{"$error":"#N/A"}},{"$f":"IF((VLOOKUP(K815,INVENTORYDATA,7,FALSE))=\"NO\",\"X\",\"\")","v":{"$error":"#N/A"}}]
["Power Off",null,"X",{"$nulls":3},"Power Off",null,"X"]
["HDD Serial No.",null,{"$f":"IF(ISBLANK(VLOOKUP(E815,INVENTORYDATA,12,FALSE)),\"\",VLOOKUP(E815,INVENTORYDATA,12,FALSE))","v":{"$error":"#N/A"}},{"$nulls":3},"HDD Serial No.",null,{"$f":"IF(ISBLANK(VLOOKUP(K815,INVENTORYDATA,12,FALSE)),\"\",VLOOKUP(K815,INVENTORYDATA,12,FALSE))","v":{"$error":"#N/A"}}]
[]
["Tested for key functions,R2/Ready for Resale",{"$nulls":5},"Tested for key functions,R2/Ready for Resale"]
["BIOS Lock","Caddy","Optical","WebCam","Battery",null,"BIOS Lock","Caddy","Optical","WebCam","Battery"]
[null,null,{"$f":"VLOOKUP(E815,INVENTORY!$A$2:$N$100,7,FALSE)","v":{"$error":"#N/A"}},{"$f":"VLOOKUP(E815,INVENTORY!$A$2:$N$100,8,FALSE)","v":{"$error":"#N/A"}},{"$f":"VLOOKUP(E815,INVENTORY!$A$2:$N$100,9,FALSE)","v":{"$error":"#N/A"}},{"$nulls":3},{"$f":"VLOOKUP(K815,INVENTORY!$A$2:$N$100,7,FALSE)","v":{"$error":"#N/A"}},{"$f":"VLOOKUP(K815,INVENTORY!$A$2:$N$100,8,FALSE)","v":{"$error":"#N/A"}},{"$f":"VLOOKUP(K815,INVENTORY!$A$2:$N$100,9,FALSE)","v":{"$error":"#N/A"}}]
[]
["CPU Cosmetics Defects:",null,{"$f":"\"Function Code: \"&VLOOKUP(E815,INVENTORY!$A$2:$Q$100,14,FALSE)","v":{"$error":"#N/A"}},{"$nulls":3},"CPU Cosmetics Defects:",null,{"$f":"\"Function Code: \"&VLOOKUP(K815,INVENTORY!$A$2:$Q$100,14,FALSE)","v":{"$error":"#N/A"}}]
[]
[null,null,{"$f":"\"Cosmetic Code: \"&VLOOKUP(E815,INVENTORY!$A$2:$Q$100,15,FALSE)","v":{"$error":"#N/A"}},{"$nulls":5},{"$f":"\"Cosmetic Code: \"&VLOOKUP(K815,INVENTORY!$A$2:$Q$100,15,FALSE)","v":{"$error":"#N/A"}}]
[]
["Casing","Plugs/Ports",{"$nulls":4},"Casing","Plugs/Ports"]
["Pass","Pass",{"$nulls":4},"Pass","Pass"]
["Fail","Fail",null,"TRRC#:L.T.R.",null,null,"Fail","Fail",null,"TRRC#:L.T.R."]
[]
["LAPTOP TESTING RECORD",{"$nulls":5},"LAPTOP TESTING RECORD"]
[]
[{"$nulls":3},"ITEM #",{"$f":"E815+2","v":59},{"$nulls":4},"ITEM #",{"$f":"K815+2","v":60}]
["Tester: ","RR","Date:",{"$f":"NOW()","v":"2025-12-15T11:00:59.760"},null,null,"Tester: ","RR","Date:",{"$f":"NOW()","v":"2025-12-15T11:00:59.760"}]
["Type: ","LAPTOP","SN:",{"$f":"VLOOKUP(E844,INVENTORYDATA,10,FALSE)","v":{"$error":"#N/A"}},null,null,"Type: ","LAPTOP","SN:",{"$f":"VLOOKUP(K844,INVENTORYDATA,10,FALSE)","v":{"$error":"#N/A"}}]
[{"$f":"\"Make: \"","v":"Make: "},{"$f":"VLOOKUP(E844,INVENTORYDATA,2,FALSE)","v":{"$error":"#N/A"}},{"$f":"\"Model: \"","v":"Model: "},{"$f":"VLOOKUP(E844,INVENTORYDATA,3,FALSE)","v":{"$error":"#N/A"}},null,null,{"$f":"\"Make: \"","v":"Make: "},{"$f":"VLOOKUP(K844,INVENTORYDATA,2,FALSE)","v":{"$error":"#N/A"}},{"$f":"\"Model: \"","v":"Model: "},{"$f":"VLOOKUP(K844,INVENTORYDATA,3,FALSE)","v":{"$error":"#N/A"}}]
[{"$f":"\"CPU/Speed: \"","v":"CPU/Speed: "},{"$f":"VLOOKUP(E844,INVENTORYDATA,4,FALSE)&\" / \"&VLOOKUP(E844,INVENTORYDATA,5,FALSE)&\"GHz\"","v":{"$error":"#N/A"}},null,{"$f":"\"Memory: \"","v":"Memory: "},{"$f":"VLOOKUP(E844,INVENTORYDATA,6,FALSE)","v":{"$error":"#N/A"}},null,{"$f":"\"CPU/Speed: \"","v":"CPU/Speed: "},{"$f":"VLOOKUP(K844,INVENTORYDATA,4,FALSE)&\" / \"&VLOOKUP(K844,INVENTORYDATA,5,FALSE)&\"GHz\"","v":{"$error":"#N/A"}},null,{"$f":"\"Memory: \"","v":"Memory: "},{"$f":"VLOOKUP(K844,INVENTORYDATA,6,FALSE)","v":{"$error":"#N/A"}}]
[]
["Key Function",null,"Pass","Fail ","Comments",null,"Key Function",null,"Pass","Fail ","Comments"]
["Hard Drive Removed",null,{"$f":"IF(ISBLANK(VLOOKUP(E844,INVENTORYDATA,13,FALSE)),\"X\",\"\")","v":""},null,{"$f":"IF(ISBLANK(VLOOKUP(E844,INVENTORYDATA,13,FALSE)),\"\",VLOOKUP(E844,INVENTORYDATA,13,FALSE))","v":{"$error":"#N/A"}},null,"Hard Drive Removed",null,{"$f":"IF(ISBLANK(VLOOKUP(K844,INVENTORYDATA,13,FALSE)),\"X\",\"\")","v":""},null,{"$f":"IF(ISBLANK(VLOOKUP(K844,INVENTORYDATA,13,FALSE)),\"\",VLOOKUP(K844,INVENTORYDATA,13,FALSE))","v":{"$error":"#N/A"}}]
["Install Memory",null,"X",{"$nulls":3},"Install Memory",null,"X"]
["Power ON",null,"X",{"$nulls":3},"Power ON",null,"X"]
["Record BIOS info",null,"X",{"$nulls":3},"Record BIOS info",null,"X"]
["Check Optical Drive",null,{"$f":"IF((VLOOKUP(E844,INVENTORYDATA,7,FALSE))=\"YES\",\"X\",\"\")","v":{"$error":"#N/A"}},{"$f":"IF((VLOOKUP(E844,INVENTORYDATA,7,FALSE))=\"NO\",\"X\",\"\")","v":{"$error":"#N/A"}},null,null,"Check Optical Drive",null,{"$f":"IF((VLOOKUP(K844,INVENTORYDATA,7,FALSE))=\"YES\",\"X\",\"\")","v":{"$error":"#N/A"}},{"$f":"IF((VLOOKUP(K844,INVENTORYDATA,7,FALSE))=\"NO\",\"X\",\"\")","v":{"$error":"#N/A"}}]
["Power Off",null,"X",{"$nulls":3},"Power Off",null,"X"]
["HDD Serial No.",null,{"$f":"IF(ISBLANK(VLOOKUP(E844,INVENTORYDATA,12,FALSE)),\"\",VLOOKUP(E844,INVENTORYDATA,12,FALSE))","v":{"$error":"#N/A"}},{"$nulls":3},"HDD Serial No.",null,{"$f":"IF(ISBLANK(VLOOKUP(K844,INVENTORYDATA,12,FALSE)),\"\",VLOOKUP(K844,INVENTORYDATA,12,FALSE))","v":{"$error":"#N/A"}}]
[]
["Tested for key functions,R2/Ready for Resale",{"$nulls":5},"Tested for key functions,R2/Ready for Resale"]
["BIOS Lock","Caddy","Optical","WebCam","Battery",null,"BIOS Lock","Caddy","Optical","WebCam","Battery"]
[null,null,{"$f":"VLOOKUP(E844,INVENTORY!$A$2:$N$100,7,FALSE)","v":{"$error":"#N/A"}},{"$f":"VLOOKUP(E844,INVENTORY!$A$2:$N$100,8,FALSE)","v":{"$error":"#N/A"}},{"$f":"VLOOKUP(E844,INVENTORY!$A$2:$N$100,9,FALSE)","v":{"$error":"#N/A"}},{"$nulls":3},{"$f":"VLOOKUP(K844,INVENTORY!$A$2:$N$100,7,FALSE)","v":{"$error":"#N/A"}},{"$f":"VLOOKUP(K844,INVENTORY!$A$2:$N$100,8,FALSE)","v":{"$error":"#N/A"}},{"$f":"VLOOKUP(K844,INVENTORY!$A$2:$N$100,9,FALSE)","v":{"$error":"#N/A"}}]
[]
["CPU Cosmetics Defects:",null,{"$f":"\"Function Code: \"&VLOOKUP(E844,INVENTORY!$A$2:$Q$100,14,FALSE)","v":{"$error":"#N/A"}},{"$nulls":3},"CPU Cosmetics Defects:",null,{"$f":"\"Function Code: \"&VLOOKUP(K844,INVENTORY!$A$2:$Q$100,14,FALSE)","v":{"$error":"#N/A"}}]
[]
[null,null,{"$f":"\"Cosmetic Code: \"&VLOOKUP(E844,INVENTORY!$A$2:$Q$100,15,FALSE)","v":{"$error":"#N/A"}},{"$nulls":5},{"$f":"\"Cosmetic Code: \"&VLOOKUP(K844,INVENTORY!$A$2:$Q$100,15,FALSE)","v":{"$error":"#N/A"}}]
[]
["Casing","Plugs/Ports",{"$nulls":4},"Casing","Plugs/Ports"]
["Pass","Pass",{"$nulls":4},"Pass","Pass"]
["Fail","Fail",null,"TRRC#:L.T.R.",null,null,"Fail","Fail",null,"TRRC#:L.T.R."]
[]
["LAPTOP TESTING RECORD",{"$nulls":5},"LAPTOP TESTING RECORD"]
[]
[{"$nulls":3},"ITEM #",{"$f":"E844+2","v":61},{"$nulls":4},"ITEM #",{"$f":"K844+2","v":62}]
["Tester: ","RR","Date:",{"$f":"NOW()","v":"2025-12-15T11:00:59.760"},null,null,"Tester: ","RR","Date:",{"$f":"NOW()","v":"2025-12-15T11:00:59.760"}]
["Type: ","LAPTOP","SN:",{"$f":"VLOOKUP(E873,INVENTORYDATA,10,FALSE)","v":{"$error":"#N/A"}},null,null,"Type: ","LAPTOP","SN:",{"$f":"VLOOKUP(K873,INVENTORYDATA,10,FALSE)","v":{"$error":"#N/A"}}]
[{"$f":"\"Make: \"","v":"Make: "},{"$f":"VLOOKUP(E873,INVENTORYDATA,2,FALSE)","v":{"$error":"#N/A"}},{"$f":"\"Model: \"","v":"Model: "},{"$f":"VLOOKUP(E873,INVENTORYDATA,3,FALSE)","v":{"$error":"#N/A"}},null,null,{"$f":"\"Make: \"","v":"Make: "},{"$f":"VLOOKUP(K873,INVENTORYDATA,2,FALSE)","v":{"$error":"#N/A"}},{"$f":"\"Model: \"","v":"Model: "},{"$f":"VLOOKUP(K873,INVENTORYDATA,3,FALSE)","v":{"$error":"#N/A"}}]
[{"$f":"\"CPU/Speed: \"","v":"CPU/Speed: "},{"$f":"VLOOKUP(E873,INVENTORYDATA,4,FALSE)&\" / \"&VLOOKUP(E873,INVENTORYDATA,5,FALSE)&\"GHz\"","v":{"$error":"#N/A"}},null,{"$f":"\"Memory: \"","v":"Memory: "},{"$f":"VLOOKUP(E873,INVENTORYDATA,6,FALSE)","v":{"$error":"#N/A"}},null,{"$f":"\"CPU/Speed: \"","v":"CPU/Speed: "},{"$f":"VLOOKUP(K873,INVENTORYDATA,4,FALSE)&\" / \"&VLOOKUP(K873,INVENTORYDATA,5,FALSE)&\"GHz\"","v":{"$error":"#N/A"}},null,{"$f":"\"Memory: \"","v":"Memory: "},{"$f":"VLOOKUP(K873,INVENTORYDATA,6,FALSE)","v":{"$error":"#N/A"}}]
[]
["Key Function",null,"Pass","Fail ","Comments",null,"Key Function",null,"Pass","Fail ","Comments"]
["Hard Drive Removed",null,{"$f":"IF(ISBLANK(VLOOKUP(E873,INVENTORYDATA,13,FALSE)),\"X\",\"\")","v":""},null,{"$f":"IF(ISBLANK(VLOOKUP(E873,INVENTORYDATA,13,FALSE)),\"\",VLOOKUP(E873,INVENTORYDATA,13,FALSE))","v":{"$error":"#N/A"}},null,"Hard Drive Removed",null,{"$f":"IF(ISBLANK(VLOOKUP(K873,INVENTORYDATA,13,FALSE)),\"X\",\"\")","v":""},null,{"$f":"IF(ISBLANK(VLOOKUP(K873,INVENTORYDATA,13,FALSE)),\"\",VLOOKUP(K873,INVENTORYDATA,13,FALSE))","v":{"$error":"#N/A"}}]
["Install Memory",null,"X",{"$nulls":3},"Install Memory",null,"X"]
["Power ON",null,"X",{"$nulls":3},"Power ON",null,"X"]
["Record BIOS info",null,"X",{"$nulls":3},"Record BIOS info",null,"X"]
["Check Optical Drive",null,{"$f":"IF((VLOOKUP(E873,INVENTORYDATA,7,FALSE))=\"YES\",\"X\",\"\")","v":{"$error":"#N/A"}},{"$f":"IF((VLOOKUP(E873,INVENTORYDATA,7,FALSE))=\"NO\",\"X\",\"\")","v":{"$error":"#N/A"}},null,null,"Check Optical Drive",null,{"$f":"IF((VLOOKUP(K873,INVENTORYDATA,7,FALSE))=\"YES\",\"X\",\"\")","v":{"$error":"#N/A"}},{"$f":"IF((VLOOKUP(K873,INVENTORYDATA,7,FALSE))=\"NO\",\"X\",\"\")","v":{"$error":"#N/A"}}]
["Power Off",null,"X",{"$nulls":3},"Power Off",null,"X"]
["HDD Serial No.",null,{"$f":"IF(ISBLANK(VLOOKUP(E873,INVENTORYDATA,12,FALSE)),\"\",VLOOKUP(E873,INVENTORYDATA,12,FALSE))","v":{"$error":"#N/A"}},{"$nulls":3},"HDD Serial No.",null,{"$f":"IF(ISBLANK(VLOOKUP(K873,INVENTORYDATA,12,FALSE)),\"\",VLOOKUP(K873,INVENTORYDATA,12,FALSE))","v":{"$error":"#N/A"}}]
[]
["Tested for key functions,R2/Ready for Resale",{"$nulls":5},"Tested for key functions,R2/Ready for Resale"]
["BIOS Lock","Caddy","Optical","WebCam","Battery",null,"BIOS Lock","Caddy","Optical","WebCam","Battery"]
[null,null,{"$f":"VLOOKUP(E873,INVENTORY!$A$2:$N$100,7,FALSE)","v":{"$error":"#N/A"}},{"$f":"VLOOKUP(E873,INVENTORY!$A$2:$N$100,8,FALSE)","v":{"$error":"#N/A"}},{"$f":"VLOOKUP(E873,INVENTORY!$A$2:$N$100,9,FALSE)","v":{"$error":"#N/A"}},{"$nulls":3},{"$f":"VLOOKUP(K873,INVENTORY!$A$2:$N$100,7,FALSE)","v":{"$error":"#N/A"}},{"$f":"VLOOKUP(K873,INVENTORY!$A$2:$N$100,8,FALSE)","v":{"$error":"#N/A"}},{"$f":"VLOOKUP(K873,INVENTORY!$A$2:$N$100,9,FALSE)","v":{"$error":"#N/A"}}]
[]
["CPU Cosmetics Defects:",null,{"$f":"\"Function Code: \"&VLOOKUP(E873,INVENTORY!$A$2:$Q$100,14,FALSE)","v":{"$error":"#N/A"}},{"$nulls":3},"CPU Cosmetics Defects:",null,{"$f":"\"Function Code: \"&VLOOKUP(K873,INVENTORY!$A$2:$Q$100,14,FALSE)","v":{"$error":"#N/A"}}]
[]
[null,null,{"$f":"\"Cosmetic Code: \"&VLOOKUP(E873,INVENTORY!$A$2:$Q$100,15,FALSE)","v":{"$error":"#N/A"}},{"$nulls":5},{"$f":"\"Cosmetic Code: \"&VLOOKUP(K873,INVENTORY!$A$2:$Q$100,15,FALSE)","v":{"$error":"#N/A"}}]
[]
["Casing","Plugs/Ports",{"$nulls":4},"Casing","Plugs/Ports"]
["Pass","Pass",{"$nulls":4},"Pass","Pass"]
["Fail","Fail",null,"TRRC#:L.T.R.",null,null,"Fail","Fail",null,"TRRC#:L.T.R."]
[]
["LAPTOP TESTING RECORD",{"$nulls":5},"LAPTOP TESTING RECORD"]
[]
[{"$nulls":3},"ITEM #",{"$f":"E873+2","v":63},{"$nulls":4},"ITEM #",{"$f":"K873+2","v":64}]
["Tester: ","RR","Date:",{"$f":"NOW()","v":"2025-12-15T11:00:59.760"},null,null,"Tester: ","RR","Date:",{"$f":"NOW()","v":"2025-12-15T11:00:59.760"}]
["Type: ","LAPTOP","SN:",{"$f":"VLOOKUP(E902,INVENTORYDATA,10,FALSE)","v":{"$error":"#N/A"}},null,null,"Type: ","LAPTOP","SN:",{"$f":"VLOOKUP(K902,INVENTORYDATA,10,FALSE)","v":{"$error":"#N/A"}}]
[{"$f":"\"Make: \"","v":"Make: "},{"$f":"VLOOKUP(E902,INVENTORYDATA,2,FALSE)","v":{"$error":"#N/A"}},{"$f":"\"Model: \"","v":"Model: "},{"$f":"VLOOKUP(E902,INVENTORYDATA,3,FALSE)","v":{"$error":"#N/A"}},null,null,{"$f":"\"Make: \"","v":"Make: "},{"$f":"VLOOKUP(K902,INVENTORYDATA,2,FALSE)","v":{"$error":"#N/A"}},{"$f":"\"Model: \"","v":"Model: "},{"$f":"VLOOKUP(K902,INVENTORYDATA,3,FALSE)","v":{"$error":"#N/A"}}]
[{"$f":"\"CPU/Speed: \"","v":"CPU/Speed: "},{"$f":"VLOOKUP(E902,INVENTORYDATA,4,FALSE)&\" / \"&VLOOKUP(E902,INVENTORYDATA,5,FALSE)&\"GHz\"","v":{"$error":"#N/A"}},null,{"$f":"\"Memory: \"","v":"Memory: "},{"$f":"VLOOKUP(E902,INVENTORYDATA,6,FALSE)","v":{"$error":"#N/A"}},null,{"$f":"\"CPU/Speed: \"","v":"CPU/Speed: "},{"$f":"VLOOKUP(K902,INVENTORYDATA,4,FALSE)&\" / \"&VLOOKUP(K902,INVENTORYDATA,5,FALSE)&\"GHz\"","v":{"$error":"#N/A"}},null,{"$f":"\"Memory: \"","v":"Memory: "},{"$f":"VLOOKUP(K902,INVENTORYDATA,6,FALSE)","v":{"$error":"#N/A"}}]
[]
["Key Function",null,"Pass","Fail ","Comments",null,"Key Function",null,"Pass","Fail ","Comments"]
["Hard Drive Removed",null,{"$f":"IF(ISBLANK(VLOOKUP(E902,INVENTORYDATA,13,FALSE)),\"X\",\"\")","v":""},null,{"$f":"IF(ISBLANK(VLOOKUP(E902,INVENTORYDATA,13,FALSE)),\"\",VLOOKUP(E902,INVENTORYDATA,13,FALSE))","v":{"$error":"#N/A"}},null,"Hard Drive Removed",null,{"$f":"IF(ISBLANK(VLOOKUP(K902,INVENTORYDATA,13,FALSE)),\"X\",\"\")","v":""},null,{"$f":"IF(ISBLANK(VLOOKUP(K902,INVENTORYDATA,13,FALSE)),\"\",VLOOKUP(K902,INVENTORYDATA,13,FALSE))","v":{"$error":"#N/A"}}]
["Install Memory",null,"X",{"$nulls":3},"Install Memory",null,"X"]
["Power ON",null,"X",{"$nulls":3},"Power ON",null,"X"]
["Record BIOS info",null,"X",{"$nulls":3},"Record BIOS info",null,"X"]
["Check Optical Drive",null,{"$f":"IF((VLOOKUP(E902,INVENTORYDATA,7,FALSE))=\"YES\",\"X\",\"\")","v":{"$error":"#N/A"}},{"$f":"IF((VLOOKUP(E902,INVENTORYDATA,7,FALSE))=\"NO\",\"X\",\"\")","v":{"$error":"#N/A"}},null,null,"Check Optical Drive",null,{"$f":"IF((VLOOKUP(K902,INVENTORYDATA,7,FALSE))=\"YES\",\"X\",\"\")","v":{"$error":"#N/A"}},{"$f":"IF((VLOOKUP(K902,INVENTORYDATA,7,FALSE))=\"NO\",\"X\",\"\")","v":{"$error":"#N/A"}}]
["Power Off",null,"X",{"$nulls":3},"Power Off",null,"X"]
["HDD Serial No.",null,{"$f":"IF(ISBLANK(VLOOKUP(E902,INVENTORYDATA,12,FALSE)),\"\",VLOOKUP(E902,INVENTORYDATA,12,FALSE))","v":{"$error":"#N/A"}},{"$nulls":3},"HDD Serial No.",null,{"$f":"IF(ISBLANK(VLOOKUP(K902,INVENTORYDATA,12,FALSE)),\"\",VLOOKUP(K902,INVENTORYDATA,12,FALSE))","v":{"$error":"#N/A"}}]
[]
["Tested for key functions,R2/Ready for Resale",{"$nulls":5},"Tested for key functions,R2/Ready for Resale"]
["BIOS Lock","Caddy","Optical","WebCam","Battery",null,"BIOS Lock","Caddy","Optical","WebCam","Battery"]
[null,null,{"$f":"VLOOKUP(E902,INVENTORY!$A$2:$N$100,7,FALSE)","v":{"$error":"#N/A"}},{"$f":"VLOOKUP(E902,INVENTORY!$A$2:$N$100,8,FALSE)","v":{"$error":"#N/A"}},{"$f":"VLOOKUP(E902,INVENTORY!$A$2:$N$100,9,FALSE)","v":{"$error":"#N/A"}},{"$nulls":3},{"$f":"VLOOKUP(K902,INVENTORY!$A$2:$N$100,7,FALSE)","v":{"$error":"#N/A"}},{"$f":"VLOOKUP(K902,INVENTORY!$A$2:$N$100,8,FALSE)","v":{"$error":"#N/A"}},{"$f":"VLOOKUP(K902,INVENTORY!$A$2:$N$100,9,FALSE)","v":{"$error":"#N/A"}}]
[]
["CPU Cosmetics Defects:",null,{"$f":"\"Function Code: \"&VLOOKUP(E902,INVENTORY!$A$2:$Q$100,14,FALSE)","v":{"$error":"#N/A"}},{"$nulls":3},"CPU Cosmetics Defects:",null,{"$f":"\"Function Code: \"&VLOOKUP(K902,INVENTORY!$A$2:$Q$100,14,FALSE)","v":{"$error":"#N/A"}}]
[]
[null,null,{"$f":"\"Cosmetic Code: \"&VLOOKUP(E902,INVENTORY!$A$2:$Q$100,15,FALSE)","v":{"$error":"#N/A"}},{"$nulls":5},{"$f":"\"Cosmetic Code: \"&VLOOKUP(K902,INVENTORY!$A$2:$Q$100,15,FALSE)","v":{"$error":"#N/A"}}]
[]
["Casing","Plugs/Ports",{"$nulls":4},"Casing","Plugs/Ports"]
["Pass","Pass",{"$nulls":4},"Pass","Pass"]
["Fail","Fail",null,"TRRC#:L.T.R.",null,null,"Fail","Fail",null,"TRRC#:L.T.R."]
[]
["LAPTOP TESTING RECORD",{"$nulls":5},"LAPTOP TESTING RECORD"]
[]
[{"$nulls":3},"ITEM #",{"$f":"E902+2","v":65},{"$nulls":4},"ITEM #",{"$f":"K902+2","v":66}]
["Tester: ","RR","Date:",{"$f":"NOW()","v":"2025-12-15T11:00:59.760"},null,null,"Tester: ","RR","Date:",{"$f":"NOW()","v":"2025-12-15T11:00:59.760"}]
["Type: ","LAPTOP","SN:",{"$f":"VLOOKUP(E931,INVENTORYDATA,10,FALSE)","v":{"$error":"#N/A"}},null,null,"Type: ","LAPTOP","SN:",{"$f":"VLOOKUP(K931,INVENTORYDATA,10,FALSE)","v":{"$error":"#N/A"}}]
[{"$f":"\"Make: \"","v":"Make: "},{"$f":"VLOOKUP(E931,INVENTORYDATA,2,FALSE)","v":{"$error":"#N/A"}},{"$f":"\"Model: \"","v":"Model: "},{"$f":"VLOOKUP(E931,INVENTORYDATA,3,FALSE)","v":{"$error":"#N/A"}},null,null,{"$f":"\"Make: \"","v":"Make: "},{"$f":"VLOOKUP(K931,INVENTORYDATA,2,FALSE)","v":{"$error":"#N/A"}},{"$f":"\"Model: \"","v":"Model: "},{"$f":"VLOOKUP(K931,INVENTORYDATA,3,FALSE)","v":{"$error":"#N/A"}}]
[{"$f":"\"CPU/Speed: \"","v":"CPU/Speed: "},{"$f":"VLOOKUP(E931,INVENTORYDATA,4,FALSE)&\" / \"&VLOOKUP(E931,INVENTORYDATA,5,FALSE)&\"GHz\"","v":{"$error":"#N/A"}},null,{"$f":"\"Memory: \"","v":"Memory: "},{"$f":"VLOOKUP(E931,INVENTORYDATA,6,FALSE)","v":{"$error":"#N/A"}},null,{"$f":"\"CPU/Speed: \"","v":"CPU/Speed: "},{"$f":"VLOOKUP(K931,INVENTORYDATA,4,FALSE)&\" / \"&VLOOKUP(K931,INVENTORYDATA,5,FALSE)&\"GHz\"","v":{"$error":"#N/A"}},null,{"$f":"\"Memory: \"","v":"Memory: "},{"$f":"VLOOKUP(K931,INVENTORYDATA,6,FALSE)","v":{"$error":"#N/A"}}]
[]
["Key Function",null,"Pass","Fail ","Comments",null,"Key Function",null,"Pass","Fail ","Comments"]
["Hard Drive Removed",null,{"$f":"IF(ISBLANK(VLOOKUP(E931,INVENTORYDATA,13,FALSE)),\"X\",\"\")","v":""},null,{"$f":"IF(ISBLANK(VLOOKUP(E931,INVENTORYDATA,13,FALSE)),\"\",VLOOKUP(E931,INVENTORYDATA,13,FALSE))","v":{"$error":"#N/A"}},null,"Hard Drive Removed",null,{"$f":"IF(ISBLANK(VLOOKUP(K931,INVENTORYDATA,13,FALSE)),\"X\",\"\")","v":""},null,{"$f":"IF(ISBLANK(VLOOKUP(K931,INVENTORYDATA,13,FALSE)),\"\",VLOOKUP(K931,INVENTORYDATA,13,FALSE))","v":{"$error":"#N/A"}}]
["Install Memory",null,"X",{"$nulls":3},"Install Memory",null,"X"]
["Power ON",null,"X",{"$nulls":3},"Power ON",null,"X"]
["Record BIOS info",null,"X",{"$nulls":3},"Record BIOS info",null,"X"]
["Check Optical Drive",null,{"$f":"IF((VLOOKUP(E931,INVENTORYDATA,7,FALSE))=\"YES\",\"X\",\"\")","v":{"$error":"#N/A"}},{"$f":"IF((VLOOKUP(E931,INVENTORYDATA,7,FALSE))=\"NO\",\"X\",\"\")","v":{"$error":"#N/A"}},null,null,"Check Optical Drive",null,{"$f":"IF((VLOOKUP(K931,INVENTORYDATA,7,FALSE))=\"YES\",\"X\",\"\")","v":{"$error":"#N/A"}},{"$f":"IF((VLOOKUP(K931,INVENTORYDATA,7,FALSE))=\"NO\",\"X\",\"\")","v":{"$error":"#N/A"}}]
["Power Off",null,"X",{"$nulls":3},"Power Off",null,"X"]
["HDD Serial No.",null,{"$f":"IF(ISBLANK(VLOOKUP(E931,INVENTORYDATA,12,FALSE)),\"\",VLOOKUP(E931,INVENTORYDATA,12,FALSE))","v":{"$error":"#N/A"}},{"$nulls":3},"HDD Serial No.",null,{"$f":"IF(ISBLANK(VLOOKUP(K931,INVENTORYDATA,12,FALSE)),\"\",VLOOKUP(K931,INVENTORYDATA,12,FALSE))","v":{"$error":"#N/A"}}]
[]
["Tested for key functions,R2/Ready for Resale",{"$nulls":5},"Tested for key functions,R2/Ready for Resale"]
["BIOS Lock","Caddy","Optical","WebCam","Battery",null,"BIOS Lock","Caddy","Optical","WebCam","Battery"]
[null,null,{"$f":"VLOOKUP(E931,INVENTORY!$A$2:$N$100,7,FALSE)","v":{"$error":"#N/A"}},{"$f":"VLOOKUP(E931,INVENTORY!$A$2:$N$100,8,FALSE)","v":{"$error":"#N/A"}},{"$f":"VLOOKUP(E931,INVENTORY!$A$2:$N$100,9,FALSE)","v":{"$error":"#N/A"}},{"$nulls":3},{"$f":"VLOOKUP(K931,INVENTORY!$A$2:$N$100,7,FALSE)","v":{"$error":"#N/A"}},{"$f":"VLOOKUP(K931,INVENTORY!$A$2:$N$100,8,FALSE)","v":{"$error":"#N/A"}},{"$f":"VLOOKUP(K931,INVENTORY!$A$2:$N$100,9,FALSE)","v":{"$error":"#N/A"}}]
[]
["CPU Cosmetics Defects:",null,{"$f":"\"Function Code: \"&VLOOKUP(E931,INVENTORY!$A$2:$Q$100,14,FALSE)","v":{"$error":"#N/A"}},{"$nulls":3},"CPU Cosmetics Defects:",null,{"$f":"\"Function Code: \"&VLOOKUP(K931,INVENTORY!$A$2:$Q$100,14,FALSE)","v":{"$error":"#N/A"}}]
[]
[null,null,{"$f":"\"Cosmetic Code: \"&VLOOKUP(E931,INVENTORY!$A$2:$Q$100,15,FALSE)","v":{"$error":"#N/A"}},{"$nulls":5},{"$f":"\"Cosmetic Code: \"&VLOOKUP(K931,INVENTORY!$A$2:$Q$100,15,FALSE)","v":{"$error":"#N/A"}}]
[]
["Casing","Plugs/Ports",{"$nulls":4},"Casing","Plugs/Ports"]
["Pass","Pass",{"$nulls":4},"Pass","Pass"]
["Fail","Fail",null,"TRRC#:L.T.R.",null,null,"Fail","Fail",null,"TRRC#:L.T.R."]
[]
["LAPTOP TESTING RECORD",{"$nulls":5},"LAPTOP TESTING RECORD"]
[]
[{"$nulls":3},"ITEM #",{"$f":"E931+2","v":67},{"$nulls":4},"ITEM #",{"$f":"K931+2","v":68}]
["Tester: ","RR","Date:",{"$f":"NOW()","v":"2025-12-15T11:00:59.760"},null,null,"Tester: ","RR","Date:",{"$f":"NOW()","v":"2025-12-15T11:00:59.760"}]
["Type: ","LAPTOP","SN:",{"$f":"VLOOKUP(E960,INVENTORYDATA,10,FALSE)","v":{"$error":"#N/A"}},null,null,"Type: ","LAPTOP","SN:",{"$f":"VLOOKUP(K960,INVENTORYDATA,10,FALSE)","v":{"$error":"#N/A"}}]
[{"$f":"\"Make: \"","v":"Make: "},{"$f":"VLOOKUP(E960,INVENTORYDATA,2,FALSE)","v":{"$error":"#N/A"}},{"$f":"\"Model: \"","v":"Model: "},{"$f":"VLOOKUP(E960,INVENTORYDATA,3,FALSE)","v":{"$error":"#N/A"}},null,null,{"$f":"\"Make: \"","v":"Make: "},{"$f":"VLOOKUP(K960,INVENTORYDATA,2,FALSE)","v":{"$error":"#N/A"}},{"$f":"\"Model: \"","v":"Model: "},{"$f":"VLOOKUP(K960,INVENTORYDATA,3,FALSE)","v":{"$error":"#N/A"}}]
[{"$f":"\"CPU/Speed: \"","v":"CPU/Speed: "},{"$f":"VLOOKUP(E960,INVENTORYDATA,4,FALSE)&\" / \"&VLOOKUP(E960,INVENTORYDATA,5,FALSE)&\"GHz\"","v":{"$error":"#N/A"}},null,{"$f":"\"Memory: \"","v":"Memory: "},{"$f":"VLOOKUP(E960,INVENTORYDATA,6,FALSE)","v":{"$error":"#N/A"}},null,{"$f":"\"CPU/Speed: \"","v":"CPU/Speed: "},{"$f":"VLOOKUP(K960,INVENTORYDATA,4,FALSE)&\" / \"&VLOOKUP(K960,INVENTORYDATA,5,FALSE)&\"GHz\"","v":{"$error":"#N/A"}},null,{"$f":"\"Memory: \"","v":"Memory: "},{"$f":"VLOOKUP(K960,INVENTORYDATA,6,FALSE)","v":{"$error":"#N/A"}}]
[]
["Key Function",null,"Pass","Fail ","Comments",null,"Key Function",null,"Pass","Fail ","Comments"]
["Hard Drive Removed",null,{"$f":"IF(ISBLANK(VLOOKUP(E960,INVENTORYDATA,13,FALSE)),\"X\",\"\")","v":""},null,{"$f":"IF(ISBLANK(VLOOKUP(E960,INVENTORYDATA,13,FALSE)),\"\",VLOOKUP(E960,INVENTORYDATA,13,FALSE))","v":{"$error":"#N/A"}},null,"Hard Drive Removed",null,{"$f":"IF(ISBLANK(VLOOKUP(K960,INVENTORYDATA,13,FALSE)),\"X\",\"\")","v":""},null,{"$f":"IF(ISBLANK(VLOOKUP(K960,INVENTORYDATA,13,FALSE)),\"\",VLOOKUP(K960,INVENTORYDATA,13,FALSE))","v":{"$error":"#N/A"}}]
["Install Memory",null,"X",{"$nulls":3},"Install Memory",null,"X"]
["Power ON",null,"X",{"$nulls":3},"Power ON",null,"X"]
["Record BIOS info",null,"X",{"$nulls":3},"Record BIOS info",null,"X"]
["Check Optical Drive",null,{"$f":"IF((VLOOKUP(E960,INVENTORYDATA,7,FALSE))=\"YES\",\"X\",\"\")","v":{"$error":"#N/A"}},{"$f":"IF((VLOOKUP(E960,INVENTORYDATA,7,FALSE))=\"NO\",\"X\",\"\")","v":{"$error":"#N/A"}},null,null,"Check Optical Drive",null,{"$f":"IF((VLOOKUP(K960,INVENTORYDATA,7,FALSE))=\"YES\",\"X\",\"\")","v":{"$error":"#N/A"}},{"$f":"IF((VLOOKUP(K960,INVENTORYDATA,7,FALSE))=\"NO\",\"X\",\"\")","v":{"$error":"#N/A"}}]
["Power Off",null,"X",{"$nulls":3},"Power Off",null,"X"]
["HDD Serial No.",null,{"$f":"IF(ISBLANK(VLOOKUP(E960,INVENTORYDATA,12,FALSE)),\"\",VLOOKUP(E960,INVENTORYDATA,12,FALSE))","v":{"$error":"#N/A"}},{"$nulls":3},"HDD Serial No.",null,{"$f":"IF(ISBLANK(VLOOKUP(K960,INVENTORYDATA,12,FALSE)),\"\",VLOOKUP(K960,INVENTORYDATA,12,FALSE))","v":{"$error":"#N/A"}}]
[]
["Tested for key functions,R2/Ready for Resale",{"$nulls":5},"Tested for key functions,R2/Ready for Resale"]
["BIOS Lock","Caddy","Optical","WebCam","Battery",null,"BIOS Lock","Caddy","Optical","WebCam","Battery"]
[null,null,{"$f":"VLOOKUP(E960,INVENTORY!$A$2:$N$100,7,FALSE)","v":{"$error":"#N/A"}},{"$f":"VLOOKUP(E960,INVENTORY!$A$2:$N$100,8,FALSE)","v":{"$error":"#N/A"}},{"$f":"VLOOKUP(E960,INVENTORY!$A$2:$N$100,9,FALSE)","v":{"$error":"#N/A"}},{"$nulls":3},{"$f":"VLOOKUP(K960,INVENTORY!$A$2:$N$100,7,FALSE)","v":{"$error":"#N/A"}},{"$f":"VLOOKUP(K960,INVENTORY!$A$2:$N$100,8,FALSE)","v":{"$error":"#N/A"}},{"$f":"VLOOKUP(K960,INVENTORY!$A$2:$N$100,9,FALSE)","v":{"$error":"#N/A"}}]
[]
["CPU Cosmetics Defects:",null,{"$f":"\"Function Code: \"&VLOOKUP(E960,INVENTORY!$A$2:$Q$100,14,FALSE)","v":{"$error":"#N/A"}},{"$nulls":3},"CPU Cosmetics Defects:",null,{"$f":"\"Function Code: \"&VLOOKUP(K960,INVENTORY!$A$2:$Q$100,14,FALSE)","v":{"$error":"#N/A"}}]
[]
[null,null,{"$f":"\"Cosmetic Code: \"&VLOOKUP(E960,INVENTORY!$A$2:$Q$100,15,FALSE)","v":{"$error":"#N/A"}},{"$nulls":5},{"$f":"\"Cosmetic Code: \"&VLOOKUP(K960,INVENTORY!$A$2:$Q$100,15,FALSE)","v":{"$error":"#N/A"}}]
[]
["Casing","Plugs/Ports",{"$nulls":4},"Casing","Plugs/Ports"]
["Pass","Pass",{"$nulls":4},"Pass","Pass"]
["Fail","Fail",null,"TRRC#:L.T.R.",null,null,"Fail","Fail",null,"TRRC#:L.T.R."]
[]
["LAPTOP TESTING RECORD",{"$nulls":5},"LAPTOP TESTING RECORD"]
[]
[{"$nulls":3},"ITEM #",{"$f":"E960+2","v":69},{"$nulls":4},"ITEM #",{"$f":"K960+2","v":70}]
["Tester: ","RR","Date:",{"$f":"NOW()","v":"2025-12-15T11:00:59.760"},null,null,"Tester: ","RR","Date:",{"$f":"NOW()","v":"2025-12-15T11:00:59.760"}]
["Type: ","LAPTOP","SN:",{"$f":"VLOOKUP(E989,INVENTORYDATA,10,FALSE)","v":{"$error":"#N/A"}},null,null,"Type: ","LAPTOP","SN:",{"$f":"VLOOKUP(K989,INVENTORYDATA,10,FALSE)","v":{"$error":"#N/A"}}]
[{"$f":"\"Make: \"","v":"Make: "},{"$f":"VLOOKUP(E989,INVENTORYDATA,2,FALSE)","v":{"$error":"#N/A"}},{"$f":"\"Model: \"","v":"Model: "},{"$f":"VLOOKUP(E989,INVENTORYDATA,3,FALSE)","v":{"$error":"#N/A"}},null,null,{"$f":"\"Make: \"","v":"Make: "},{"$f":"VLOOKUP(K989,INVENTORYDATA,2,FALSE)","v":{"$error":"#N/A"}},{"$f":"\"Model: \"","v":"Model: "},{"$f":"VLOOKUP(K989,INVENTORYDATA,3,FALSE)","v":{"$error":"#N/A"}}]
[{"$f":"\"CPU/Speed: \"","v":"CPU/Speed: "},{"$f":"VLOOKUP(E989,INVENTORYDATA,4,FALSE)&\" / \"&VLOOKUP(E989,INVENTORYDATA,5,FALSE)&\"GHz\"","v":{"$error":"#N/A"}},null,{"$f":"\"Memory: \"","v":"Memory: "},{"$f":"VLOOKUP(E989,INVENTORYDATA,6,FALSE)","v":{"$error":"#N/A"}},null,{"$f":"\"CPU/Speed: \"","v":"CPU/Speed: "},{"$f":"VLOOKUP(K989,INVENTORYDATA,4,FALSE)&\" / \"&VLOOKUP(K989,INVENTORYDATA,5,FALSE)&\"GHz\"","v":{"$error":"#N/A"}},null,{"$f":"\"Memory: \"","v":"Memory: "},{"$f":"VLOOKUP(K989,INVENTORYDATA,6,FALSE)","v":{"$error":"#N/A"}}]
[]
["Key Function",null,"Pass","Fail ","Comments",null,"Key Function",null,"Pass","Fail ","Comments"]
["Hard Drive Removed",null,{"$f":"IF(ISBLANK(VLOOKUP(E989,INVENTORYDATA,13,FALSE)),\"X\",\"\")","v":""},null,{"$f":"IF(ISBLANK(VLOOKUP(E989,INVENTORYDATA,13,FALSE)),\"\",VLOOKUP(E989,INVENTORYDATA,13,FALSE))","v":{"$error":"#N/A"}},null,"Hard Drive Removed",null,{"$f":"IF(ISBLANK(VLOOKUP(K989,INVENTORYDATA,13,FALSE)),\"X\",\"\")","v":""},null,{"$f":"IF(ISBLANK(VLOOKUP(K989,INVENTORYDATA,13,FALSE)),\"\",VLOOKUP(K989,INVENTORYDATA,13,FALSE))","v":{"$error":"#N/A"}}]
["Install Memory",null,"X",{"$nulls":3},"Install Memory",null,"X"]
["Power ON",null,"X",{"$nulls":3},"Power ON",null,"X"]
["Record BIOS info",null,"X",{"$nulls":3},"Record BIOS info",null,"X"]
["Check Optical Drive",null,{"$f":"IF((VLOOKUP(E989,INVENTORYDATA,7,FALSE))=\"YES\",\"X\",\"\")","v":{"$error":"#N/A"}},{"$f":"IF((VLOOKUP(E989,INVENTORYDATA,7,FALSE))=\"NO\",\"X\",\"\")","v":{"$error":"#N/A"}},null,null,"Check Optical Drive",null,{"$f":"IF((VLOOKUP(K989,INVENTORYDATA,7,FALSE))=\"YES\",\"X\",\"\")","v":{"$error":"#N/A"}},{"$f":"IF((VLOOKUP(K989,INVENTORYDATA,7,FALSE))=\"NO\",\"X\",\"\")","v":{"$error":"#N/A"}}]
["Power Off",null,"X",{"$nulls":3},"Power Off",null,"X"]
["HDD Serial No.",null,{"$f":"IF(ISBLANK(VLOOKUP(E989,INVENTORYDATA,12,FALSE)),\"\",VLOOKUP(E989,INVENTORYDATA,12,FALSE))","v":{"$error":"#N/A"}},{"$nulls":3},"HDD Serial No.",null,{"$f":"IF(ISBLANK(VLOOKUP(K989,INVENTORYDATA,12,FALSE)),\"\",VLOOKUP(K989,INVENTORYDATA,12,FALSE))","v":{"$error":"#N/A"}}]
[]
["Tested for key functions,R2/Ready for Resale",{"$nulls":5},"Tested for key functions,R2/Ready for Resale"]
["BIOS Lock","Caddy","Optical","WebCam","Battery",null,"BIOS Lock","Caddy","Optical","WebCam","Battery"]
[null,null,{"$f":"VLOOKUP(E989,INVENTORY!$A$2:$N$100,7,FALSE)","v":{"$error":"#N/A"}},{"$f":"VLOOKUP(E989,INVENTORY!$A$2:$N$100,8,FALSE)","v":{"$error":"#N/A"}},{"$f":"VLOOKUP(E989,INVENTORY!$A$2:$N$100,9,FALSE)","v":{"$error":"#N/A"}},{"$nulls":3},{"$f":"VLOOKUP(K989,INVENTORY!$A$2:$N$100,7,FALSE)","v":{"$error":"#N/A"}},{"$f":"VLOOKUP(K989,INVENTORY!$A$2:$N$100,8,FALSE)","v":{"$error":"#N/A"}},{"$f":"VLOOKUP(K989,INVENTORY!$A$2:$N$100,9,FALSE)","v":{"$error":"#N/A"}}]
[]
["CPU Cosmetics Defects:",null,{"$f":"\"Function Code: \"&VLOOKUP(E989,INVENTORY!$A$2:$Q$100,14,FALSE)","v":{"$error":"#N/A"}},{"$nulls":3},"CPU Cosmetics Defects:",null,{"$f":"\"Function Code: \"&VLOOKUP(K989,INVENTORY!$A$2:$Q$100,14,FALSE)","v":{"$error":"#N/A"}}]
[]
[null,null,{"$f":"\"Cosmetic Code: \"&VLOOKUP(E989,INVENTORY!$A$2:$Q$100,15,FALSE)","v":{"$error":"#N/A"}},{"$nulls":5},{"$f":"\"Cosmetic Code: \"&VLOOKUP(K989,INVENTORY!$A$2:$Q$100,15,FALSE)","v":{"$error":"#N/A"}}]
[]
["Casing","Plugs/Ports",{"$nulls":4},"Casing","Plugs/Ports"]
["Pass","Pass",{"$nulls":4},"Pass","Pass"]
["Fail","Fail",null,"TRRC#:L.T.R.",null,null,"Fail","Fail",null,"TRRC#:L.T.R."]
[]
["LAPTOP TESTING RECORD",{"$nulls":5},"LAPTOP TESTING RECORD"]
[]
[{"$nulls":3},"ITEM #",{"$f":"E989+2","v":71},{"$nulls":4},"ITEM #",{"$f":"K989+2","v":72}]
["Tester: ","RR","Date:",{"$f":"NOW()","v":"2025-12-15T11:00:59.760"},null,null,"Tester: ","RR","Date:",{"$f":"NOW()","v":"2025-12-15T11:00:59.760"}]
["Type: ","LAPTOP","SN:",{"$f":"VLOOKUP(E1018,INVENTORYDATA,10,FALSE)","v":{"$error":"#N/A"}},null,null,"Type: ","LAPTOP","SN:",{"$f":"VLOOKUP(K1018,INVENTORYDATA,10,FALSE)","v":{"$error":"#N/A"}}]
[{"$f":"\"Make: \"","v":"Make: "},{"$f":"VLOOKUP(E1018,INVENTORYDATA,2,FALSE)","v":{"$error":"#N/A"}},{"$f":"\"Model: \"","v":"Model: "},{"$f":"VLOOKUP(E1018,INVENTORYDATA,3,FALSE)","v":{"$error":"#N/A"}},null,null,{"$f":"\"Make: \"","v":"Make: "},{"$f":"VLOOKUP(K1018,INVENTORYDATA,2,FALSE)","v":{"$error":"#N/A"}},{"$f":"\"Model: \"","v":"Model: "},{"$f":"VLOOKUP(K1018,INVENTORYDATA,3,FALSE)","v":{"$error":"#N/A"}}]
[{"$f":"\"CPU/Speed: \"","v":"CPU/Speed: "},{"$f":"VLOOKUP(E1018,INVENTORYDATA,4,FALSE)&\" / \"&VLOOKUP(E1018,INVENTORYDATA,5,FALSE)&\"GHz\"","v":{"$error":"#N/A"}},null,{"$f":"\"Memory: \"","v":"Memory: "},{"$f":"VLOOKUP(E1018,INVENTORYDATA,6,FALSE)","v":{"$error":"#N/A"}},null,{"$f":"\"CPU/Speed: \"","v":"CPU/Speed: "},{"$f":"VLOOKUP(K1018,INVENTORYDATA,4,FALSE)&\" / \"&VLOOKUP(K1018,INVENTORYDATA,5,FALSE)&\"GHz\"","v":{"$error":"#N/A"}},null,{"$f":"\"Memory: \"","v":"Memory: "},{"$f":"VLOOKUP(K1018,INVENTORYDATA,6,FALSE)","v":{"$error":"#N/A"}}]
[]
["Key Function",null,"Pass","Fail ","Comments",null,"Key Function",null,"Pass","Fail ","Comments"]
["Hard Drive Removed",null,{"$f":"IF(ISBLANK(VLOOKUP(E1018,INVENTORYDATA,13,FALSE)),\"X\",\"\")","v":""},null,{"$f":"IF(ISBLANK(VLOOKUP(E1018,INVENTORYDATA,13,FALSE)),\"\",VLOOKUP(E1018,INVENTORYDATA,13,FALSE))","v":{"$error":"#N/A"}},null,"Hard Drive Removed",null,{"$f":"IF(ISBLANK(VLOOKUP(K1018,INVENTORYDATA,13,FALSE)),\"X\",\"\")","v":""},null,{"$f":"IF(ISBLANK(VLOOKUP(K1018,INVENTORYDATA,13,FALSE)),\"\",VLOOKUP(K1018,INVENTORYDATA,13,FALSE))","v":{"$error":"#N/A"}}]
["Install Memory",null,"X",{"$nulls":3},"Install Memory",null,"X"]
["Power ON",null,"X",{"$nulls":3},"Power ON",null,"X"]
["Record BIOS info",null,"X",{"$nulls":3},"Record BIOS info",null,"X"]
["Check Optical Drive",null,{"$f":"IF((VLOOKUP(E1018,INVENTORYDATA,7,FALSE))=\"YES\",\"X\",\"\")","v":{"$error":"#N/A"}},{"$f":"IF((VLOOKUP(E1018,INVENTORYDATA,7,FALSE))=\"NO\",\"X\",\"\")","v":{"$error":"#N/A"}},null,null,"Check Optical Drive",null,{"$f":"IF((VLOOKUP(K1018,INVENTORYDATA,7,FALSE))=\"YES\",\"X\",\"\")","v":{"$error":"#N/A"}},{"$f":"IF((VLOOKUP(K1018,INVENTORYDATA,7,FALSE))=\"NO\",\"X\",\"\")","v":{"$error":"#N/A"}}]
["Power Off",null,"X",{"$nulls":3},"Power Off",null,"X"]
["HDD Serial No.",null,{"$f":"IF(ISBLANK(VLOOKUP(E1018,INVENTORYDATA,12,FALSE)),\"\",VLOOKUP(E1018,INVENTORYDATA,12,FALSE))","v":{"$error":"#N/A"}},{"$nulls":3},"HDD Serial No.",null,{"$f":"IF(ISBLANK(VLOOKUP(K1018,INVENTORYDATA,12,FALSE)),\"\",VLOOKUP(K1018,INVENTORYDATA,12,FALSE))","v":{"$error":"#N/A"}}]
[]
["Tested for key functions,R2/Ready for Resale",{"$nulls":5},"Tested for key functions,R2/Ready for Resale"]
["BIOS Lock","Caddy","Optical","WebCam","Battery",null,"BIOS Lock","Caddy","Optical","WebCam","Battery"]
[null,null,{"$f":"VLOOKUP(E1018,INVENTORY!$A$2:$N$100,7,FALSE)","v":{"$error":"#N/A"}},{"$f":"VLOOKUP(E1018,INVENTORY!$A$2:$N$100,8,FALSE)","v":{"$error":"#N/A"}},{"$f":"VLOOKUP(E1018,INVENTORY!$A$2:$N$100,9,FALSE)","v":{"$error":"#N/A"}},{"$nulls":3},{"$f":"VLOOKUP(K1018,INVENTORY!$A$2:$N$100,7,FALSE)","v":{"$error":"#N/A"}},{"$f":"VLOOKUP(K1018,INVENTORY!$A$2:$N$100,8,FALSE)","v":{"$error":"#N/A"}},{"$f":"VLOOKUP(K1018,INVENTORY!$A$2:$N$100,9,FALSE)","v":{"$error":"#N/A"}}]
[]
["CPU Cosmetics Defects:",null,{"$f":"\"Function Code: \"&VLOOKUP(E1018,INVENTORY!$A$2:$Q$100,14,FALSE)","v":{"$error":"#N/A"}},{"$nulls":3},"CPU Cosmetics Defects:",null,{"$f":"\"Function Code: \"&VLOOKUP(K1018,INVENTORY!$A$2:$Q$100,14,FALSE)","v":{"$error":"#N/A"}}]
[]
[null,null,{"$f":"\"Cosmetic Code: \"&VLOOKUP(E1018,INVENTORY!$A$2:$Q$100,15,FALSE)","v":{"$error":"#N/A"}},{"$nulls":5},{"$f":"\"Cosmetic Code: \"&VLOOKUP(K1018,INVENTORY!$A$2:$Q$100,15,FALSE)","v":{"$error":"#N/A"}}]
[]
["Casing","Plugs/Ports",{"$nulls":4},"Casing","Plugs/Ports"]
["Pass","Pass",{"$nulls":4},"Pass","Pass"]
["Fail","Fail",null,"TRRC#:L.T.R.",null,null,"Fail","Fail",null,"TRRC#:L.T.R."]
[]
["LAPTOP TESTING RECORD",{"$nulls":5},"LAPTOP TESTING RECORD"]
[]
[{"$nulls":3},"ITEM #",{"$f":"E1018+2","v":73},{"$nulls":4},"ITEM #",{"$f":"K1018+2","v":74}]
["Tester: ","RR","Date:",{"$f":"NOW()","v":"2025-12-15T11:00:59.760"},null,null,"Tester: ","RR","Date:",{"$f":"NOW()","v":"2025-12-15T11:00:59.760"}]
["Type: ","LAPTOP","SN:",{"$f":"VLOOKUP(E1047,INVENTORYDATA,10,FALSE)","v":{"$error":"#N/A"}},null,null,"Type: ","LAPTOP","SN:",{"$f":"VLOOKUP(K1047,INVENTORYDATA,10,FALSE)","v":{"$error":"#N/A"}}]
[{"$f":"\"Make: \"","v":"Make: "},{"$f":"VLOOKUP(E1047,INVENTORYDATA,2,FALSE)","v":{"$error":"#N/A"}},{"$f":"\"Model: \"","v":"Model: "},{"$f":"VLOOKUP(E1047,INVENTORYDATA,3,FALSE)","v":{"$error":"#N/A"}},null,null,{"$f":"\"Make: \"","v":"Make: "},{"$f":"VLOOKUP(K1047,INVENTORYDATA,2,FALSE)","v":{"$error":"#N/A"}},{"$f":"\"Model: \"","v":"Model: "},{"$f":"VLOOKUP(K1047,INVENTORYDATA,3,FALSE)","v":{"$error":"#N/A"}}]
[{"$f":"\"CPU/Speed: \"","v":"CPU/Speed: "},{"$f":"VLOOKUP(E1047,INVENTORYDATA,4,FALSE)&\" / \"&VLOOKUP(E1047,INVENTORYDATA,5,FALSE)&\"GHz\"","v":{"$error":"#N/A"}},null,{"$f":"\"Memory: \"","v":"Memory: "},{"$f":"VLOOKUP(E1047,INVENTORYDATA,6,FALSE)","v":{"$error":"#N/A"}},null,{"$f":"\"CPU/Speed: \"","v":"CPU/Speed: "},{"$f":"VLOOKUP(K1047,INVENTORYDATA,4,FALSE)&\" / \"&VLOOKUP(K1047,INVENTORYDATA,5,FALSE)&\"GHz\"","v":{"$error":"#N/A"}},null,{"$f":"\"Memory: \"","v":"Memory: "},{"$f":"VLOOKUP(K1047,INVENTORYDATA,6,FALSE)","v":{"$error":"#N/A"}}]
[]
["Key Function",null,"Pass","Fail ","Comments",null,"Key Function",null,"Pass","Fail ","Comments"]
["Hard Drive Removed",null,{"$f":"IF(ISBLANK(VLOOKUP(E1047,INVENTORYDATA,13,FALSE)),\"X\",\"\")","v":""},null,{"$f":"IF(ISBLANK(VLOOKUP(E1047,INVENTORYDATA,13,FALSE)),\"\",VLOOKUP(E1047,INVENTORYDATA,13,FALSE))","v":{"$error":"#N/A"}},null,"Hard Drive Removed",null,{"$f":"IF(ISBLANK(VLOOKUP(K1047,INVENTORYDATA,13,FALSE)),\"X\",\"\")","v":""},null,{"$f":"IF(ISBLANK(VLOOKUP(K1047,INVENTORYDATA,13,FALSE)),\"\",VLOOKUP(K1047,INVENTORYDATA,13,FALSE))","v":{"$error":"#N/A"}}]
["Install Memory",null,"X",{"$nulls":3},"Install Memory",null,"X"]
["Power ON",null,"X",{"$nulls":3},"Power ON",null,"X"]
["Record BIOS info",null,"X",{"$nulls":3},"Record BIOS info",null,"X"]
["Check Optical Drive",null,{"$f":"IF((VLOOKUP(E1047,INVENTORYDATA,7,FALSE))=\"YES\",\"X\",\"\")","v":{"$error":"#N/A"}},{"$f":"IF((VLOOKUP(E1047,INVENTORYDATA,7,FALSE))=\"NO\",\"X\",\"\")","v":{"$error":"#N/A"}},null,null,"Check Optical Drive",null,{"$f":"IF((VLOOKUP(K1047,INVENTORYDATA,7,FALSE))=\"YES\",\"X\",\"\")","v":{"$error":"#N/A"}},{"$f":"IF((VLOOKUP(K1047,INVENTORYDATA,7,FALSE))=\"NO\",\"X\",\"\")","v":{"$error":"#N/A"}}]
["Power Off",null,"X",{"$nulls":3},"Power Off",null,"X"]
["HDD Serial No.",null,{"$f":"IF(ISBLANK(VLOOKUP(E1047,INVENTORYDATA,12,FALSE)),\"\",VLOOKUP(E1047,INVENTORYDATA,12,FALSE))","v":{"$error":"#N/A"}},{"$nulls":3},"HDD Serial No.",null,{"$f":"IF(ISBLANK(VLOOKUP(K1047,INVENTORYDATA,12,FALSE)),\"\",VLOOKUP(K1047,INVENTORYDATA,12,FALSE))","v":{"$error":"#N/A"}}]
[]
["Tested for key functions,R2/Ready for Resale",{"$nulls":5},"Tested for key functions,R2/Ready for Resale"]
["BIOS Lock","Caddy","Optical","WebCam","Battery",null,"BIOS Lock","Caddy","Optical","WebCam","Battery"]
[null,null,{"$f":"VLOOKUP(E1047,INVENTORY!$A$2:$N$100,7,FALSE)","v":{"$error":"#N/A"}},{"$f":"VLOOKUP(E1047,INVENTORY!$A$2:$N$100,8,FALSE)","v":{"$error":"#N/A"}},{"$f":"VLOOKUP(E1047,INVENTORY!$A$2:$N$100,9,FALSE)","v":{"$error":"#N/A"}},{"$nulls":3},{"$f":"VLOOKUP(K1047,INVENTORY!$A$2:$N$100,7,FALSE)","v":{"$error":"#N/A"}},{"$f":"VLOOKUP(K1047,INVENTORY!$A$2:$N$100,8,FALSE)","v":{"$error":"#N/A"}},{"$f":"VLOOKUP(K1047,INVENTORY!$A$2:$N$100,9,FALSE)","v":{"$error":"#N/A"}}]
[]
["CPU Cosmetics Defects:",null,{"$f":"\"Function Code: \"&VLOOKUP(E1047,INVENTORY!$A$2:$Q$100,14,FALSE)","v":{"$error":"#N/A"}},{"$nulls":3},"CPU Cosmetics Defects:",null,{"$f":"\"Function Code: \"&VLOOKUP(K1047,INVENTORY!$A$2:$Q$100,14,FALSE)","v":{"$error":"#N/A"}}]
[]
[null,null,{"$f":"\"Cosmetic Code: \"&VLOOKUP(E1047,INVENTORY!$A$2:$Q$100,15,FALSE)","v":{"$error":"#N/A"}},{"$nulls":5},{"$f":"\"Cosmetic Code: \"&VLOOKUP(K1047,INVENTORY!$A$2:$Q$100,15,FALSE)","v":{"$error":"#N/A"}}]
[]
["Casing","Plugs/Ports",{"$nulls":4},"Casing","Plugs/Ports"]
["Pass","Pass",{"$nulls":4},"Pass","Pass"]
["Fail","Fail",null,"TRRC#:L.T.R.",null,null,"Fail","Fail",null,"TRRC#:L.T.R."]
[]
["LAPTOP TESTING RECORD",{"$nulls":5},"LAPTOP TESTING RECORD"]
[]
[{"$nulls":3},"ITEM #",{"$f":"E1047+2","v":75},{"$nulls":4},"ITEM #",{"$f":"K1047+2","v":76}]
["Tester: ","RR","Date:",{"$f":"NOW()","v":"2025-12-15T11:00:59.760"},null,null,"Tester: ","RR","Date:",{"$f":"NOW()","v":"2025-12-15T11:00:59.760"}]
["Type: ","LAPTOP","SN:",{"$f":"VLOOKUP(E1076,INVENTORYDATA,10,FALSE)","v":{"$error":"#N/A"}},null,null,"Type: ","LAPTOP","SN:",{"$f":"VLOOKUP(K1076,INVENTORYDATA,10,FALSE)","v":{"$error":"#N/A"}}]
[{"$f":"\"Make: \"","v":"Make: "},{"$f":"VLOOKUP(E1076,INVENTORYDATA,2,FALSE)","v":{"$error":"#N/A"}},{"$f":"\"Model: \"","v":"Model: "},{"$f":"VLOOKUP(E1076,INVENTORYDATA,3,FALSE)","v":{"$error":"#N/A"}},null,null,{"$f":"\"Make: \"","v":"Make: "},{"$f":"VLOOKUP(K1076,INVENTORYDATA,2,FALSE)","v":{"$error":"#N/A"}},{"$f":"\"Model: \"","v":"Model: "},{"$f":"VLOOKUP(K1076,INVENTORYDATA,3,FALSE)","v":{"$error":"#N/A"}}]
[{"$f":"\"CPU/Speed: \"","v":"CPU/Speed: "},{"$f":"VLOOKUP(E1076,INVENTORYDATA,4,FALSE)&\" / \"&VLOOKUP(E1076,INVENTORYDATA,5,FALSE)&\"GHz\"","v":{"$error":"#N/A"}},null,{"$f":"\"Memory: \"","v":"Memory: "},{"$f":"VLOOKUP(E1076,INVENTORYDATA,6,FALSE)","v":{"$error":"#N/A"}},null,{"$f":"\"CPU/Speed: \"","v":"CPU/Speed: "},{"$f":"VLOOKUP(K1076,INVENTORYDATA,4,FALSE)&\" / \"&VLOOKUP(K1076,INVENTORYDATA,5,FALSE)&\"GHz\"","v":{"$error":"#N/A"}},null,{"$f":"\"Memory: \"","v":"Memory: "},{"$f":"VLOOKUP(K1076,INVENTORYDATA,6,FALSE)","v":{"$error":"#N/A"}}]
[]
["Key Function",null,"Pass","Fail ","Comments",null,"Key Function",null,"Pass","Fail ","Comments"]
["Hard Drive Removed",null,{"$f":"IF(ISBLANK(VLOOKUP(E1076,INVENTORYDATA,13,FALSE)),\"X\",\"\")","v":""},null,{"$f":"IF(ISBLANK(VLOOKUP(E1076,INVENTORYDATA,13,FALSE)),\"\",VLOOKUP(E1076,INVENTORYDATA,13,FALSE))","v":{"$error":"#N/A"}},null,"Hard Drive Removed",null,{"$f":"IF(ISBLANK(VLOOKUP(K1076,INVENTORYDATA,13,FALSE)),\"X\",\"\")","v":""},null,{"$f":"IF(ISBLANK(VLOOKUP(K1076,INVENTORYDATA,13,FALSE)),\"\",VLOOKUP(K1076,INVENTORYDATA,13,FALSE))","v":{"$error":"#N/A"}}]
["Install Memory",null,"X",{"$nulls":3},"Install Memory",null,"X"]
["Power ON",null,"X",{"$nulls":3},"Power ON",null,"X"]
["Record BIOS info",null,"X",{"$nulls":3},"Record BIOS info",null,"X"]
["Check Optical Drive",null,{"$f":"IF((VLOOKUP(E1076,INVENTORYDATA,7,FALSE))=\"YES\",\"X\",\"\")","v":{"$error":"#N/A"}},{"$f":"IF((VLOOKUP(E1076,INVENTORYDATA,7,FALSE))=\"NO\",\"X\",\"\")","v":{"$error":"#N/A"}},null,null,"Check Optical Drive",null,{"$f":"IF((VLOOKUP(K1076,INVENTORYDATA,7,FALSE))=\"YES\",\"X\",\"\")","v":{"$error":"#N/A"}},{"$f":"IF((VLOOKUP(K1076,INVENTORYDATA,7,FALSE))=\"NO\",\"X\",\"\")","v":{"$error":"#N/A"}}]
["Power Off",null,"X",{"$nulls":3},"Power Off",null,"X"]
["HDD Serial No.",null,{"$f":"IF(ISBLANK(VLOOKUP(E1076,INVENTORYDATA,12,FALSE)),\"\",VLOOKUP(E1076,INVENTORYDATA,12,FALSE))","v":{"$error":"#N/A"}},{"$nulls":3},"HDD Serial No.",null,{"$f":"IF(ISBLANK(VLOOKUP(K1076,INVENTORYDATA,12,FALSE)),\"\",VLOOKUP(K1076,INVENTORYDATA,12,FALSE))","v":{"$error":"#N/A"}}]
[]
["Tested for key functions,R2/Ready for Resale",{"$nulls":5},"Tested for key functions,R2/Ready for Resale"]
["BIOS Lock","Caddy","Optical","WebCam","Battery",null,"BIOS Lock","Caddy","Optical","WebCam","Battery"]
[null,null,{"$f":"VLOOKUP(E1076,INVENTORY!$A$2:$N$100,7,FALSE)","v":{"$error":"#N/A"}},{"$f":"VLOOKUP(E1076,INVENTORY!$A$2:$N$100,8,FALSE)","v":{"$error":"#N/A"}},{"$f":"VLOOKUP(E1076,INVENTORY!$A$2:$N$100,9,FALSE)","v":{"$error":"#N/A"}},{"$nulls":3},{"$f":"VLOOKUP(K1076,INVENTORY!$A$2:$N$100,7,FALSE)","v":{"$error":"#N/A"}},{"$f":"VLOOKUP(K1076,INVENTORY!$A$2:$N$100,8,FALSE)","v":{"$error":"#N/A"}},{"$f":"VLOOKUP(K1076,INVENTORY!$A$2:$N$100,9,FALSE)","v":{"$error":"#N/A"}}]
[]
["CPU Cosmetics Defects:",null,{"$f":"\"Function Code: \"&VLOOKUP(E1076,INVENTORY!$A$2:$Q$100,14,FALSE)","v":{"$error":"#N/A"}},{"$nulls":3},"CPU Cosmetics Defects:",null,{"$f":"\"Function Code: \"&VLOOKUP(K1076,INVENTORY!$A$2:$Q$100,14,FALSE)","v":{"$error":"#N/A"}}]
[]
[null,null,{"$f":"\"Cosmetic Code: \"&VLOOKUP(E1076,INVENTORY!$A$2:$Q$100,15,FALSE)","v":{"$error":"#N/A"}},{"$nulls":5},{"$f":"\"Cosmetic Code: \"&VLOOKUP(K1076,INVENTORY!$A$2:$Q$100,15,FALSE)","v":{"$error":"#N/A"}}]
[]
["Casing","Plugs/Ports",{"$nulls":4},"Casing","Plugs/Ports"]
["Pass","Pass",{"$nulls":4},"Pass","Pass"]
["Fail","Fail",null,"TRRC#:L.T.R.",null,null,"Fail","Fail",null,"TRRC#:L.T.R."]
[]
["LAPTOP TESTING RECORD",{"$nulls":5},"LAPTOP TESTING RECORD"]
[]
[{"$nulls":3},"ITEM #",{"$f":"E1076+2","v":77},{"$nulls":4},"ITEM #",{"$f":"K1076+2","v":78}]
["Tester: ","RR","Date:",{"$f":"NOW()","v":"2025-12-15T11:00:59.760"},null,null,"Tester: ","RR","Date:",{"$f":"NOW()","v":"2025-12-15T11:00:59.760"}]
["Type: ","LAPTOP","SN:",{"$f":"VLOOKUP(E1105,INVENTORYDATA,10,FALSE)","v":{"$error":"#N/A"}},null,null,"Type: ","LAPTOP","SN:",{"$f":"VLOOKUP(K1105,INVENTORYDATA,10,FALSE)","v":{"$error":"#N/A"}}]
[{"$f":"\"Make: \"","v":"Make: "},{"$f":"VLOOKUP(E1105,INVENTORYDATA,2,FALSE)","v":{"$error":"#N/A"}},{"$f":"\"Model: \"","v":"Model: "},{"$f":"VLOOKUP(E1105,INVENTORYDATA,3,FALSE)","v":{"$error":"#N/A"}},null,null,{"$f":"\"Make: \"","v":"Make: "},{"$f":"VLOOKUP(K1105,INVENTORYDATA,2,FALSE)","v":{"$error":"#N/A"}},{"$f":"\"Model: \"","v":"Model: "},{"$f":"VLOOKUP(K1105,INVENTORYDATA,3,FALSE)","v":{"$error":"#N/A"}}]
[{"$f":"\"CPU/Speed: \"","v":"CPU/Speed: "},{"$f":"VLOOKUP(E1105,INVENTORYDATA,4,FALSE)&\" / \"&VLOOKUP(E1105,INVENTORYDATA,5,FALSE)&\"GHz\"","v":{"$error":"#N/A"}},null,{"$f":"\"Memory: \"","v":"Memory: "},{"$f":"VLOOKUP(E1105,INVENTORYDATA,6,FALSE)","v":{"$error":"#N/A"}},null,{"$f":"\"CPU/Speed: \"","v":"CPU/Speed: "},{"$f":"VLOOKUP(K1105,INVENTORYDATA,4,FALSE)&\" / \"&VLOOKUP(K1105,INVENTORYDATA,5,FALSE)&\"GHz\"","v":{"$error":"#N/A"}},null,{"$f":"\"Memory: \"","v":"Memory: "},{"$f":"VLOOKUP(K1105,INVENTORYDATA,6,FALSE)","v":{"$error":"#N/A"}}]
[]
["Key Function",null,"Pass","Fail ","Comments",null,"Key Function",null,"Pass","Fail ","Comments"]
["Hard Drive Removed",null,{"$f":"IF(ISBLANK(VLOOKUP(E1105,INVENTORYDATA,13,FALSE)),\"X\",\"\")","v":""},null,{"$f":"IF(ISBLANK(VLOOKUP(E1105,INVENTORYDATA,13,FALSE)),\"\",VLOOKUP(E1105,INVENTORYDATA,13,FALSE))","v":{"$error":"#N/A"}},null,"Hard Drive Removed",null,{"$f":"IF(ISBLANK(VLOOKUP(K1105,INVENTORYDATA,13,FALSE)),\"X\",\"\")","v":""},null,{"$f":"IF(ISBLANK(VLOOKUP(K1105,INVENTORYDATA,13,FALSE)),\"\",VLOOKUP(K1105,INVENTORYDATA,13,FALSE))","v":{"$error":"#N/A"}}]
["Install Memory",null,"X",{"$nulls":3},"Install Memory",null,"X"]
["Power ON",null,"X",{"$nulls":3},"Power ON",null,"X"]
["Record BIOS info",null,"X",{"$nulls":3},"Record BIOS info",null,"X"]
["Check Optical Drive",null,{"$f":"IF((VLOOKUP(E1105,INVENTORYDATA,7,FALSE))=\"YES\",\"X\",\"\")","v":{"$error":"#N/A"}},{"$f":"IF((VLOOKUP(E1105,INVENTORYDATA,7,FALSE))=\"NO\",\"X\",\"\")","v":{"$error":"#N/A"}},null,null,"Check Optical Drive",null,{"$f":"IF((VLOOKUP(K1105,INVENTORYDATA,7,FALSE))=\"YES\",\"X\",\"\")","v":{"$error":"#N/A"}},{"$f":"IF((VLOOKUP(K1105,INVENTORYDATA,7,FALSE))=\"NO\",\"X\",\"\")","v":{"$error":"#N/A"}}]
["Power Off",null,"X",{"$nulls":3},"Power Off",null,"X"]
["HDD Serial No.",null,{"$f":"IF(ISBLANK(VLOOKUP(E1105,INVENTORYDATA,12,FALSE)),\"\",VLOOKUP(E1105,INVENTORYDATA,12,FALSE))","v":{"$error":"#N/A"}},{"$nulls":3},"HDD Serial No.",null,{"$f":"IF(ISBLANK(VLOOKUP(K1105,INVENTORYDATA,12,FALSE)),\"\",VLOOKUP(K1105,INVENTORYDATA,12,FALSE))","v":{"$error":"#N/A"}}]
[]
["Tested for key functions,R2/Ready for Resale",{"$nulls":5},"Tested for key functions,R2/Ready for Resale"]
["BIOS Lock","Caddy","Optical","WebCam","Battery",null,"BIOS Lock","Caddy","Optical","WebCam","Battery"]
[null,null,{"$f":"VLOOKUP(E1105,INVENTORY!$A$2:$N$100,7,FALSE)","v":{"$error":"#N/A"}},{"$f":"VLOOKUP(E1105,INVENTORY!$A$2:$N$100,8,FALSE)","v":{"$error":"#N/A"}},{"$f":"VLOOKUP(E1105,INVENTORY!$A$2:$N$100,9,FALSE)","v":{"$error":"#N/A"}},{"$nulls":3},{"$f":"VLOOKUP(K1105,INVENTORY!$A$2:$N$100,7,FALSE)","v":{"$error":"#N/A"}},{"$f":"VLOOKUP(K1105,INVENTORY!$A$2:$N$100,8,FALSE)","v":{"$error":"#N/A"}},{"$f":"VLOOKUP(K1105,INVENTORY!$A$2:$N$100,9,FALSE)","v":{"$error":"#N/A"}}]
[]
["CPU Cosmetics Defects:",null,{"$f":"\"Function Code: \"&VLOOKUP(E1105,INVENTORY!$A$2:$Q$100,14,FALSE)","v":{"$error":"#N/A"}},{"$nulls":3},"CPU Cosmetics Defects:",null,{"$f":"\"Function Code: \"&VLOOKUP(K1105,INVENTORY!$A$2:$Q$100,14,FALSE)","v":{"$error":"#N/A"}}]
[]
[null,null,{"$f":"\"Cosmetic Code: \"&VLOOKUP(E1105,INVENTORY!$A$2:$Q$100,15,FALSE)","v":{"$error":"#N/A"}},{"$nulls":5},{"$f":"\"Cosmetic Code: \"&VLOOKUP(K1105,INVENTORY!$A$2:$Q$100,15,FALSE)","v":{"$error":"#N/A"}}]
[]
["Casing","Plugs/Ports",{"$nulls":4},"Casing","Plugs/Ports"]
["Pass","Pass",{"$nulls":4},"Pass","Pass"]
["Fail","Fail",null,"TRRC#:L.T.R.",null,null,"Fail","Fail",null,"TRRC#:L.T.R."]
[]
["LAPTOP TESTING RECORD",{"$nulls":5},"LAPTOP TESTING RECORD"]
[]
[{"$nulls":3},"ITEM #",{"$f":"E1105+2","v":79},{"$nulls":4},"ITEM #",{"$f":"K1105+2","v":80}]
["Tester: ","RR","Date:",{"$f":"NOW()","v":"2025-12-15T11:00:59.760"},null,null,"Tester: ","RR","Date:",{"$f":"NOW()","v":"2025-12-15T11:00:59.760"}]
["Type: ","LAPTOP","SN:",{"$f":"VLOOKUP(E1134,INVENTORYDATA,10,FALSE)","v":{"$error":"#N/A"}},null,null,"Type: ","LAPTOP","SN:",{"$f":"VLOOKUP(K1134,INVENTORYDATA,10,FALSE)","v":{"$error":"#N/A"}}]
[{"$f":"\"Make: \"","v":"Make: "},{"$f":"VLOOKUP(E1134,INVENTORYDATA,2,FALSE)","v":{"$error":"#N/A"}},{"$f":"\"Model: \"","v":"Model: "},{"$f":"VLOOKUP(E1134,INVENTORYDATA,3,FALSE)","v":{"$error":"#N/A"}},null,null,{"$f":"\"Make: \"","v":"Make: "},{"$f":"VLOOKUP(K1134,INVENTORYDATA,2,FALSE)","v":{"$error":"#N/A"}},{"$f":"\"Model: \"","v":"Model: "},{"$f":"VLOOKUP(K1134,INVENTORYDATA,3,FALSE)","v":{"$error":"#N/A"}}]
[{"$f":"\"CPU/Speed: \"","v":"CPU/Speed: "},{"$f":"VLOOKUP(E1134,INVENTORYDATA,4,FALSE)&\" / \"&VLOOKUP(E1134,INVENTORYDATA,5,FALSE)&\"GHz\"","v":{"$error":"#N/A"}},null,{"$f":"\"Memory: \"","v":"Memory: "},{"$f":"VLOOKUP(E1134,INVENTORYDATA,6,FALSE)","v":{"$error":"#N/A"}},null,{"$f":"\"CPU/Speed: \"","v":"CPU/Speed: "},{"$f":"VLOOKUP(K1134,INVENTORYDATA,4,FALSE)&\" / \"&VLOOKUP(K1134,INVENTORYDATA,5,FALSE)&\"GHz\"","v":{"$error":"#N/A"}},null,{"$f":"\"Memory: \"","v":"Memory: "},{"$f":"VLOOKUP(K1134,INVENTORYDATA,6,FALSE)","v":{"$error":"#N/A"}}]
[]
["Key Function",null,"Pass","Fail ","Comments",null,"Key Function",null,"Pass","Fail ","Comments"]
["Hard Drive Removed",null,{"$f":"IF(ISBLANK(VLOOKUP(E1134,INVENTORYDATA,13,FALSE)),\"X\",\"\")","v":""},null,{"$f":"IF(ISBLANK(VLOOKUP(E1134,INVENTORYDATA,13,FALSE)),\"\",VLOOKUP(E1134,INVENTORYDATA,13,FALSE))","v":{"$error":"#N/A"}},null,"Hard Drive Removed",null,{"$f":"IF(ISBLANK(VLOOKUP(K1134,INVENTORYDATA,13,FALSE)),\"X\",\"\")","v":""},null,{"$f":"IF(ISBLANK(VLOOKUP(K1134,INVENTORYDATA,13,FALSE)),\"\",VLOOKUP(K1134,INVENTORYDATA,13,FALSE))","v":{"$error":"#N/A"}}]
["Install Memory",null,"X",{"$nulls":3},"Install Memory",null,"X"]
["Power ON",null,"X",{"$nulls":3},"Power ON",null,"X"]
["Record BIOS info",null,"X",{"$nulls":3},"Record BIOS info",null,"X"]
["Check Optical Drive",null,{"$f":"IF((VLOOKUP(E1134,INVENTORYDATA,7,FALSE))=\"YES\",\"X\",\"\")","v":{"$error":"#N/A"}},{"$f":"IF((VLOOKUP(E1134,INVENTORYDATA,7,FALSE))=\"NO\",\"X\",\"\")","v":{"$error":"#N/A"}},null,null,"Check Optical Drive",null,{"$f":"IF((VLOOKUP(K1134,INVENTORYDATA,7,FALSE))=\"YES\",\"X\",\"\")","v":{"$error":"#N/A"}},{"$f":"IF((VLOOKUP(K1134,INVENTORYDATA,7,FALSE))=\"NO\",\"X\",\"\")","v":{"$error":"#N/A"}}]
["Power Off",null,"X",{"$nulls":3},"Power Off",null,"X"]
["HDD Serial No.",null,{"$f":"IF(ISBLANK(VLOOKUP(E1134,INVENTORYDATA,12,FALSE)),\"\",VLOOKUP(E1134,INVENTORYDATA,12,FALSE))","v":{"$error":"#N/A"}},{"$nulls":3},"HDD Serial No.",null,{"$f":"IF(ISBLANK(VLOOKUP(K1134,INVENTORYDATA,12,FALSE)),\"\",VLOOKUP(K1134,INVENTORYDATA,12,FALSE))","v":{"$error":"#N/A"}}]
[]
["Tested for key functions,R2/Ready for Resale",{"$nulls":5},"Tested for key functions,R2/Ready for Resale"]
["BIOS Lock","Caddy","Optical","WebCam","Battery",null,"BIOS Lock","Caddy","Optical","WebCam","Battery"]
[null,null,{"$f":"VLOOKUP(E1134,INVENTORY!$A$2:$N$100,7,FALSE)","v":{"$error":"#N/A"}},{"$f":"VLOOKUP(E1134,INVENTORY!$A$2:$N$100,8,FALSE)","v":{"$error":"#N/A"}},{"$f":"VLOOKUP(E1134,INVENTORY!$A$2:$N$100,9,FALSE)","v":{"$error":"#N/A"}},{"$nulls":3},{"$f":"VLOOKUP(K1134,INVENTORY!$A$2:$N$100,7,FALSE)","v":{"$error":"#N/A"}},{"$f":"VLOOKUP(K1134,INVENTORY!$A$2:$N$100,8,FALSE)","v":{"$error":"#N/A"}},{"$f":"VLOOKUP(K1134,INVENTORY!$A$2:$N$100,9,FALSE)","v":{"$error":"#N/A"}}]
[]
["CPU Cosmetics Defects:",null,{"$f":"\"Function Code: \"&VLOOKUP(E1134,INVENTORY!$A$2:$Q$100,14,FALSE)","v":{"$error":"#N/A"}},{"$nulls":3},"CPU Cosmetics Defects:",null,{"$f":"\"Function Code: \"&VLOOKUP(K1134,INVENTORY!$A$2:$Q$100,14,FALSE)","v":{"$error":"#N/A"}}]
[]
[null,null,{"$f":"\"Cosmetic Code: \"&VLOOKUP(E1134,INVENTORY!$A$2:$Q$100,15,FALSE)","v":{"$error":"#N/A"}},{"$nulls":5},{"$f":"\"Cosmetic Code: \"&VLOOKUP(K1134,INVENTORY!$A$2:$Q$100,15,FALSE)","v":{"$error":"#N/A"}}]
[]
["Casing","Plugs/Ports",{"$nulls":4},"Casing","Plugs/Ports"]
["Pass","Pass",{"$nulls":4},"Pass","Pass"]
["Fail","Fail",null,"TRRC#:L.T.R.",null,null,"Fail","Fail",null,"TRRC#:L.T.R."]
[]
["LAPTOP TESTING RECORD",{"$nulls":5},"LAPTOP TESTING RECORD"]
[]
[{"$nulls":3},"ITEM #",{"$f":"E1134+2","v":81},{"$nulls":4},"ITEM #",{"$f":"K1134+2","v":82}]
["Tester: ","RR","Date:",{"$f":"NOW()","v":"2025-12-15T11:00:59.760"},null,null,"Tester: ","RR","Date:",{"$f":"NOW()","v":"2025-12-15T11:00:59.760"}]
["Type: ","LAPTOP","SN:",{"$f":"VLOOKUP(E1163,INVENTORYDATA,10,FALSE)","v":{"$error":"#N/A"}},null,null,"Type: ","LAPTOP","SN:",{"$f":"VLOOKUP(K1163,INVENTORYDATA,10,FALSE)","v":{"$error":"#N/A"}}]
[{"$f":"\"Make: \"","v":"Make: "},{"$f":"VLOOKUP(E1163,INVENTORYDATA,2,FALSE)","v":{"$error":"#N/A"}},{"$f":"\"Model: \"","v":"Model: "},{"$f":"VLOOKUP(E1163,INVENTORYDATA,3,FALSE)","v":{"$error":"#N/A"}},null,null,{"$f":"\"Make: \"","v":"Make: "},{"$f":"VLOOKUP(K1163,INVENTORYDATA,2,FALSE)","v":{"$error":"#N/A"}},{"$f":"\"Model: \"","v":"Model: "},{"$f":"VLOOKUP(K1163,INVENTORYDATA,3,FALSE)","v":{"$error":"#N/A"}}]
[{"$f":"\"CPU/Speed: \"","v":"CPU/Speed: "},{"$f":"VLOOKUP(E1163,INVENTORYDATA,4,FALSE)&\" / \"&VLOOKUP(E1163,INVENTORYDATA,5,FALSE)&\"GHz\"","v":{"$error":"#N/A"}},null,{"$f":"\"Memory: \"","v":"Memory: "},{"$f":"VLOOKUP(E1163,INVENTORYDATA,6,FALSE)","v":{"$error":"#N/A"}},null,{"$f":"\"CPU/Speed: \"","v":"CPU/Speed: "},{"$f":"VLOOKUP(K1163,INVENTORYDATA,4,FALSE)&\" / \"&VLOOKUP(K1163,INVENTORYDATA,5,FALSE)&\"GHz\"","v":{"$error":"#N/A"}},null,{"$f":"\"Memory: \"","v":"Memory: "},{"$f":"VLOOKUP(K1163,INVENTORYDATA,6,FALSE)","v":{"$error":"#N/A"}}]
[]
["Key Function",null,"Pass","Fail ","Comments",null,"Key Function",null,"Pass","Fail ","Comments"]
["Hard Drive Removed",null,{"$f":"IF(ISBLANK(VLOOKUP(E1163,INVENTORYDATA,13,FALSE)),\"X\",\"\")","v":""},null,{"$f":"IF(ISBLANK(VLOOKUP(E1163,INVENTORYDATA,13,FALSE)),\"\",VLOOKUP(E1163,INVENTORYDATA,13,FALSE))","v":{"$error":"#N/A"}},null,"Hard Drive Removed",null,{"$f":"IF(ISBLANK(VLOOKUP(K1163,INVENTORYDATA,13,FALSE)),\"X\",\"\")","v":""},null,{"$f":"IF(ISBLANK(VLOOKUP(K1163,INVENTORYDATA,13,FALSE)),\"\",VLOOKUP(K1163,INVENTORYDATA,13,FALSE))","v":{"$error":"#N/A"}}]
["Install Memory",null,"X",{"$nulls":3},"Install Memory",null,"X"]
["Power ON",null,"X",{"$nulls":3},"Power ON",null,"X"]
["Record BIOS info",null,"X",{"$nulls":3},"Record BIOS info",null,"X"]
["Check Optical Drive",null,{"$f":"IF((VLOOKUP(E1163,INVENTORYDATA,7,FALSE))=\"YES\",\"X\",\"\")","v":{"$error":"#N/A"}},{"$f":"IF((VLOOKUP(E1163,INVENTORYDATA,7,FALSE))=\"NO\",\"X\",\"\")","v":{"$error":"#N/A"}},null,null,"Check Optical Drive",null,{"$f":"IF((VLOOKUP(K1163,INVENTORYDATA,7,FALSE))=\"YES\",\"X\",\"\")","v":{"$error":"#N/A"}},{"$f":"IF((VLOOKUP(K1163,INVENTORYDATA,7,FALSE))=\"NO\",\"X\",\"\")","v":{"$error":"#N/A"}}]
["Power Off",null,"X",{"$nulls":3},"Power Off",null,"X"]
["HDD Serial No.",null,{"$f":"IF(ISBLANK(VLOOKUP(E1163,INVENTORYDATA,12,FALSE)),\"\",VLOOKUP(E1163,INVENTORYDATA,12,FALSE))","v":{"$error":"#N/A"}},{"$nulls":3},"HDD Serial No.",null,{"$f":"IF(ISBLANK(VLOOKUP(K1163,INVENTORYDATA,12,FALSE)),\"\",VLOOKUP(K1163,INVENTORYDATA,12,FALSE))","v":{"$error":"#N/A"}}]
[]
["Tested for key functions,R2/Ready for Resale",{"$nulls":5},"Tested for key functions,R2/Ready for Resale"]
["BIOS Lock","Caddy","Optical","WebCam","Battery",null,"BIOS Lock","Caddy","Optical","WebCam","Battery"]
[null,null,{"$f":"VLOOKUP(E1163,INVENTORY!$A$2:$N$100,7,FALSE)","v":{"$error":"#N/A"}},{"$f":"VLOOKUP(E1163,INVENTORY!$A$2:$N$100,8,FALSE)","v":{"$error":"#N/A"}},{"$f":"VLOOKUP(E1163,INVENTORY!$A$2:$N$100,9,FALSE)","v":{"$error":"#N/A"}},{"$nulls":3},{"$f":"VLOOKUP(K1163,INVENTORY!$A$2:$N$100,7,FALSE)","v":{"$error":"#N/A"}},{"$f":"VLOOKUP(K1163,INVENTORY!$A$2:$N$100,8,FALSE)","v":{"$error":"#N/A"}},{"$f":"VLOOKUP(K1163,INVENTORY!$A$2:$N$100,9,FALSE)","v":{"$error":"#N/A"}}]
[]
["CPU Cosmetics Defects:",null,{"$f":"\"Function Code: \"&VLOOKUP(E1163,INVENTORY!$A$2:$Q$100,14,FALSE)","v":{"$error":"#N/A"}},{"$nulls":3},"CPU Cosmetics Defects:",null,{"$f":"\"Function Code: \"&VLOOKUP(K1163,INVENTORY!$A$2:$Q$100,14,FALSE)","v":{"$error":"#N/A"}}]
[]
[null,null,{"$f":"\"Cosmetic Code: \"&VLOOKUP(E1163,INVENTORY!$A$2:$Q$100,15,FALSE)","v":{"$error":"#N/A"}},{"$nulls":5},{"$f":"\"Cosmetic Code: \"&VLOOKUP(K1163,INVENTORY!$A$2:$Q$100,15,FALSE)","v":{"$error":"#N/A"}}]
[]
["Casing","Plugs/Ports",{"$nulls":4},"Casing","Plugs/Ports"]
["Pass","Pass",{"$nulls":4},"Pass","Pass"]
["Fail","Fail",null,"TRRC#:L.T.R.",null,null,"Fail","Fail",null,"TRRC#:L.T.R."]
[]
["LAPTOP TESTING RECORD",{"$nulls":5},"LAPTOP TESTING RECORD"]
[]
[{"$nulls":3},"ITEM #",{"$f":"E1163+2","v":83},{"$nulls":4},"ITEM #",{"$f":"K1163+2","v":84}]
["Tester: ","RR","Date:",{"$f":"NOW()","v":"2025-12-15T11:00:59.760"},null,null,"Tester: ","RR","Date:",{"$f":"NOW()","v":"2025-12-15T11:00:59.760"}]
["Type: ","LAPTOP","SN:",{"$f":"VLOOKUP(E1192,INVENTORYDATA,10,FALSE)","v":{"$error":"#N/A"}},null,null,"Type: ","LAPTOP","SN:",{"$f":"VLOOKUP(K1192,INVENTORYDATA,10,FALSE)","v":{"$error":"#N/A"}}]
[{"$f":"\"Make: \"","v":"Make: "},{"$f":"VLOOKUP(E1192,INVENTORYDATA,2,FALSE)","v":{"$error":"#N/A"}},{"$f":"\"Model: \"","v":"Model: "},{"$f":"VLOOKUP(E1192,INVENTORYDATA,3,FALSE)","v":{"$error":"#N/A"}},null,null,{"$f":"\"Make: \"","v":"Make: "},{"$f":"VLOOKUP(K1192,INVENTORYDATA,2,FALSE)","v":{"$error":"#N/A"}},{"$f":"\"Model: \"","v":"Model: "},{"$f":"VLOOKUP(K1192,INVENTORYDATA,3,FALSE)","v":{"$error":"#N/A"}}]
[{"$f":"\"CPU/Speed: \"","v":"CPU/Speed: "},{"$f":"VLOOKUP(E1192,INVENTORYDATA,4,FALSE)&\" / \"&VLOOKUP(E1192,INVENTORYDATA,5,FALSE)&\"GHz\"","v":{"$error":"#N/A"}},null,{"$f":"\"Memory: \"","v":"Memory: "},{"$f":"VLOOKUP(E1192,INVENTORYDATA,6,FALSE)","v":{"$error":"#N/A"}},null,{"$f":"\"CPU/Speed: \"","v":"CPU/Speed: "},{"$f":"VLOOKUP(K1192,INVENTORYDATA,4,FALSE)&\" / \"&VLOOKUP(K1192,INVENTORYDATA,5,FALSE)&\"GHz\"","v":{"$error":"#N/A"}},null,{"$f":"\"Memory: \"","v":"Memory: "},{"$f":"VLOOKUP(K1192,INVENTORYDATA,6,FALSE)","v":{"$error":"#N/A"}}]
[]
["Key Function",null,"Pass","Fail ","Comments",null,"Key Function",null,"Pass","Fail ","Comments"]
["Hard Drive Removed",null,{"$f":"IF(ISBLANK(VLOOKUP(E1192,INVENTORYDATA,13,FALSE)),\"X\",\"\")","v":""},null,{"$f":"IF(ISBLANK(VLOOKUP(E1192,INVENTORYDATA,13,FALSE)),\"\",VLOOKUP(E1192,INVENTORYDATA,13,FALSE))","v":{"$error":"#N/A"}},null,"Hard Drive Removed",null,{"$f":"IF(ISBLANK(VLOOKUP(K1192,INVENTORYDATA,13,FALSE)),\"X\",\"\")","v":""},null,{"$f":"IF(ISBLANK(VLOOKUP(K1192,INVENTORYDATA,13,FALSE)),\"\",VLOOKUP(K1192,INVENTORYDATA,13,FALSE))","v":{"$error":"#N/A"}}]
["Install Memory",null,"X",{"$nulls":3},"Install Memory",null,"X"]
["Power ON",null,"X",{"$nulls":3},"Power ON",null,"X"]
["Record BIOS info",null,"X",{"$nulls":3},"Record BIOS info",null,"X"]
["Check Optical Drive",null,{"$f":"IF((VLOOKUP(E1192,INVENTORYDATA,7,FALSE))=\"YES\",\"X\",\"\")","v":{"$error":"#N/A"}},{"$f":"IF((VLOOKUP(E1192,INVENTORYDATA,7,FALSE))=\"NO\",\"X\",\"\")","v":{"$error":"#N/A"}},null,null,"Check Optical Drive",null,{"$f":"IF((VLOOKUP(K1192,INVENTORYDATA,7,FALSE))=\"YES\",\"X\",\"\")","v":{"$error":"#N/A"}},{"$f":"IF((VLOOKUP(K1192,INVENTORYDATA,7,FALSE))=\"NO\",\"X\",\"\")","v":{"$error":"#N/A"}}]
["Power Off",null,"X",{"$nulls":3},"Power Off",null,"X"]
["HDD Serial No.",null,{"$f":"IF(ISBLANK(VLOOKUP(E1192,INVENTORYDATA,12,FALSE)),\"\",VLOOKUP(E1192,INVENTORYDATA,12,FALSE))","v":{"$error":"#N/A"}},{"$nulls":3},"HDD Serial No.",null,{"$f":"IF(ISBLANK(VLOOKUP(K1192,INVENTORYDATA,12,FALSE)),\"\",VLOOKUP(K1192,INVENTORYDATA,12,FALSE))","v":{"$error":"#N/A"}}]
[]
["Tested for key functions,R2/Ready for Resale",{"$nulls":5},"Tested for key functions,R2/Ready for Resale"]
["BIOS Lock","Caddy","Optical","WebCam","Battery",null,"BIOS Lock","Caddy","Optical","WebCam","Battery"]
[null,null,{"$f":"VLOOKUP(E1192,INVENTORY!$A$2:$N$100,7,FALSE)","v":{"$error":"#N/A"}},{"$f":"VLOOKUP(E1192,INVENTORY!$A$2:$N$100,8,FALSE)","v":{"$error":"#N/A"}},{"$f":"VLOOKUP(E1192,INVENTORY!$A$2:$N$100,9,FALSE)","v":{"$error":"#N/A"}},{"$nulls":3},{"$f":"VLOOKUP(K1192,INVENTORY!$A$2:$N$100,7,FALSE)","v":{"$error":"#N/A"}},{"$f":"VLOOKUP(K1192,INVENTORY!$A$2:$N$100,8,FALSE)","v":{"$error":"#N/A"}},{"$f":"VLOOKUP(K1192,INVENTORY!$A$2:$N$100,9,FALSE)","v":{"$error":"#N/A"}}]
[]
["CPU Cosmetics Defects:",null,{"$f":"\"Function Code: \"&VLOOKUP(E1192,INVENTORY!$A$2:$Q$100,14,FALSE)","v":{"$error":"#N/A"}},{"$nulls":3},"CPU Cosmetics Defects:",null,{"$f":"\"Function Code: \"&VLOOKUP(K1192,INVENTORY!$A$2:$Q$100,14,FALSE)","v":{"$error":"#N/A"}}]
[]
[null,null,{"$f":"\"Cosmetic Code: \"&VLOOKUP(E1192,INVENTORY!$A$2:$Q$100,15,FALSE)","v":{"$error":"#N/A"}},{"$nulls":5},{"$f":"\"Cosmetic Code: \"&VLOOKUP(K1192,INVENTORY!$A$2:$Q$100,15,FALSE)","v":{"$error":"#N/A"}}]
[]
["Casing","Plugs/Ports",{"$nulls":4},"Casing","Plugs/Ports"]
["Pass","Pass",{"$nulls":4},"Pass","Pass"]
["Fail","Fail",null,"TRRC#:L.T.R.",null,null,"Fail","Fail",null,"TRRC#:L.T.R."]
[]
["LAPTOP TESTING RECORD",{"$nulls":5},"LAPTOP TESTING RECORD"]
[]
[{"$nulls":3},"ITEM #",{"$f":"E1192+2","v":85},{"$nulls":4},"ITEM #",{"$f":"K1192+2","v":86}]
["Tester: ","RR","Date:",{"$f":"NOW()","v":"2025-12-15T11:00:59.760"},null,null,"Tester: ","RR","Date:",{"$f":"NOW()","v":"2025-12-15T11:00:59.760"}]
["Type: ","LAPTOP","SN:",{"$f":"VLOOKUP(E1221,INVENTORYDATA,10,FALSE)","v":{"$error":"#N/A"}},null,null,"Type: ","LAPTOP","SN:",{"$f":"VLOOKUP(K1221,INVENTORYDATA,10,FALSE)","v":{"$error":"#N/A"}}]
[{"$f":"\"Make: \"","v":"Make: "},{"$f":"VLOOKUP(E1221,INVENTORYDATA,2,FALSE)","v":{"$error":"#N/A"}},{"$f":"\"Model: \"","v":"Model: "},{"$f":"VLOOKUP(E1221,INVENTORYDATA,3,FALSE)","v":{"$error":"#N/A"}},null,null,{"$f":"\"Make: \"","v":"Make: "},{"$f":"VLOOKUP(K1221,INVENTORYDATA,2,FALSE)","v":{"$error":"#N/A"}},{"$f":"\"Model: \"","v":"Model: "},{"$f":"VLOOKUP(K1221,INVENTORYDATA,3,FALSE)","v":{"$error":"#N/A"}}]
[{"$f":"\"CPU/Speed: \"","v":"CPU/Speed: "},{"$f":"VLOOKUP(E1221,INVENTORYDATA,4,FALSE)&\" / \"&VLOOKUP(E1221,INVENTORYDATA,5,FALSE)&\"GHz\"","v":{"$error":"#N/A"}},null,{"$f":"\"Memory: \"","v":"Memory: "},{"$f":"VLOOKUP(E1221,INVENTORYDATA,6,FALSE)","v":{"$error":"#N/A"}},null,{"$f":"\"CPU/Speed: \"","v":"CPU/Speed: "},{"$f":"VLOOKUP(K1221,INVENTORYDATA,4,FALSE)&\" / \"&VLOOKUP(K1221,INVENTORYDATA,5,FALSE)&\"GHz\"","v":{"$error":"#N/A"}},null,{"$f":"\"Memory: \"","v":"Memory: "},{"$f":"VLOOKUP(K1221,INVENTORYDATA,6,FALSE)","v":{"$error":"#N/A"}}]
[]
["Key Function",null,"Pass","Fail ","Comments",null,"Key Function",null,"Pass","Fail ","Comments"]
["Hard Drive Removed",null,{"$f":"IF(ISBLANK(VLOOKUP(E1221,INVENTORYDATA,13,FALSE)),\"X\",\"\")","v":""},null,{"$f":"IF(ISBLANK(VLOOKUP(E1221,INVENTORYDATA,13,FALSE)),\"\",VLOOKUP(E1221,INVENTORYDATA,13,FALSE))","v":{"$error":"#N/A"}},null,"Hard Drive Removed",null,{"$f":"IF(ISBLANK(VLOOKUP(K1221,INVENTORYDATA,13,FALSE)),\"X\",\"\")","v":""},null,{"$f":"IF(ISBLANK(VLOOKUP(K1221,INVENTORYDATA,13,FALSE)),\"\",VLOOKUP(K1221,INVENTORYDATA,13,FALSE))","v":{"$error":"#N/A"}}]
["Install Memory",null,"X",{"$nulls":3},"Install Memory",null,"X"]
["Power ON",null,"X",{"$nulls":3},"Power ON",null,"X"]
["Record BIOS info",null,"X",{"$nulls":3},"Record BIOS info",null,"X"]
["Check Optical Drive",null,{"$f":"IF((VLOOKUP(E1221,INVENTORYDATA,7,FALSE))=\"YES\",\"X\",\"\")","v":{"$error":"#N/A"}},{"$f":"IF((VLOOKUP(E1221,INVENTORYDATA,7,FALSE))=\"NO\",\"X\",\"\")","v":{"$error":"#N/A"}},null,null,"Check Optical Drive",null,{"$f":"IF((VLOOKUP(K1221,INVENTORYDATA,7,FALSE))=\"YES\",\"X\",\"\")","v":{"$error":"#N/A"}},{"$f":"IF((VLOOKUP(K1221,INVENTORYDATA,7,FALSE))=\"NO\",\"X\",\"\")","v":{"$error":"#N/A"}}]
["Power Off",null,"X",{"$nulls":3},"Power Off",null,"X"]
["HDD Serial No.",null,{"$f":"IF(ISBLANK(VLOOKUP(E1221,INVENTORYDATA,12,FALSE)),\"\",VLOOKUP(E1221,INVENTORYDATA,12,FALSE))","v":{"$error":"#N/A"}},{"$nulls":3},"HDD Serial No.",null,{"$f":"IF(ISBLANK(VLOOKUP(K1221,INVENTORYDATA,12,FALSE)),\"\",VLOOKUP(K1221,INVENTORYDATA,12,FALSE))","v":{"$error":"#N/A"}}]
[]
["Tested for key functions,R2/Ready for Resale",{"$nulls":5},"Tested for key functions,R2/Ready for Resale"]
["BIOS Lock","Caddy","Optical","WebCam","Battery",null,"BIOS Lock","Caddy","Optical","WebCam","Battery"]
[null,null,{"$f":"VLOOKUP(E1221,INVENTORY!$A$2:$N$100,7,FALSE)","v":{"$error":"#N/A"}},{"$f":"VLOOKUP(E1221,INVENTORY!$A$2:$N$100,8,FALSE)","v":{"$error":"#N/A"}},{"$f":"VLOOKUP(E1221,INVENTORY!$A$2:$N$100,9,FALSE)","v":{"$error":"#N/A"}},{"$nulls":3},{"$f":"VLOOKUP(K1221,INVENTORY!$A$2:$N$100,7,FALSE)","v":{"$error":"#N/A"}},{"$f":"VLOOKUP(K1221,INVENTORY!$A$2:$N$100,8,FALSE)","v":{"$error":"#N/A"}},{"$f":"VLOOKUP(K1221,INVENTORY!$A$2:$N$100,9,FALSE)","v":{"$error":"#N/A"}}]
[]
["CPU Cosmetics Defects:",null,{"$f":"\"Function Code: \"&VLOOKUP(E1221,INVENTORY!$A$2:$Q$100,14,FALSE)","v":{"$error":"#N/A"}},{"$nulls":3},"CPU Cosmetics Defects:",null,{"$f":"\"Function Code: \"&VLOOKUP(K1221,INVENTORY!$A$2:$Q$100,14,FALSE)","v":{"$error":"#N/A"}}]
[]
[null,null,{"$f":"\"Cosmetic Code: \"&VLOOKUP(E1221,INVENTORY!$A$2:$Q$100,15,FALSE)","v":{"$error":"#N/A"}},{"$nulls":5},{"$f":"\"Cosmetic Code: \"&VLOOKUP(K1221,INVENTORY!$A$2:$Q$100,15,FALSE)","v":{"$error":"#N/A"}}]
[]
["Casing","Plugs/Ports",{"$nulls":4},"Casing","Plugs/Ports"]
["Pass","Pass",{"$nulls":4},"Pass","Pass"]
["Fail","Fail",null,"TRRC#:L.T.R.",null,null,"Fail","Fail",null,"TRRC#:L.T.R."]
[]
["LAPTOP TESTING RECORD",{"$nulls":5},"LAPTOP TESTING RECORD"]
[]
[{"$nulls":3},"ITEM #",{"$f":"E1221+2","v":87},{"$nulls":4},"ITEM #",{"$f":"K1221+2","v":88}]
["Tester: ","RR","Date:",{"$f":"NOW()","v":"2025-12-15T11:00:59.760"},null,null,"Tester: ","RR","Date:",{"$f":"NOW()","v":"2025-12-15T11:00:59.760"}]
["Type: ","LAPTOP","SN:",{"$f":"VLOOKUP(E1250,INVENTORYDATA,10,FALSE)","v":{"$error":"#N/A"}},null,null,"Type: ","LAPTOP","SN:",{"$f":"VLOOKUP(K1250,INVENTORYDATA,10,FALSE)","v":{"$error":"#N/A"}}]
[{"$f":"\"Make: \"","v":"Make: "},{"$f":"VLOOKUP(E1250,INVENTORYDATA,2,FALSE)","v":{"$error":"#N/A"}},{"$f":"\"Model: \"","v":"Model: "},{"$f":"VLOOKUP(E1250,INVENTORYDATA,3,FALSE)","v":{"$error":"#N/A"}},null,null,{"$f":"\"Make: \"","v":"Make: "},{"$f":"VLOOKUP(K1250,INVENTORYDATA,2,FALSE)","v":{"$error":"#N/A"}},{"$f":"\"Model: \"","v":"Model: "},{"$f":"VLOOKUP(K1250,INVENTORYDATA,3,FALSE)","v":{"$error":"#N/A"}}]
[{"$f":"\"CPU/Speed: \"","v":"CPU/Speed: "},{"$f":"VLOOKUP(E1250,INVENTORYDATA,4,FALSE)&\" / \"&VLOOKUP(E1250,INVENTORYDATA,5,FALSE)&\"GHz\"","v":{"$error":"#N/A"}},null,{"$f":"\"Memory: \"","v":"Memory: "},{"$f":"VLOOKUP(E1250,INVENTORYDATA,6,FALSE)","v":{"$error":"#N/A"}},null,{"$f":"\"CPU/Speed: \"","v":"CPU/Speed: "},{"$f":"VLOOKUP(K1250,INVENTORYDATA,4,FALSE)&\" / \"&VLOOKUP(K1250,INVENTORYDATA,5,FALSE)&\"GHz\"","v":{"$error":"#N/A"}},null,{"$f":"\"Memory: \"","v":"Memory: "},{"$f":"VLOOKUP(K1250,INVENTORYDATA,6,FALSE)","v":{"$error":"#N/A"}}]
[]
["Key Function",null,"Pass","Fail ","Comments",null,"Key Function",null,"Pass","Fail ","Comments"]
["Hard Drive Removed",null,{"$f":"IF(ISBLANK(VLOOKUP(E1250,INVENTORYDATA,13,FALSE)),\"X\",\"\")","v":""},null,{"$f":"IF(ISBLANK(VLOOKUP(E1250,INVENTORYDATA,13,FALSE)),\"\",VLOOKUP(E1250,INVENTORYDATA,13,FALSE))","v":{"$error":"#N/A"}},null,"Hard Drive Removed",null,{"$f":"IF(ISBLANK(VLOOKUP(K1250,INVENTORYDATA,13,FALSE)),\"X\",\"\")","v":""},null,{"$f":"IF(ISBLANK(VLOOKUP(K1250,INVENTORYDATA,13,FALSE)),\"\",VLOOKUP(K1250,INVENTORYDATA,13,FALSE))","v":{"$error":"#N/A"}}]
["Install Memory",null,"X",{"$nulls":3},"Install Memory",null,"X"]
["Power ON",null,"X",{"$nulls":3},"Power ON",null,"X"]
["Record BIOS info",null,"X",{"$nulls":3},"Record BIOS info",null,"X"]
["Check Optical Drive",null,{"$f":"IF((VLOOKUP(E1250,INVENTORYDATA,7,FALSE))=\"YES\",\"X\",\"\")","v":{"$error":"#N/A"}},{"$f":"IF((VLOOKUP(E1250,INVENTORYDATA,7,FALSE))=\"NO\",\"X\",\"\")","v":{"$error":"#N/A"}},null,null,"Check Optical Drive",null,{"$f":"IF((VLOOKUP(K1250,INVENTORYDATA,7,FALSE))=\"YES\",\"X\",\"\")","v":{"$error":"#N/A"}},{"$f":"IF((VLOOKUP(K1250,INVENTORYDATA,7,FALSE))=\"NO\",\"X\",\"\")","v":{"$error":"#N/A"}}]
["Power Off",null,"X",{"$nulls":3},"Power Off",null,"X"]
["HDD Serial No.",null,{"$f":"IF(ISBLANK(VLOOKUP(E1250,INVENTORYDATA,12,FALSE)),\"\",VLOOKUP(E1250,INVENTORYDATA,12,FALSE))","v":{"$error":"#N/A"}},{"$nulls":3},"HDD Serial No.",null,{"$f":"IF(ISBLANK(VLOOKUP(K1250,INVENTORYDATA,12,FALSE)),\"\",VLOOKUP(K1250,INVENTORYDATA,12,FALSE))","v":{"$error":"#N/A"}}]
[]
["Tested for key functions,R2/Ready for Resale",{"$nulls":5},"Tested for key functions,R2/Ready for Resale"]
["BIOS Lock","Caddy","Optical","WebCam","Battery",null,"BIOS Lock","Caddy","Optical","WebCam","Battery"]
[null,null,{"$f":"VLOOKUP(E1250,INVENTORY!$A$2:$N$100,7,FALSE)","v":{"$error":"#N/A"}},{"$f":"VLOOKUP(E1250,INVENTORY!$A$2:$N$100,8,FALSE)","v":{"$error":"#N/A"}},{"$f":"VLOOKUP(E1250,INVENTORY!$A$2:$N$100,9,FALSE)","v":{"$error":"#N/A"}},{"$nulls":3},{"$f":"VLOOKUP(K1250,INVENTORY!$A$2:$N$100,7,FALSE)","v":{"$error":"#N/A"}},{"$f":"VLOOKUP(K1250,INVENTORY!$A$2:$N$100,8,FALSE)","v":{"$error":"#N/A"}},{"$f":"VLOOKUP(K1250,INVENTORY!$A$2:$N$100,9,FALSE)","v":{"$error":"#N/A"}}]
[]
["CPU Cosmetics Defects:",null,{"$f":"\"Function Code: \"&VLOOKUP(E1250,INVENTORY!$A$2:$Q$100,14,FALSE)","v":{"$error":"#N/A"}},{"$nulls":3},"CPU Cosmetics Defects:",null,{"$f":"\"Function Code: \"&VLOOKUP(K1250,INVENTORY!$A$2:$Q$100,14,FALSE)","v":{"$error":"#N/A"}}]
[]
[null,null,{"$f":"\"Cosmetic Code: \"&VLOOKUP(E1250,INVENTORY!$A$2:$Q$100,15,FALSE)","v":{"$error":"#N/A"}},{"$nulls":5},{"$f":"\"Cosmetic Code: \"&VLOOKUP(K1250,INVENTORY!$A$2:$Q$100,15,FALSE)","v":{"$error":"#N/A"}}]
[]
["Casing","Plugs/Ports",{"$nulls":4},"Casing","Plugs/Ports"]
["Pass","Pass",{"$nulls":4},"Pass","Pass"]
["Fail","Fail",null,"TRRC#:L.T.R.",null,null,"Fail","Fail",null,"TRRC#:L.T.R."]
[]
["LAPTOP TESTING RECORD",{"$nulls":5},"LAPTOP TESTING RECORD"]
[]
[{"$nulls":3},"ITEM #",{"$f":"E1250+2","v":89},{"$nulls":4},"ITEM #",{"$f":"K1250+2","v":90}]
["Tester: ","RR","Date:",{"$f":"NOW()","v":"2025-12-15T11:00:59.760"},null,null,"Tester: ","RR","Date:",{"$f":"NOW()","v":"2025-12-15T11:00:59.760"}]
["Type: ","LAPTOP","SN:",{"$f":"VLOOKUP(E1279,INVENTORYDATA,10,FALSE)","v":{"$error":"#N/A"}},null,null,"Type: ","LAPTOP","SN:",{"$f":"VLOOKUP(K1279,INVENTORYDATA,10,FALSE)","v":{"$error":"#N/A"}}]
[{"$f":"\"Make: \"","v":"Make: "},{"$f":"VLOOKUP(E1279,INVENTORYDATA,2,FALSE)","v":{"$error":"#N/A"}},{"$f":"\"Model: \"","v":"Model: "},{"$f":"VLOOKUP(E1279,INVENTORYDATA,3,FALSE)","v":{"$error":"#N/A"}},null,null,{"$f":"\"Make: \"","v":"Make: "},{"$f":"VLOOKUP(K1279,INVENTORYDATA,2,FALSE)","v":{"$error":"#N/A"}},{"$f":"\"Model: \"","v":"Model: "},{"$f":"VLOOKUP(K1279,INVENTORYDATA,3,FALSE)","v":{"$error":"#N/A"}}]
[{"$f":"\"CPU/Speed: \"","v":"CPU/Speed: "},{"$f":"VLOOKUP(E1279,INVENTORYDATA,4,FALSE)&\" / \"&VLOOKUP(E1279,INVENTORYDATA,5,FALSE)&\"GHz\"","v":{"$error":"#N/A"}},null,{"$f":"\"Memory: \"","v":"Memory: "},{"$f":"VLOOKUP(E1279,INVENTORYDATA,6,FALSE)","v":{"$error":"#N/A"}},null,{"$f":"\"CPU/Speed: \"","v":"CPU/Speed: "},{"$f":"VLOOKUP(K1279,INVENTORYDATA,4,FALSE)&\" / \"&VLOOKUP(K1279,INVENTORYDATA,5,FALSE)&\"GHz\"","v":{"$error":"#N/A"}},null,{"$f":"\"Memory: \"","v":"Memory: "},{"$f":"VLOOKUP(K1279,INVENTORYDATA,6,FALSE)","v":{"$error":"#N/A"}}]
[]
["Key Function",null,"Pass","Fail ","Comments",null,"Key Function",null,"Pass","Fail ","Comments"]
["Hard Drive Removed",null,{"$f":"IF(ISBLANK(VLOOKUP(E1279,INVENTORYDATA,13,FALSE)),\"X\",\"\")","v":""},null,{"$f":"IF(ISBLANK(VLOOKUP(E1279,INVENTORYDATA,13,FALSE)),\"\",VLOOKUP(E1279,INVENTORYDATA,13,FALSE))","v":{"$error":"#N/A"}},null,"Hard Drive Removed",null,{"$f":"IF(ISBLANK(VLOOKUP(K1279,INVENTORYDATA,13,FALSE)),\"X\",\"\")","v":""},null,{"$f":"IF(ISBLANK(VLOOKUP(K1279,INVENTORYDATA,13,FALSE)),\"\",VLOOKUP(K1279,INVENTORYDATA,13,FALSE))","v":{"$error":"#N/A"}}]
["Install Memory",null,"X",{"$nulls":3},"Install Memory",null,"X"]
["Power ON",null,"X",{"$nulls":3},"Power ON",null,"X"]
["Record BIOS info",null,"X",{"$nulls":3},"Record BIOS info",null,"X"]
["Check Optical Drive",null,{"$f":"IF((VLOOKUP(E1279,INVENTORYDATA,7,FALSE))=\"YES\",\"X\",\"\")","v":{"$error":"#N/A"}},{"$f":"IF((VLOOKUP(E1279,INVENTORYDATA,7,FALSE))=\"NO\",\"X\",\"\")","v":{"$error":"#N/A"}},null,null,"Check Optical Drive",null,{"$f":"IF((VLOOKUP(K1279,INVENTORYDATA,7,FALSE))=\"YES\",\"X\",\"\")","v":{"$error":"#N/A"}},{"$f":"IF((VLOOKUP(K1279,INVENTORYDATA,7,FALSE))=\"NO\",\"X\",\"\")","v":{"$error":"#N/A"}}]
["Power Off",null,"X",{"$nulls":3},"Power Off",null,"X"]
["HDD Serial No.",null,{"$f":"IF(ISBLANK(VLOOKUP(E1279,INVENTORYDATA,12,FALSE)),\"\",VLOOKUP(E1279,INVENTORYDATA,12,FALSE))","v":{"$error":"#N/A"}},{"$nulls":3},"HDD Serial No.",null,{"$f":"IF(ISBLANK(VLOOKUP(K1279,INVENTORYDATA,12,FALSE)),\"\",VLOOKUP(K1279,INVENTORYDATA,12,FALSE))","v":{"$error":"#N/A"}}]
[]
["Tested for key functions,R2/Ready for Resale",{"$nulls":5},"Tested for key functions,R2/Ready for Resale"]
["BIOS Lock","Caddy","Optical","WebCam","Battery",null,"BIOS Lock","Caddy","Optical","WebCam","Battery"]
[null,null,{"$f":"VLOOKUP(E1279,INVENTORY!$A$2:$N$100,7,FALSE)","v":{"$error":"#N/A"}},{"$f":"VLOOKUP(E1279,INVENTORY!$A$2:$N$100,8,FALSE)","v":{"$error":"#N/A"}},{"$f":"VLOOKUP(E1279,INVENTORY!$A$2:$N$100,9,FALSE)","v":{"$error":"#N/A"}},{"$nulls":3},{"$f":"VLOOKUP(K1279,INVENTORY!$A$2:$N$100,7,FALSE)","v":{"$error":"#N/A"}},{"$f":"VLOOKUP(K1279,INVENTORY!$A$2:$N$100,8,FALSE)","v":{"$error":"#N/A"}},{"$f":"VLOOKUP(K1279,INVENTORY!$A$2:$N$100,9,FALSE)","v":{"$error":"#N/A"}}]
[]
["CPU Cosmetics Defects:",null,{"$f":"\"Function Code: \"&VLOOKUP(E1279,INVENTORY!$A$2:$Q$100,14,FALSE)","v":{"$error":"#N/A"}},{"$nulls":3},"CPU Cosmetics Defects:",null,{"$f":"\"Function Code: \"&VLOOKUP(K1279,INVENTORY!$A$2:$Q$100,14,FALSE)","v":{"$error":"#N/A"}}]
[]
[null,null,{"$f":"\"Cosmetic Code: \"&VLOOKUP(E1279,INVENTORY!$A$2:$Q$100,15,FALSE)","v":{"$error":"#N/A"}},{"$nulls":5},{"$f":"\"Cosmetic Code: \"&VLOOKUP(K1279,INVENTORY!$A$2:$Q$100,15,FALSE)","v":{"$error":"#N/A"}}]
[]
["Casing","Plugs/Ports",{"$nulls":4},"Casing","Plugs/Ports"]
["Pass","Pass",{"$nulls":4},"Pass","Pass"]
["Fail","Fail",null,"TRRC#:L.T.R.",null,null,"Fail","Fail",null,"TRRC#:L.T.R."]
[]
["LAPTOP TESTING RECORD",{"$nulls":5},"LAPTOP TESTING RECORD"]
[]
[{"$nulls":3},"ITEM #",{"$f":"E1279+2","v":91},{"$nulls":4},"ITEM #",{"$f":"K1279+2","v":92}]
["Tester: ","RR","Date:",{"$f":"NOW()","v":"2025-12-15T11:00:59.760"},null,null,"Tester: ","RR","Date:",{"$f":"NOW()","v":"2025-12-15T11:00:59.760"}]
["Type: ","LAPTOP","SN:",{"$f":"VLOOKUP(E1308,INVENTORYDATA,10,FALSE)","v":{"$error":"#N/A"}},null,null,"Type: ","LAPTOP","SN:",{"$f":"VLOOKUP(K1308,INVENTORYDATA,10,FALSE)","v":{"$error":"#N/A"}}]
[{"$f":"\"Make: \"","v":"Make: "},{"$f":"VLOOKUP(E1308,INVENTORYDATA,2,FALSE)","v":{"$error":"#N/A"}},{"$f":"\"Model: \"","v":"Model: "},{"$f":"VLOOKUP(E1308,INVENTORYDATA,3,FALSE)","v":{"$error":"#N/A"}},null,null,{"$f":"\"Make: \"","v":"Make: "},{"$f":"VLOOKUP(K1308,INVENTORYDATA,2,FALSE)","v":{"$error":"#N/A"}},{"$f":"\"Model: \"","v":"Model: "},{"$f":"VLOOKUP(K1308,INVENTORYDATA,3,FALSE)","v":{"$error":"#N/A"}}]
[{"$f":"\"CPU/Speed: \"","v":"CPU/Speed: "},{"$f":"VLOOKUP(E1308,INVENTORYDATA,4,FALSE)&\" / \"&VLOOKUP(E1308,INVENTORYDATA,5,FALSE)&\"GHz\"","v":{"$error":"#N/A"}},null,{"$f":"\"Memory: \"","v":"Memory: "},{"$f":"VLOOKUP(E1308,INVENTORYDATA,6,FALSE)","v":{"$error":"#N/A"}},null,{"$f":"\"CPU/Speed: \"","v":"CPU/Speed: "},{"$f":"VLOOKUP(K1308,INVENTORYDATA,4,FALSE)&\" / \"&VLOOKUP(K1308,INVENTORYDATA,5,FALSE)&\"GHz\"","v":{"$error":"#N/A"}},null,{"$f":"\"Memory: \"","v":"Memory: "},{"$f":"VLOOKUP(K1308,INVENTORYDATA,6,FALSE)","v":{"$error":"#N/A"}}]
[]
["Key Function",null,"Pass","Fail ","Comments",null,"Key Function",null,"Pass","Fail ","Comments"]
["Hard Drive Removed",null,{"$f":"IF(ISBLANK(VLOOKUP(E1308,INVENTORYDATA,13,FALSE)),\"X\",\"\")","v":""},null,{"$f":"IF(ISBLANK(VLOOKUP(E1308,INVENTORYDATA,13,FALSE)),\"\",VLOOKUP(E1308,INVENTORYDATA,13,FALSE))","v":{"$error":"#N/A"}},null,"Hard Drive Removed",null,{"$f":"IF(ISBLANK(VLOOKUP(K1308,INVENTORYDATA,13,FALSE)),\"X\",\"\")","v":""},null,{"$f":"IF(ISBLANK(VLOOKUP(K1308,INVENTORYDATA,13,FALSE)),\"\",VLOOKUP(K1308,INVENTORYDATA,13,FALSE))","v":{"$error":"#N/A"}}]
["Install Memory",null,"X",{"$nulls":3},"Install Memory",null,"X"]
["Power ON",null,"X",{"$nulls":3},"Power ON",null,"X"]
["Record BIOS info",null,"X",{"$nulls":3},"Record BIOS info",null,"X"]
["Check Optical Drive",null,{"$f":"IF((VLOOKUP(E1308,INVENTORYDATA,7,FALSE))=\"YES\",\"X\",\"\")","v":{"$error":"#N/A"}},{"$f":"IF((VLOOKUP(E1308,INVENTORYDATA,7,FALSE))=\"NO\",\"X\",\"\")","v":{"$error":"#N/A"}},null,null,"Check Optical Drive",null,{"$f":"IF((VLOOKUP(K1308,INVENTORYDATA,7,FALSE))=\"YES\",\"X\",\"\")","v":{"$error":"#N/A"}},{"$f":"IF((VLOOKUP(K1308,INVENTORYDATA,7,FALSE))=\"NO\",\"X\",\"\")","v":{"$error":"#N/A"}}]
["Power Off",null,"X",{"$nulls":3},"Power Off",null,"X"]
["HDD Serial No.",null,{"$f":"IF(ISBLANK(VLOOKUP(E1308,INVENTORYDATA,12,FALSE)),\"\",VLOOKUP(E1308,INVENTORYDATA,12,FALSE))","v":{"$error":"#N/A"}},{"$nulls":3},"HDD Serial No.",null,{"$f":"IF(ISBLANK(VLOOKUP(K1308,INVENTORYDATA,12,FALSE)),\"\",VLOOKUP(K1308,INVENTORYDATA,12,FALSE))","v":{"$error":"#N/A"}}]
[]
["Tested for key functions,R2/Ready for Resale",{"$nulls":5},"Tested for key functions,R2/Ready for Resale"]
["BIOS Lock","Caddy","Optical","WebCam","Battery",null,"BIOS Lock","Caddy","Optical","WebCam","Battery"]
[null,null,{"$f":"VLOOKUP(E1308,INVENTORY!$A$2:$N$100,7,FALSE)","v":{"$error":"#N/A"}},{"$f":"VLOOKUP(E1308,INVENTORY!$A$2:$N$100,8,FALSE)","v":{"$error":"#N/A"}},{"$f":"VLOOKUP(E1308,INVENTORY!$A$2:$N$100,9,FALSE)","v":{"$error":"#N/A"}},{"$nulls":3},{"$f":"VLOOKUP(K1308,INVENTORY!$A$2:$N$100,7,FALSE)","v":{"$error":"#N/A"}},{"$f":"VLOOKUP(K1308,INVENTORY!$A$2:$N$100,8,FALSE)","v":{"$error":"#N/A"}},{"$f":"VLOOKUP(K1308,INVENTORY!$A$2:$N$100,9,FALSE)","v":{"$error":"#N/A"}}]
[]
["CPU Cosmetics Defects:",null,{"$f":"\"Function Code: \"&VLOOKUP(E1308,INVENTORY!$A$2:$Q$100,14,FALSE)","v":{"$error":"#N/A"}},{"$nulls":3},"CPU Cosmetics Defects:",null,{"$f":"\"Function Code: \"&VLOOKUP(K1308,INVENTORY!$A$2:$Q$100,14,FALSE)","v":{"$error":"#N/A"}}]
[]
[null,null,{"$f":"\"Cosmetic Code: \"&VLOOKUP(E1308,INVENTORY!$A$2:$Q$100,15,FALSE)","v":{"$error":"#N/A"}},{"$nulls":5},{"$f":"\"Cosmetic Code: \"&VLOOKUP(K1308,INVENTORY!$A$2:$Q$100,15,FALSE)","v":{"$error":"#N/A"}}]
[]
["Casing","Plugs/Ports",{"$nulls":4},"Casing","Plugs/Ports"]
["Pass","Pass",{"$nulls":4},"Pass","Pass"]
["Fail","Fail",null,"TRRC#:L.T.R.",null,null,"Fail","Fail",null,"TRRC#:L.T.R."]
[]
["LAPTOP TESTING RECORD",{"$nulls":5},"LAPTOP TESTING RECORD"]
[]
[{"$nulls":3},"ITEM #",{"$f":"E1308+2","v":93},{"$nulls":4},"ITEM #",{"$f":"K1308+2","v":94}]
["Tester: ","RR","Date:",{"$f":"NOW()","v":"2025-12-15T11:00:59.760"},null,null,"Tester: ","RR","Date:",{"$f":"NOW()","v":"2025-12-15T11:00:59.760"}]
["Type: ","LAPTOP","SN:",{"$f":"VLOOKUP(E1337,INVENTORYDATA,10,FALSE)","v":{"$error":"#N/A"}},null,null,"Type: ","LAPTOP","SN:",{"$f":"VLOOKUP(K1337,INVENTORYDATA,10,FALSE)","v":{"$error":"#N/A"}}]
[{"$f":"\"Make: \"","v":"Make: "},{"$f":"VLOOKUP(E1337,INVENTORYDATA,2,FALSE)","v":{"$error":"#N/A"}},{"$f":"\"Model: \"","v":"Model: "},{"$f":"VLOOKUP(E1337,INVENTORYDATA,3,FALSE)","v":{"$error":"#N/A"}},null,null,{"$f":"\"Make: \"","v":"Make: "},{"$f":"VLOOKUP(K1337,INVENTORYDATA,2,FALSE)","v":{"$error":"#N/A"}},{"$f":"\"Model: \"","v":"Model: "},{"$f":"VLOOKUP(K1337,INVENTORYDATA,3,FALSE)","v":{"$error":"#N/A"}}]
[{"$f":"\"CPU/Speed: \"","v":"CPU/Speed: "},{"$f":"VLOOKUP(E1337,INVENTORYDATA,4,FALSE)&\" / \"&VLOOKUP(E1337,INVENTORYDATA,5,FALSE)&\"GHz\"","v":{"$error":"#N/A"}},null,{"$f":"\"Memory: \"","v":"Memory: "},{"$f":"VLOOKUP(E1337,INVENTORYDATA,6,FALSE)","v":{"$error":"#N/A"}},null,{"$f":"\"CPU/Speed: \"","v":"CPU/Speed: "},{"$f":"VLOOKUP(K1337,INVENTORYDATA,4,FALSE)&\" / \"&VLOOKUP(K1337,INVENTORYDATA,5,FALSE)&\"GHz\"","v":{"$error":"#N/A"}},null,{"$f":"\"Memory: \"","v":"Memory: "},{"$f":"VLOOKUP(K1337,INVENTORYDATA,6,FALSE)","v":{"$error":"#N/A"}}]
[]
["Key Function",null,"Pass","Fail ","Comments",null,"Key Function",null,"Pass","Fail ","Comments"]
["Hard Drive Removed",null,{"$f":"IF(ISBLANK(VLOOKUP(E1337,INVENTORYDATA,13,FALSE)),\"X\",\"\")","v":""},null,{"$f":"IF(ISBLANK(VLOOKUP(E1337,INVENTORYDATA,13,FALSE)),\"\",VLOOKUP(E1337,INVENTORYDATA,13,FALSE))","v":{"$error":"#N/A"}},null,"Hard Drive Removed",null,{"$f":"IF(ISBLANK(VLOOKUP(K1337,INVENTORYDATA,13,FALSE)),\"X\",\"\")","v":""},null,{"$f":"IF(ISBLANK(VLOOKUP(K1337,INVENTORYDATA,13,FALSE)),\"\",VLOOKUP(K1337,INVENTORYDATA,13,FALSE))","v":{"$error":"#N/A"}}]
["Install Memory",null,"X",{"$nulls":3},"Install Memory",null,"X"]
["Power ON",null,"X",{"$nulls":3},"Power ON",null,"X"]
["Record BIOS info",null,"X",{"$nulls":3},"Record BIOS info",null,"X"]
["Check Optical Drive",null,{"$f":"IF((VLOOKUP(E1337,INVENTORYDATA,7,FALSE))=\"YES\",\"X\",\"\")","v":{"$error":"#N/A"}},{"$f":"IF((VLOOKUP(E1337,INVENTORYDATA,7,FALSE))=\"NO\",\"X\",\"\")","v":{"$error":"#N/A"}},null,null,"Check Optical Drive",null,{"$f":"IF((VLOOKUP(K1337,INVENTORYDATA,7,FALSE))=\"YES\",\"X\",\"\")","v":{"$error":"#N/A"}},{"$f":"IF((VLOOKUP(K1337,INVENTORYDATA,7,FALSE))=\"NO\",\"X\",\"\")","v":{"$error":"#N/A"}}]
["Power Off",null,"X",{"$nulls":3},"Power Off",null,"X"]
["HDD Serial No.",null,{"$f":"IF(ISBLANK(VLOOKUP(E1337,INVENTORYDATA,12,FALSE)),\"\",VLOOKUP(E1337,INVENTORYDATA,12,FALSE))","v":{"$error":"#N/A"}},{"$nulls":3},"HDD Serial No.",null,{"$f":"IF(ISBLANK(VLOOKUP(K1337,INVENTORYDATA,12,FALSE)),\"\",VLOOKUP(K1337,INVENTORYDATA,12,FALSE))","v":{"$error":"#N/A"}}]
[]
["Tested for key functions,R2/Ready for Resale",{"$nulls":5},"Tested for key functions,R2/Ready for Resale"]
["BIOS Lock","Caddy","Optical","WebCam","Battery",null,"BIOS Lock","Caddy","Optical","WebCam","Battery"]
[null,null,{"$f":"VLOOKUP(E1337,INVENTORY!$A$2:$N$100,7,FALSE)","v":{"$error":"#N/A"}},{"$f":"VLOOKUP(E1337,INVENTORY!$A$2:$N$100,8,FALSE)","v":{"$error":"#N/A"}},{"$f":"VLOOKUP(E1337,INVENTORY!$A$2:$N$100,9,FALSE)","v":{"$error":"#N/A"}},{"$nulls":3},{"$f":"VLOOKUP(K1337,INVENTORY!$A$2:$N$100,7,FALSE)","v":{"$error":"#N/A"}},{"$f":"VLOOKUP(K1337,INVENTORY!$A$2:$N$100,8,FALSE)","v":{"$error":"#N/A"}},{"$f":"VLOOKUP(K1337,INVENTORY!$A$2:$N$100,9,FALSE)","v":{"$error":"#N/A"}}]
[]
["CPU Cosmetics Defects:",null,{"$f":"\"Function Code: \"&VLOOKUP(E1337,INVENTORY!$A$2:$Q$100,14,FALSE)","v":{"$error":"#N/A"}},{"$nulls":3},"CPU Cosmetics Defects:",null,{"$f":"\"Function Code: \"&VLOOKUP(K1337,INVENTORY!$A$2:$Q$100,14,FALSE)","v":{"$error":"#N/A"}}]
[]
[null,null,{"$f":"\"Cosmetic Code: \"&VLOOKUP(E1337,INVENTORY!$A$2:$Q$100,15,FALSE)","v":{"$error":"#N/A"}},{"$nulls":5},{"$f":"\"Cosmetic Code: \"&VLOOKUP(K1337,INVENTORY!$A$2:$Q$100,15,FALSE)","v":{"$error":"#N/A"}}]
[]
["Casing","Plugs/Ports",{"$nulls":4},"Casing","Plugs/Ports"]
["Pass","Pass",{"$nulls":4},"Pass","Pass"]
["Fail","Fail",null,"TRRC#:L.T.R.",null,null,"Fail","Fail",null,"TRRC#:L.T.R."]
[]
["LAPTOP TESTING RECORD",{"$nulls":5},"LAPTOP TESTING RECORD"]
[]
[{"$nulls":3},"ITEM #",{"$f":"E1337+2","v":95},{"$nulls":4},"ITEM #",{"$f":"K1337+2","v":96}]
["Tester: ","RR","Date:",{"$f":"NOW()","v":"2025-12-15T11:00:59.760"},null,null,"Tester: ","RR","Date:",{"$f":"NOW()","v":"2025-12-15T11:00:59.760"}]
["Type: ","LAPTOP","SN:",{"$f":"VLOOKUP(E1366,INVENTORYDATA,10,FALSE)","v":{"$error":"#N/A"}},null,null,"Type: ","LAPTOP","SN:",{"$f":"VLOOKUP(K1366,INVENTORYDATA,10,FALSE)","v":{"$error":"#N/A"}}]
[{"$f":"\"Make: \"","v":"Make: "},{"$f":"VLOOKUP(E1366,INVENTORYDATA,2,FALSE)","v":{"$error":"#N/A"}},{"$f":"\"Model: \"","v":"Model: "},{"$f":"VLOOKUP(E1366,INVENTORYDATA,3,FALSE)","v":{"$error":"#N/A"}},null,null,{"$f":"\"Make: \"","v":"Make: "},{"$f":"VLOOKUP(K1366,INVENTORYDATA,2,FALSE)","v":{"$error":"#N/A"}},{"$f":"\"Model: \"","v":"Model: "},{"$f":"VLOOKUP(K1366,INVENTORYDATA,3,FALSE)","v":{"$error":"#N/A"}}]
[{"$f":"\"CPU/Speed: \"","v":"CPU/Speed: "},{"$f":"VLOOKUP(E1366,INVENTORYDATA,4,FALSE)&\" / \"&VLOOKUP(E1366,INVENTORYDATA,5,FALSE)&\"GHz\"","v":{"$error":"#N/A"}},null,{"$f":"\"Memory: \"","v":"Memory: "},{"$f":"VLOOKUP(E1366,INVENTORYDATA,6,FALSE)","v":{"$error":"#N/A"}},null,{"$f":"\"CPU/Speed: \"","v":"CPU/Speed: "},{"$f":"VLOOKUP(K1366,INVENTORYDATA,4,FALSE)&\" / \"&VLOOKUP(K1366,INVENTORYDATA,5,FALSE)&\"GHz\"","v":{"$error":"#N/A"}},null,{"$f":"\"Memory: \"","v":"Memory: "},{"$f":"VLOOKUP(K1366,INVENTORYDATA,6,FALSE)","v":{"$error":"#N/A"}}]
[]
["Key Function",null,"Pass","Fail ","Comments",null,"Key Function",null,"Pass","Fail ","Comments"]
["Hard Drive Removed",null,{"$f":"IF(ISBLANK(VLOOKUP(E1366,INVENTORYDATA,13,FALSE)),\"X\",\"\")","v":""},null,{"$f":"IF(ISBLANK(VLOOKUP(E1366,INVENTORYDATA,13,FALSE)),\"\",VLOOKUP(E1366,INVENTORYDATA,13,FALSE))","v":{"$error":"#N/A"}},null,"Hard Drive Removed",null,{"$f":"IF(ISBLANK(VLOOKUP(K1366,INVENTORYDATA,13,FALSE)),\"X\",\"\")","v":""},null,{"$f":"IF(ISBLANK(VLOOKUP(K1366,INVENTORYDATA,13,FALSE)),\"\",VLOOKUP(K1366,INVENTORYDATA,13,FALSE))","v":{"$error":"#N/A"}}]
["Install Memory",null,"X",{"$nulls":3},"Install Memory",null,"X"]
["Power ON",null,"X",{"$nulls":3},"Power ON",null,"X"]
["Record BIOS info",null,"X",{"$nulls":3},"Record BIOS info",null,"X"]
["Check Optical Drive",null,{"$f":"IF((VLOOKUP(E1366,INVENTORYDATA,7,FALSE))=\"YES\",\"X\",\"\")","v":{"$error":"#N/A"}},{"$f":"IF((VLOOKUP(E1366,INVENTORYDATA,7,FALSE))=\"NO\",\"X\",\"\")","v":{"$error":"#N/A"}},null,null,"Check Optical Drive",null,{"$f":"IF((VLOOKUP(K1366,INVENTORYDATA,7,FALSE))=\"YES\",\"X\",\"\")","v":{"$error":"#N/A"}},{"$f":"IF((VLOOKUP(K1366,INVENTORYDATA,7,FALSE))=\"NO\",\"X\",\"\")","v":{"$error":"#N/A"}}]
["Power Off",null,"X",{"$nulls":3},"Power Off",null,"X"]
["HDD Serial No.",null,{"$f":"IF(ISBLANK(VLOOKUP(E1366,INVENTORYDATA,12,FALSE)),\"\",VLOOKUP(E1366,INVENTORYDATA,12,FALSE))","v":{"$error":"#N/A"}},{"$nulls":3},"HDD Serial No.",null,{"$f":"IF(ISBLANK(VLOOKUP(K1366,INVENTORYDATA,12,FALSE)),\"\",VLOOKUP(K1366,INVENTORYDATA,12,FALSE))","v":{"$error":"#N/A"}}]
[]
["Tested for key functions,R2/Ready for Resale",{"$nulls":5},"Tested for key functions,R2/Ready for Resale"]
["BIOS Lock","Caddy","Optical","WebCam","Battery",null,"BIOS Lock","Caddy","Optical","WebCam","Battery"]
[null,null,{"$f":"VLOOKUP(E1366,INVENTORY!$A$2:$N$100,7,FALSE)","v":{"$error":"#N/A"}},{"$f":"VLOOKUP(E1366,INVENTORY!$A$2:$N$100,8,FALSE)","v":{"$error":"#N/A"}},{"$f":"VLOOKUP(E1366,INVENTORY!$A$2:$N$100,9,FALSE)","v":{"$error":"#N/A"}},{"$nulls":3},{"$f":"VLOOKUP(K1366,INVENTORY!$A$2:$N$100,7,FALSE)","v":{"$error":"#N/A"}},{"$f":"VLOOKUP(K1366,INVENTORY!$A$2:$N$100,8,FALSE)","v":{"$error":"#N/A"}},{"$f":"VLOOKUP(K1366,INVENTORY!$A$2:$N$100,9,FALSE)","v":{"$error":"#N/A"}}]
[]
["CPU Cosmetics Defects:",null,{"$f":"\"Function Code: \"&VLOOKUP(E1366,INVENTORY!$A$2:$Q$100,14,FALSE)","v":{"$error":"#N/A"}},{"$nulls":3},"CPU Cosmetics Defects:",null,{"$f":"\"Function Code: \"&VLOOKUP(K1366,INVENTORY!$A$2:$Q$100,14,FALSE)","v":{"$error":"#N/A"}}]
[]
[null,null,{"$f":"\"Cosmetic Code: \"&VLOOKUP(E1366,INVENTORY!$A$2:$Q$100,15,FALSE)","v":{"$error":"#N/A"}},{"$nulls":5},{"$f":"\"Cosmetic Code: \"&VLOOKUP(K1366,INVENTORY!$A$2:$Q$100,15,FALSE)","v":{"$error":"#N/A"}}]
[]
["Casing","Plugs/Ports",{"$nulls":4},"Casing","Plugs/Ports"]
["Pass","Pass",{"$nulls":4},"Pass","Pass"]
["Fail","Fail",null,"TRRC#:L.T.R.",null,null,"Fail","Fail",null,"TRRC#:L.T.R."]
[]
["LAPTOP TESTING RECORD",{"$nulls":5},"LAPTOP TESTING RECORD"]
[]
[{"$nulls":3},"ITEM #",{"$f":"E1366+2","v":97},{"$nulls":4},"ITEM #",{"$f":"K1366+2","v":98}]
["Tester: ","RR","Date:",{"$f":"NOW()","v":"2025-12-15T11:00:59.760"},null,null,"Tester: ","RR","Date:",{"$f":"NOW()","v":"2025-12-15T11:00:59.760"}]
["Type: ","LAPTOP","SN:",{"$f":"VLOOKUP(E1395,INVENTORYDATA,10,FALSE)","v":{"$error":"#N/A"}},null,null,"Type: ","LAPTOP","SN:",{"$f":"VLOOKUP(K1395,INVENTORYDATA,10,FALSE)","v":{"$error":"#N/A"}}]
[{"$f":"\"Make: \"","v":"Make: "},{"$f":"VLOOKUP(E1395,INVENTORYDATA,2,FALSE)","v":{"$error":"#N/A"}},{"$f":"\"Model: \"","v":"Model: "},{"$f":"VLOOKUP(E1395,INVENTORYDATA,3,FALSE)","v":{"$error":"#N/A"}},null,null,{"$f":"\"Make: \"","v":"Make: "},{"$f":"VLOOKUP(K1395,INVENTORYDATA,2,FALSE)","v":{"$error":"#N/A"}},{"$f":"\"Model: \"","v":"Model: "},{"$f":"VLOOKUP(K1395,INVENTORYDATA,3,FALSE)","v":{"$error":"#N/A"}}]
[{"$f":"\"CPU/Speed: \"","v":"CPU/Speed: "},{"$f":"VLOOKUP(E1395,INVENTORYDATA,4,FALSE)&\" / \"&VLOOKUP(E1395,INVENTORYDATA,5,FALSE)&\"GHz\"","v":{"$error":"#N/A"}},null,{"$f":"\"Memory: \"","v":"Memory: "},{"$f":"VLOOKUP(E1395,INVENTORYDATA,6,FALSE)","v":{"$error":"#N/A"}},null,{"$f":"\"CPU/Speed: \"","v":"CPU/Speed: "},{"$f":"VLOOKUP(K1395,INVENTORYDATA,4,FALSE)&\" / \"&VLOOKUP(K1395,INVENTORYDATA,5,FALSE)&\"GHz\"","v":{"$error":"#N/A"}},null,{"$f":"\"Memory: \"","v":"Memory: "},{"$f":"VLOOKUP(K1395,INVENTORYDATA,6,FALSE)","v":{"$error":"#N/A"}}]
[]
["Key Function",null,"Pass","Fail ","Comments",null,"Key Function",null,"Pass","Fail ","Comments"]
["Hard Drive Removed",null,{"$f":"IF(ISBLANK(VLOOKUP(E1395,INVENTORYDATA,13,FALSE)),\"X\",\"\")","v":""},null,{"$f":"IF(ISBLANK(VLOOKUP(E1395,INVENTORYDATA,13,FALSE)),\"\",VLOOKUP(E1395,INVENTORYDATA,13,FALSE))","v":{"$error":"#N/A"}},null,"Hard Drive Removed",null,{"$f":"IF(ISBLANK(VLOOKUP(K1395,INVENTORYDATA,13,FALSE)),\"X\",\"\")","v":""},null,{"$f":"IF(ISBLANK(VLOOKUP(K1395,INVENTORYDATA,13,FALSE)),\"\",VLOOKUP(K1395,INVENTORYDATA,13,FALSE))","v":{"$error":"#N/A"}}]
["Install Memory",null,"X",{"$nulls":3},"Install Memory",null,"X"]
["Power ON",null,"X",{"$nulls":3},"Power ON",null,"X"]
["Record BIOS info",null,"X",{"$nulls":3},"Record BIOS info",null,"X"]
["Check Optical Drive",null,{"$f":"IF((VLOOKUP(E1395,INVENTORYDATA,7,FALSE))=\"YES\",\"X\",\"\")","v":{"$error":"#N/A"}},{"$f":"IF((VLOOKUP(E1395,INVENTORYDATA,7,FALSE))=\"NO\",\"X\",\"\")","v":{"$error":"#N/A"}},null,null,"Check Optical Drive",null,{"$f":"IF((VLOOKUP(K1395,INVENTORYDATA,7,FALSE))=\"YES\",\"X\",\"\")","v":{"$error":"#N/A"}},{"$f":"IF((VLOOKUP(K1395,INVENTORYDATA,7,FALSE))=\"NO\",\"X\",\"\")","v":{"$error":"#N/A"}}]
["Power Off",null,"X",{"$nulls":3},"Power Off",null,"X"]
["HDD Serial No.",null,{"$f":"IF(ISBLANK(VLOOKUP(E1395,INVENTORYDATA,12,FALSE)),\"\",VLOOKUP(E1395,INVENTORYDATA,12,FALSE))","v":{"$error":"#N/A"}},{"$nulls":3},"HDD Serial No.",null,{"$f":"IF(ISBLANK(VLOOKUP(K1395,INVENTORYDATA,12,FALSE)),\"\",VLOOKUP(K1395,INVENTORYDATA,12,FALSE))","v":{"$error":"#N/A"}}]
[]
["Tested for key functions,R2/Ready for Resale",{"$nulls":5},"Tested for key functions,R2/Ready for Resale"]
["BIOS Lock","Caddy","Optical","WebCam","Battery",null,"BIOS Lock","Caddy","Optical","WebCam","Battery"]
[null,null,{"$f":"VLOOKUP(E1395,INVENTORY!$A$2:$N$100,7,FALSE)","v":{"$error":"#N/A"}},{"$f":"VLOOKUP(E1395,INVENTORY!$A$2:$N$100,8,FALSE)","v":{"$error":"#N/A"}},{"$f":"VLOOKUP(E1395,INVENTORY!$A$2:$N$100,9,FALSE)","v":{"$error":"#N/A"}},{"$nulls":3},{"$f":"VLOOKUP(K1395,INVENTORY!$A$2:$N$100,7,FALSE)","v":{"$error":"#N/A"}},{"$f":"VLOOKUP(K1395,INVENTORY!$A$2:$N$100,8,FALSE)","v":{"$error":"#N/A"}},{"$f":"VLOOKUP(K1395,INVENTORY!$A$2:$N$100,9,FALSE)","v":{"$error":"#N/A"}}]
[]
["CPU Cosmetics Defects:",null,{"$f":"\"Function Code: \"&VLOOKUP(E1395,INVENTORY!$A$2:$Q$100,14,FALSE)","v":{"$error":"#N/A"}},{"$nulls":3},"CPU Cosmetics Defects:",null,{"$f":"\"Function Code: \"&VLOOKUP(K1395,INVENTORY!$A$2:$Q$100,14,FALSE)","v":{"$error":"#N/A"}}]
[]
[null,null,{"$f":"\"Cosmetic Code: \"&VLOOKUP(E1395,INVENTORY!$A$2:$Q$100,15,FALSE)","v":{"$error":"#N/A"}},{"$nulls":5},{"$f":"\"Cosmetic Code: \"&VLOOKUP(K1395,INVENTORY!$A$2:$Q$100,15,FALSE)","v":{"$error":"#N/A"}}]
[]
["Casing","Plugs/Ports",{"$nulls":4},"Casing","Plugs/Ports"]
["Pass","Pass",{"$nulls":4},"Pass","Pass"]
["Fail","Fail",null,"TRRC#:L.T.R.",null,null,"Fail","Fail",null,"TRRC#:L.T.R."]
[]
["LAPTOP TESTING RECORD",{"$nulls":5},"LAPTOP TESTING RECORD"]
[]
[{"$nulls":3},"ITEM #",{"$f":"E1395+2","v":99},{"$nulls":4},"ITEM #",{"$f":"K1395+2","v":100}]
["Tester: ","RR","Date:",{"$f":"NOW()","v":"2025-12-15T11:00:59.760"},null,null,"Tester: ","RR","Date:",{"$f":"NOW()","v":"2025-12-15T11:00:59.760"}]
["Type: ","LAPTOP","SN:",{"$f":"VLOOKUP(E1424,INVENTORYDATA,10,FALSE)","v":{"$error":"#N/A"}},null,null,"Type: ","LAPTOP","SN:",{"$f":"VLOOKUP(K1424,INVENTORYDATA,10,FALSE)","v":{"$error":"#N/A"}}]
[{"$f":"\"Make: \"","v":"Make: "},{"$f":"VLOOKUP(E1424,INVENTORYDATA,2,FALSE)","v":{"$error":"#N/A"}},{"$f":"\"Model: \"","v":"Model: "},{"$f":"VLOOKUP(E1424,INVENTORYDATA,3,FALSE)","v":{"$error":"#N/A"}},null,null,{"$f":"\"Make: \"","v":"Make: "},{"$f":"VLOOKUP(K1424,INVENTORYDATA,2,FALSE)","v":{"$error":"#N/A"}},{"$f":"\"Model: \"","v":"Model: "},{"$f":"VLOOKUP(K1424,INVENTORYDATA,3,FALSE)","v":{"$error":"#N/A"}}]
[{"$f":"\"CPU/Speed: \"","v":"CPU/Speed: "},{"$f":"VLOOKUP(E1424,INVENTORYDATA,4,FALSE)&\" / \"&VLOOKUP(E1424,INVENTORYDATA,5,FALSE)&\"GHz\"","v":{"$error":"#N/A"}},null,{"$f":"\"Memory: \"","v":"Memory: "},{"$f":"VLOOKUP(E1424,INVENTORYDATA,6,FALSE)","v":{"$error":"#N/A"}},null,{"$f":"\"CPU/Speed: \"","v":"CPU/Speed: "},{"$f":"VLOOKUP(K1424,INVENTORYDATA,4,FALSE)&\" / \"&VLOOKUP(K1424,INVENTORYDATA,5,FALSE)&\"GHz\"","v":{"$error":"#N/A"}},null,{"$f":"\"Memory: \"","v":"Memory: "},{"$f":"VLOOKUP(K1424,INVENTORYDATA,6,FALSE)","v":{"$error":"#N/A"}}]
[]
["Key Function",null,"Pass","Fail ","Comments",null,"Key Function",null,"Pass","Fail ","Comments"]
["Hard Drive Removed",null,{"$f":"IF(ISBLANK(VLOOKUP(E1424,INVENTORYDATA,13,FALSE)),\"X\",\"\")","v":""},null,{"$f":"IF(ISBLANK(VLOOKUP(E1424,INVENTORYDATA,13,FALSE)),\"\",VLOOKUP(E1424,INVENTORYDATA,13,FALSE))","v":{"$error":"#N/A"}},null,"Hard Drive Removed",null,{"$f":"IF(ISBLANK(VLOOKUP(K1424,INVENTORYDATA,13,FALSE)),\"X\",\"\")","v":""},null,{"$f":"IF(ISBLANK(VLOOKUP(K1424,INVENTORYDATA,13,FALSE)),\"\",VLOOKUP(K1424,INVENTORYDATA,13,FALSE))","v":{"$error":"#N/A"}}]
["Install Memory",null,"X",{"$nulls":3},"Install Memory",null,"X"]
["Power ON",null,"X",{"$nulls":3},"Power ON",null,"X"]
["Record BIOS info",null,"X",{"$nulls":3},"Record BIOS info",null,"X"]
["Check Optical Drive",null,{"$f":"IF((VLOOKUP(E1424,INVENTORYDATA,7,FALSE))=\"YES\",\"X\",\"\")","v":{"$error":"#N/A"}},{"$f":"IF((VLOOKUP(E1424,INVENTORYDATA,7,FALSE))=\"NO\",\"X\",\"\")","v":{"$error":"#N/A"}},null,null,"Check Optical Drive",null,{"$f":"IF((VLOOKUP(K1424,INVENTORYDATA,7,FALSE))=\"YES\",\"X\",\"\")","v":{"$error":"#N/A"}},{"$f":"IF((VLOOKUP(K1424,INVENTORYDATA,7,FALSE))=\"NO\",\"X\",\"\")","v":{"$error":"#N/A"}}]
["Power Off",null,"X",{"$nulls":3},"Power Off",null,"X"]
["HDD Serial No.",null,{"$f":"IF(ISBLANK(VLOOKUP(E1424,INVENTORYDATA,12,FALSE)),\"\",VLOOKUP(E1424,INVENTORYDATA,12,FALSE))","v":{"$error":"#N/A"}},{"$nulls":3},"HDD Serial No.",null,{"$f":"IF(ISBLANK(VLOOKUP(K1424,INVENTORYDATA,12,FALSE)),\"\",VLOOKUP(K1424,INVENTORYDATA,12,FALSE))","v":{"$error":"#N/A"}}]
[]
["Tested for key functions,R2/Ready for Resale",{"$nulls":5},"Tested for key functions,R2/Ready for Resale"]
["BIOS Lock","Caddy","Optical","WebCam","Battery",null,"BIOS Lock","Caddy","Optical","WebCam","Battery"]
[null,null,{"$f":"VLOOKUP(E1424,INVENTORY!$A$2:$N$100,7,FALSE)","v":{"$error":"#N/A"}},{"$f":"VLOOKUP(E1424,INVENTORY!$A$2:$N$100,8,FALSE)","v":{"$error":"#N/A"}},{"$f":"VLOOKUP(E1424,INVENTORY!$A$2:$N$100,9,FALSE)","v":{"$error":"#N/A"}},{"$nulls":3},{"$f":"VLOOKUP(K1424,INVENTORY!$A$2:$N$100,7,FALSE)","v":{"$error":"#N/A"}},{"$f":"VLOOKUP(K1424,INVENTORY!$A$2:$N$100,8,FALSE)","v":{"$error":"#N/A"}},{"$f":"VLOOKUP(K1424,INVENTORY!$A$2:$N$100,9,FALSE)","v":{"$error":"#N/A"}}]
[]
["CPU Cosmetics Defects:",null,{"$f":"\"Function Code: \"&VLOOKUP(E1424,INVENTORY!$A$2:$Q$100,14,FALSE)","v":{"$error":"#N/A"}},{"$nulls":3},"CPU Cosmetics Defects:",null,{"$f":"\"Function Code: \"&VLOOKUP(K1424,INVENTORY!$A$2:$Q$100,14,FALSE)","v":{"$error":"#N/A"}}]
[]
[null,null,{"$f":"\"Cosmetic Code: \"&VLOOKUP(E1424,INVENTORY!$A$2:$Q$100,15,FALSE)","v":{"$error":"#N/A"}},{"$nulls":5},{"$f":"\"Cosmetic Code: \"&VLOOKUP(K1424,INVENTORY!$A$2:$Q$100,15,FALSE)","v":{"$error":"#N/A"}}]
[]
["Casing","Plugs/Ports",{"$nulls":4},"Casing","Plugs/Ports"]
["Pass","Pass",{"$nulls":4},"Pass","Pass"]
["Fail","Fail",null,"TRRC#:L.T.R.",null,null,"Fail","Fail",null,"TRRC#:L.T.R."]
[]
["LAPTOP TESTING RECORD",{"$nulls":5},"LAPTOP TESTING RECORD"]
[]
[{"$nulls":3},"ITEM #",{"$f":"E1424+2","v":101},{"$nulls":4},"ITEM #",{"$f":"K1424+2","v":102}]
["Tester: ","RR","Date:",{"$f":"NOW()","v":"2025-12-15T11:00:59.760"},null,null,"Tester: ","RR","Date:",{"$f":"NOW()","v":"2025-12-15T11:00:59.760"}]
["Type: ","LAPTOP","SN:",{"$f":"VLOOKUP(E1453,INVENTORYDATA,10,FALSE)","v":{"$error":"#N/A"}},null,null,"Type: ","LAPTOP","SN:",{"$f":"VLOOKUP(K1453,INVENTORYDATA,10,FALSE)","v":{"$error":"#N/A"}}]
[{"$f":"\"Make: \"","v":"Make: "},{"$f":"VLOOKUP(E1453,INVENTORYDATA,2,FALSE)","v":{"$error":"#N/A"}},{"$f":"\"Model: \"","v":"Model: "},{"$f":"VLOOKUP(E1453,INVENTORYDATA,3,FALSE)","v":{"$error":"#N/A"}},null,null,{"$f":"\"Make: \"","v":"Make: "},{"$f":"VLOOKUP(K1453,INVENTORYDATA,2,FALSE)","v":{"$error":"#N/A"}},{"$f":"\"Model: \"","v":"Model: "},{"$f":"VLOOKUP(K1453,INVENTORYDATA,3,FALSE)","v":{"$error":"#N/A"}}]
[{"$f":"\"CPU/Speed: \"","v":"CPU/Speed: "},{"$f":"VLOOKUP(E1453,INVENTORYDATA,4,FALSE)&\" / \"&VLOOKUP(E1453,INVENTORYDATA,5,FALSE)&\"GHz\"","v":{"$error":"#N/A"}},null,{"$f":"\"Memory: \"","v":"Memory: "},{"$f":"VLOOKUP(E1453,INVENTORYDATA,6,FALSE)","v":{"$error":"#N/A"}},null,{"$f":"\"CPU/Speed: \"","v":"CPU/Speed: "},{"$f":"VLOOKUP(K1453,INVENTORYDATA,4,FALSE)&\" / \"&VLOOKUP(K1453,INVENTORYDATA,5,FALSE)&\"GHz\"","v":{"$error":"#N/A"}},null,{"$f":"\"Memory: \"","v":"Memory: "},{"$f":"VLOOKUP(K1453,INVENTORYDATA,6,FALSE)","v":{"$error":"#N/A"}}]
[]
["Key Function",null,"Pass","Fail ","Comments",null,"Key Function",null,"Pass","Fail ","Comments"]
["Hard Drive Removed",null,{"$f":"IF(ISBLANK(VLOOKUP(E1453,INVENTORYDATA,13,FALSE)),\"X\",\"\")","v":""},null,{"$f":"IF(ISBLANK(VLOOKUP(E1453,INVENTORYDATA,13,FALSE)),\"\",VLOOKUP(E1453,INVENTORYDATA,13,FALSE))","v":{"$error":"#N/A"}},null,"Hard Drive Removed",null,{"$f":"IF(ISBLANK(VLOOKUP(K1453,INVENTORYDATA,13,FALSE)),\"X\",\"\")","v":""},null,{"$f":"IF(ISBLANK(VLOOKUP(K1453,INVENTORYDATA,13,FALSE)),\"\",VLOOKUP(K1453,INVENTORYDATA,13,FALSE))","v":{"$error":"#N/A"}}]
["Install Memory",null,"X",{"$nulls":3},"Install Memory",null,"X"]
["Power ON",null,"X",{"$nulls":3},"Power ON",null,"X"]
["Record BIOS info",null,"X",{"$nulls":3},"Record BIOS info",null,"X"]
["Check Optical Drive",null,{"$f":"IF((VLOOKUP(E1453,INVENTORYDATA,7,FALSE))=\"YES\",\"X\",\"\")","v":{"$error":"#N/A"}},{"$f":"IF((VLOOKUP(E1453,INVENTORYDATA,7,FALSE))=\"NO\",\"X\",\"\")","v":{"$error":"#N/A"}},null,null,"Check Optical Drive",null,{"$f":"IF((VLOOKUP(K1453,INVENTORYDATA,7,FALSE))=\"YES\",\"X\",\"\")","v":{"$error":"#N/A"}},{"$f":"IF((VLOOKUP(K1453,INVENTORYDATA,7,FALSE))=\"NO\",\"X\",\"\")","v":{"$error":"#N/A"}}]
["Power Off",null,"X",{"$nulls":3},"Power Off",null,"X"]
["HDD Serial No.",null,{"$f":"IF(ISBLANK(VLOOKUP(E1453,INVENTORYDATA,12,FALSE)),\"\",VLOOKUP(E1453,INVENTORYDATA,12,FALSE))","v":{"$error":"#N/A"}},{"$nulls":3},"HDD Serial No.",null,{"$f":"IF(ISBLANK(VLOOKUP(K1453,INVENTORYDATA,12,FALSE)),\"\",VLOOKUP(K1453,INVENTORYDATA,12,FALSE))","v":{"$error":"#N/A"}}]
[]
["Tested for key functions,R2/Ready for Resale",{"$nulls":5},"Tested for key functions,R2/Ready for Resale"]
["BIOS Lock","Caddy","Optical","WebCam","Battery",null,"BIOS Lock","Caddy","Optical","WebCam","Battery"]
[null,null,{"$f":"VLOOKUP(E1453,INVENTORY!$A$2:$N$100,7,FALSE)","v":{"$error":"#N/A"}},{"$f":"VLOOKUP(E1453,INVENTORY!$A$2:$N$100,8,FALSE)","v":{"$error":"#N/A"}},{"$f":"VLOOKUP(E1453,INVENTORY!$A$2:$N$100,9,FALSE)","v":{"$error":"#N/A"}},{"$nulls":3},{"$f":"VLOOKUP(K1453,INVENTORY!$A$2:$N$100,7,FALSE)","v":{"$error":"#N/A"}},{"$f":"VLOOKUP(K1453,INVENTORY!$A$2:$N$100,8,FALSE)","v":{"$error":"#N/A"}},{"$f":"VLOOKUP(K1453,INVENTORY!$A$2:$N$100,9,FALSE)","v":{"$error":"#N/A"}}]
[]
["CPU Cosmetics Defects:",null,{"$f":"\"Function Code: \"&VLOOKUP(E1453,INVENTORY!$A$2:$Q$100,14,FALSE)","v":{"$error":"#N/A"}},{"$nulls":3},"CPU Cosmetics Defects:",null,{"$f":"\"Function Code: \"&VLOOKUP(K1453,INVENTORY!$A$2:$Q$100,14,FALSE)","v":{"$error":"#N/A"}}]
[]
[null,null,{"$f":"\"Cosmetic Code: \"&VLOOKUP(E1453,INVENTORY!$A$2:$Q$100,15,FALSE)","v":{"$error":"#N/A"}},{"$nulls":5},{"$f":"\"Cosmetic Code: \"&VLOOKUP(K1453,INVENTORY!$A$2:$Q$100,15,FALSE)","v":{"$error":"#N/A"}}]
[]
["Casing","Plugs/Ports",{"$nulls":4},"Casing","Plugs/Ports"]
["Pass","Pass",{"$nulls":4},"Pass","Pass"]
["Fail","Fail",null,"TRRC#:L.T.R.",null,null,"Fail","Fail",null,"TRRC#:L.T.R."]
[]
["LAPTOP TESTING RECORD",{"$nulls":5},"LAPTOP TESTING RECORD"]
[]
[{"$nulls":3},"ITEM #",{"$f":"E1453+2","v":103},{"$nulls":4},"ITEM #",{"$f":"K1453+2","v":104}]
["Tester: ","RR","Date:",{"$f":"NOW()","v":"2025-12-15T11:00:59.760"},null,null,"Tester: ","RR","Date:",{"$f":"NOW()","v":"2025-12-15T11:00:59.760"}]
["Type: ","LAPTOP","SN:",{"$f":"VLOOKUP(E1482,INVENTORYDATA,10,FALSE)","v":{"$error":"#N/A"}},null,null,"Type: ","LAPTOP","SN:",{"$f":"VLOOKUP(K1482,INVENTORYDATA,10,FALSE)","v":{"$error":"#N/A"}}]
[{"$f":"\"Make: \"","v":"Make: "},{"$f":"VLOOKUP(E1482,INVENTORYDATA,2,FALSE)","v":{"$error":"#N/A"}},{"$f":"\"Model: \"","v":"Model: "},{"$f":"VLOOKUP(E1482,INVENTORYDATA,3,FALSE)","v":{"$error":"#N/A"}},null,null,{"$f":"\"Make: \"","v":"Make: "},{"$f":"VLOOKUP(K1482,INVENTORYDATA,2,FALSE)","v":{"$error":"#N/A"}},{"$f":"\"Model: \"","v":"Model: "},{"$f":"VLOOKUP(K1482,INVENTORYDATA,3,FALSE)","v":{"$error":"#N/A"}}]
[{"$f":"\"CPU/Speed: \"","v":"CPU/Speed: "},{"$f":"VLOOKUP(E1482,INVENTORYDATA,4,FALSE)&\" / \"&VLOOKUP(E1482,INVENTORYDATA,5,FALSE)&\"GHz\"","v":{"$error":"#N/A"}},null,{"$f":"\"Memory: \"","v":"Memory: "},{"$f":"VLOOKUP(E1482,INVENTORYDATA,6,FALSE)","v":{"$error":"#N/A"}},null,{"$f":"\"CPU/Speed: \"","v":"CPU/Speed: "},{"$f":"VLOOKUP(K1482,INVENTORYDATA,4,FALSE)&\" / \"&VLOOKUP(K1482,INVENTORYDATA,5,FALSE)&\"GHz\"","v":{"$error":"#N/A"}},null,{"$f":"\"Memory: \"","v":"Memory: "},{"$f":"VLOOKUP(K1482,INVENTORYDATA,6,FALSE)","v":{"$error":"#N/A"}}]
[]
["Key Function",null,"Pass","Fail ","Comments",null,"Key Function",null,"Pass","Fail ","Comments"]
["Hard Drive Removed",null,{"$f":"IF(ISBLANK(VLOOKUP(E1482,INVENTORYDATA,13,FALSE)),\"X\",\"\")","v":""},null,{"$f":"IF(ISBLANK(VLOOKUP(E1482,INVENTORYDATA,13,FALSE)),\"\",VLOOKUP(E1482,INVENTORYDATA,13,FALSE))","v":{"$error":"#N/A"}},null,"Hard Drive Removed",null,{"$f":"IF(ISBLANK(VLOOKUP(K1482,INVENTORYDATA,13,FALSE)),\"X\",\"\")","v":""},null,{"$f":"IF(ISBLANK(VLOOKUP(K1482,INVENTORYDATA,13,FALSE)),\"\",VLOOKUP(K1482,INVENTORYDATA,13,FALSE))","v":{"$error":"#N/A"}}]
["Install Memory",null,"X",{"$nulls":3},"Install Memory",null,"X"]
["Power ON",null,"X",{"$nulls":3},"Power ON",null,"X"]
["Record BIOS info",null,"X",{"$nulls":3},"Record BIOS info",null,"X"]
["Check Optical Drive",null,{"$f":"IF((VLOOKUP(E1482,INVENTORYDATA,7,FALSE))=\"YES\",\"X\",\"\")","v":{"$error":"#N/A"}},{"$f":"IF((VLOOKUP(E1482,INVENTORYDATA,7,FALSE))=\"NO\",\"X\",\"\")","v":{"$error":"#N/A"}},null,null,"Check Optical Drive",null,{"$f":"IF((VLOOKUP(K1482,INVENTORYDATA,7,FALSE))=\"YES\",\"X\",\"\")","v":{"$error":"#N/A"}},{"$f":"IF((VLOOKUP(K1482,INVENTORYDATA,7,FALSE))=\"NO\",\"X\",\"\")","v":{"$error":"#N/A"}}]
["Power Off",null,"X",{"$nulls":3},"Power Off",null,"X"]
["HDD Serial No.",null,{"$f":"IF(ISBLANK(VLOOKUP(E1482,INVENTORYDATA,12,FALSE)),\"\",VLOOKUP(E1482,INVENTORYDATA,12,FALSE))","v":{"$error":"#N/A"}},{"$nulls":3},"HDD Serial No.",null,{"$f":"IF(ISBLANK(VLOOKUP(K1482,INVENTORYDATA,12,FALSE)),\"\",VLOOKUP(K1482,INVENTORYDATA,12,FALSE))","v":{"$error":"#N/A"}}]
[]
["Tested for key functions,R2/Ready for Resale",{"$nulls":5},"Tested for key functions,R2/Ready for Resale"]
["BIOS Lock","Caddy","Optical","WebCam","Battery",null,"BIOS Lock","Caddy","Optical","WebCam","Battery"]
[null,null,{"$f":"VLOOKUP(E1482,INVENTORY!$A$2:$N$100,7,FALSE)","v":{"$error":"#N/A"}},{"$f":"VLOOKUP(E1482,INVENTORY!$A$2:$N$100,8,FALSE)","v":{"$error":"#N/A"}},{"$f":"VLOOKUP(E1482,INVENTORY!$A$2:$N$100,9,FALSE)","v":{"$error":"#N/A"}},{"$nulls":3},{"$f":"VLOOKUP(K1482,INVENTORY!$A$2:$N$100,7,FALSE)","v":{"$error":"#N/A"}},{"$f":"VLOOKUP(K1482,INVENTORY!$A$2:$N$100,8,FALSE)","v":{"$error":"#N/A"}},{"$f":"VLOOKUP(K1482,INVENTORY!$A$2:$N$100,9,FALSE)","v":{"$error":"#N/A"}}]
[]
["CPU Cosmetics Defects:",null,{"$f":"\"Function Code: \"&VLOOKUP(E1482,INVENTORY!$A$2:$Q$100,14,FALSE)","v":{"$error":"#N/A"}},{"$nulls":3},"CPU Cosmetics Defects:",null,{"$f":"\"Function Code: \"&VLOOKUP(K1482,INVENTORY!$A$2:$Q$100,14,FALSE)","v":{"$error":"#N/A"}}]
[]
[null,null,{"$f":"\"Cosmetic Code: \"&VLOOKUP(E1482,INVENTORY!$A$2:$Q$100,15,FALSE)","v":{"$error":"#N/A"}},{"$nulls":5},{"$f":"\"Cosmetic Code: \"&VLOOKUP(K1482,INVENTORY!$A$2:$Q$100,15,FALSE)","v":{"$error":"#N/A"}}]
[]
["Casing","Plugs/Ports",{"$nulls":4},"Casing","Plugs/Ports"]
["Pass","Pass",{"$nulls":4},"Pass","Pass"]
["Fail","Fail",null,"TRRC#:L.T.R.",null,null,"Fail","Fail",null,"TRRC#:L.T.R."]
[]
["LAPTOP TESTING RECORD",{"$nulls":5},"LAPTOP TESTING RECORD"]
[]
[{"$nulls":3},"ITEM #",{"$f":"E1482+2","v":105},{"$nulls":4},"ITEM #",{"$f":"K1482+2","v":106}]
["Tester: ","RR","Date:",{"$f":"NOW()","v":"2025-12-15T11:00:59.760"},null,null,"Tester: ","RR","Date:",{"$f":"NOW()","v":"2025-12-15T11:00:59.760"}]
["Type: ","LAPTOP","SN:",{"$f":"VLOOKUP(E1511,INVENTORYDATA,10,FALSE)","v":{"$error":"#N/A"}},null,null,"Type: ","LAPTOP","SN:",{"$f":"VLOOKUP(K1511,INVENTORYDATA,10,FALSE)","v":{"$error":"#N/A"}}]
[{"$f":"\"Make: \"","v":"Make: "},{"$f":"VLOOKUP(E1511,INVENTORYDATA,2,FALSE)","v":{"$error":"#N/A"}},{"$f":"\"Model: \"","v":"Model: "},{"$f":"VLOOKUP(E1511,INVENTORYDATA,3,FALSE)","v":{"$error":"#N/A"}},null,null,{"$f":"\"Make: \"","v":"Make: "},{"$f":"VLOOKUP(K1511,INVENTORYDATA,2,FALSE)","v":{"$error":"#N/A"}},{"$f":"\"Model: \"","v":"Model: "},{"$f":"VLOOKUP(K1511,INVENTORYDATA,3,FALSE)","v":{"$error":"#N/A"}}]
[{"$f":"\"CPU/Speed: \"","v":"CPU/Speed: "},{"$f":"VLOOKUP(E1511,INVENTORYDATA,4,FALSE)&\" / \"&VLOOKUP(E1511,INVENTORYDATA,5,FALSE)&\"GHz\"","v":{"$error":"#N/A"}},null,{"$f":"\"Memory: \"","v":"Memory: "},{"$f":"VLOOKUP(E1511,INVENTORYDATA,6,FALSE)","v":{"$error":"#N/A"}},null,{"$f":"\"CPU/Speed: \"","v":"CPU/Speed: "},{"$f":"VLOOKUP(K1511,INVENTORYDATA,4,FALSE)&\" / \"&VLOOKUP(K1511,INVENTORYDATA,5,FALSE)&\"GHz\"","v":{"$error":"#N/A"}},null,{"$f":"\"Memory: \"","v":"Memory: "},{"$f":"VLOOKUP(K1511,INVENTORYDATA,6,FALSE)","v":{"$error":"#N/A"}}]
[]
["Key Function",null,"Pass","Fail ","Comments",null,"Key Function",null,"Pass","Fail ","Comments"]
["Hard Drive Removed",null,{"$f":"IF(ISBLANK(VLOOKUP(E1511,INVENTORYDATA,13,FALSE)),\"X\",\"\")","v":""},null,{"$f":"IF(ISBLANK(VLOOKUP(E1511,INVENTORYDATA,13,FALSE)),\"\",VLOOKUP(E1511,INVENTORYDATA,13,FALSE))","v":{"$error":"#N/A"}},null,"Hard Drive Removed",null,{"$f":"IF(ISBLANK(VLOOKUP(K1511,INVENTORYDATA,13,FALSE)),\"X\",\"\")","v":""},null,{"$f":"IF(ISBLANK(VLOOKUP(K1511,INVENTORYDATA,13,FALSE)),\"\",VLOOKUP(K1511,INVENTORYDATA,13,FALSE))","v":{"$error":"#N/A"}}]
["Install Memory",null,"X",{"$nulls":3},"Install Memory",null,"X"]
["Power ON",null,"X",{"$nulls":3},"Power ON",null,"X"]
["Record BIOS info",null,"X",{"$nulls":3},"Record BIOS info",null,"X"]
["Check Optical Drive",null,{"$f":"IF((VLOOKUP(E1511,INVENTORYDATA,7,FALSE))=\"YES\",\"X\",\"\")","v":{"$error":"#N/A"}},{"$f":"IF((VLOOKUP(E1511,INVENTORYDATA,7,FALSE))=\"NO\",\"X\",\"\")","v":{"$error":"#N/A"}},null,null,"Check Optical Drive",null,{"$f":"IF((VLOOKUP(K1511,INVENTORYDATA,7,FALSE))=\"YES\",\"X\",\"\")","v":{"$error":"#N/A"}},{"$f":"IF((VLOOKUP(K1511,INVENTORYDATA,7,FALSE))=\"NO\",\"X\",\"\")","v":{"$error":"#N/A"}}]
["Power Off",null,"X",{"$nulls":3},"Power Off",null,"X"]
["HDD Serial No.",null,{"$f":"IF(ISBLANK(VLOOKUP(E1511,INVENTORYDATA,12,FALSE)),\"\",VLOOKUP(E1511,INVENTORYDATA,12,FALSE))","v":{"$error":"#N/A"}},{"$nulls":3},"HDD Serial No.",null,{"$f":"IF(ISBLANK(VLOOKUP(K1511,INVENTORYDATA,12,FALSE)),\"\",VLOOKUP(K1511,INVENTORYDATA,12,FALSE))","v":{"$error":"#N/A"}}]
[]
["Tested for key functions,R2/Ready for Resale",{"$nulls":5},"Tested for key functions,R2/Ready for Resale"]
["BIOS Lock","Caddy","Optical","WebCam","Battery",null,"BIOS Lock","Caddy","Optical","WebCam","Battery"]
[null,null,{"$f":"VLOOKUP(E1511,INVENTORY!$A$2:$N$100,7,FALSE)","v":{"$error":"#N/A"}},{"$f":"VLOOKUP(E1511,INVENTORY!$A$2:$N$100,8,FALSE)","v":{"$error":"#N/A"}},{"$f":"VLOOKUP(E1511,INVENTORY!$A$2:$N$100,9,FALSE)","v":{"$error":"#N/A"}},{"$nulls":3},{"$f":"VLOOKUP(K1511,INVENTORY!$A$2:$N$100,7,FALSE)","v":{"$error":"#N/A"}},{"$f":"VLOOKUP(K1511,INVENTORY!$A$2:$N$100,8,FALSE)","v":{"$error":"#N/A"}},{"$f":"VLOOKUP(K1511,INVENTORY!$A$2:$N$100,9,FALSE)","v":{"$error":"#N/A"}}]
[]
["CPU Cosmetics Defects:",null,{"$f":"\"Function Code: \"&VLOOKUP(E1511,INVENTORY!$A$2:$Q$100,14,FALSE)","v":{"$error":"#N/A"}},{"$nulls":3},"CPU Cosmetics Defects:",null,{"$f":"\"Function Code: \"&VLOOKUP(K1511,INVENTORY!$A$2:$Q$100,14,FALSE)","v":{"$error":"#N/A"}}]
[]
[null,null,{"$f":"\"Cosmetic Code: \"&VLOOKUP(E1511,INVENTORY!$A$2:$Q$100,15,FALSE)","v":{"$error":"#N/A"}},{"$nulls":5},{"$f":"\"Cosmetic Code: \"&VLOOKUP(K1511,INVENTORY!$A$2:$Q$100,15,FALSE)","v":{"$error":"#N/A"}}]
[]
["Casing","Plugs/Ports",{"$nulls":4},"Casing","Plugs/Ports"]
["Pass","Pass",{"$nulls":4},"Pass","Pass"]
["Fail","Fail",null,"TRRC#:L.T.R.",null,null,"Fail","Fail",null,"TRRC#:L.T.R."]
[]
["LAPTOP TESTING RECORD",{"$nulls":5},"LAPTOP TESTING RECORD"]
[]
[{"$nulls":3},"ITEM #",{"$f":"E1511+2","v":107},{"$nulls":4},"ITEM #",{"$f":"K1511+2","v":108}]
["Tester: ","RR","Date:",{"$f":"NOW()","v":"2025-12-15T11:00:59.760"},null,null,"Tester: ","RR","Date:",{"$f":"NOW()","v":"2025-12-15T11:00:59.760"}]
["Type: ","LAPTOP","SN:",{"$f":"VLOOKUP(E1540,INVENTORYDATA,10,FALSE)","v":{"$error":"#N/A"}},null,null,"Type: ","LAPTOP","SN:",{"$f":"VLOOKUP(K1540,INVENTORYDATA,10,FALSE)","v":{"$error":"#N/A"}}]
[{"$f":"\"Make: \"","v":"Make: "},{"$f":"VLOOKUP(E1540,INVENTORYDATA,2,FALSE)","v":{"$error":"#N/A"}},{"$f":"\"Model: \"","v":"Model: "},{"$f":"VLOOKUP(E1540,INVENTORYDATA,3,FALSE)","v":{"$error":"#N/A"}},null,null,{"$f":"\"Make: \"","v":"Make: "},{"$f":"VLOOKUP(K1540,INVENTORYDATA,2,FALSE)","v":{"$error":"#N/A"}},{"$f":"\"Model: \"","v":"Model: "},{"$f":"VLOOKUP(K1540,INVENTORYDATA,3,FALSE)","v":{"$error":"#N/A"}}]
[{"$f":"\"CPU/Speed: \"","v":"CPU/Speed: "},{"$f":"VLOOKUP(E1540,INVENTORYDATA,4,FALSE)&\" / \"&VLOOKUP(E1540,INVENTORYDATA,5,FALSE)&\"GHz\"","v":{"$error":"#N/A"}},null,{"$f":"\"Memory: \"","v":"Memory: "},{"$f":"VLOOKUP(E1540,INVENTORYDATA,6,FALSE)","v":{"$error":"#N/A"}},null,{"$f":"\"CPU/Speed: \"","v":"CPU/Speed: "},{"$f":"VLOOKUP(K1540,INVENTORYDATA,4,FALSE)&\" / \"&VLOOKUP(K1540,INVENTORYDATA,5,FALSE)&\"GHz\"","v":{"$error":"#N/A"}},null,{"$f":"\"Memory: \"","v":"Memory: "},{"$f":"VLOOKUP(K1540,INVENTORYDATA,6,FALSE)","v":{"$error":"#N/A"}}]
[]
["Key Function",null,"Pass","Fail ","Comments",null,"Key Function",null,"Pass","Fail ","Comments"]
["Hard Drive Removed",null,{"$f":"IF(ISBLANK(VLOOKUP(E1540,INVENTORYDATA,13,FALSE)),\"X\",\"\")","v":""},null,{"$f":"IF(ISBLANK(VLOOKUP(E1540,INVENTORYDATA,13,FALSE)),\"\",VLOOKUP(E1540,INVENTORYDATA,13,FALSE))","v":{"$error":"#N/A"}},null,"Hard Drive Removed",null,{"$f":"IF(ISBLANK(VLOOKUP(K1540,INVENTORYDATA,13,FALSE)),\"X\",\"\")","v":""},null,{"$f":"IF(ISBLANK(VLOOKUP(K1540,INVENTORYDATA,13,FALSE)),\"\",VLOOKUP(K1540,INVENTORYDATA,13,FALSE))","v":{"$error":"#N/A"}}]
["Install Memory",null,"X",{"$nulls":3},"Install Memory",null,"X"]
["Power ON",null,"X",{"$nulls":3},"Power ON",null,"X"]
["Record BIOS info",null,"X",{"$nulls":3},"Record BIOS info",null,"X"]
["Check Optical Drive",null,{"$f":"IF((VLOOKUP(E1540,INVENTORYDATA,7,FALSE))=\"YES\",\"X\",\"\")","v":{"$error":"#N/A"}},{"$f":"IF((VLOOKUP(E1540,INVENTORYDATA,7,FALSE))=\"NO\",\"X\",\"\")","v":{"$error":"#N/A"}},null,null,"Check Optical Drive",null,{"$f":"IF((VLOOKUP(K1540,INVENTORYDATA,7,FALSE))=\"YES\",\"X\",\"\")","v":{"$error":"#N/A"}},{"$f":"IF((VLOOKUP(K1540,INVENTORYDATA,7,FALSE))=\"NO\",\"X\",\"\")","v":{"$error":"#N/A"}}]
["Power Off",null,"X",{"$nulls":3},"Power Off",null,"X"]
["HDD Serial No.",null,{"$f":"IF(ISBLANK(VLOOKUP(E1540,INVENTORYDATA,12,FALSE)),\"\",VLOOKUP(E1540,INVENTORYDATA,12,FALSE))","v":{"$error":"#N/A"}},{"$nulls":3},"HDD Serial No.",null,{"$f":"IF(ISBLANK(VLOOKUP(K1540,INVENTORYDATA,12,FALSE)),\"\",VLOOKUP(K1540,INVENTORYDATA,12,FALSE))","v":{"$error":"#N/A"}}]
[]
["Tested for key functions,R2/Ready for Resale",{"$nulls":5},"Tested for key functions,R2/Ready for Resale"]
["BIOS Lock","Caddy","Optical","WebCam","Battery",null,"BIOS Lock","Caddy","Optical","WebCam","Battery"]
[null,null,{"$f":"VLOOKUP(E1540,INVENTORY!$A$2:$N$100,7,FALSE)","v":{"$error":"#N/A"}},{"$f":"VLOOKUP(E1540,INVENTORY!$A$2:$N$100,8,FALSE)","v":{"$error":"#N/A"}},{"$f":"VLOOKUP(E1540,INVENTORY!$A$2:$N$100,9,FALSE)","v":{"$error":"#N/A"}},{"$nulls":3},{"$f":"VLOOKUP(K1540,INVENTORY!$A$2:$N$100,7,FALSE)","v":{"$error":"#N/A"}},{"$f":"VLOOKUP(K1540,INVENTORY!$A$2:$N$100,8,FALSE)","v":{"$error":"#N/A"}},{"$f":"VLOOKUP(K1540,INVENTORY!$A$2:$N$100,9,FALSE)","v":{"$error":"#N/A"}}]
[]
["CPU Cosmetics Defects:",null,{"$f":"\"Function Code: \"&VLOOKUP(E1540,INVENTORY!$A$2:$Q$100,14,FALSE)","v":{"$error":"#N/A"}},{"$nulls":3},"CPU Cosmetics Defects:",null,{"$f":"\"Function Code: \"&VLOOKUP(K1540,INVENTORY!$A$2:$Q$100,14,FALSE)","v":{"$error":"#N/A"}}]
[]
[null,null,{"$f":"\"Cosmetic Code: \"&VLOOKUP(E1540,INVENTORY!$A$2:$Q$100,15,FALSE)","v":{"$error":"#N/A"}},{"$nulls":5},{"$f":"\"Cosmetic Code: \"&VLOOKUP(K1540,INVENTORY!$A$2:$Q$100,15,FALSE)","v":{"$error":"#N/A"}}]
[]
["Casing","Plugs/Ports",{"$nulls":4},"Casing","Plugs/Ports"]
["Pass","Pass",{"$nulls":4},"Pass","Pass"]
["Fail","Fail",null,"TRRC#:L.T.R.",null,null,"Fail","Fail",null,"TRRC#:L.T.R."]
[]
["LAPTOP TESTING RECORD",{"$nulls":5},"LAPTOP TESTING RECORD"]
[]
[{"$nulls":3},"ITEM #",{"$f":"E1540+2","v":109},{"$nulls":4},"ITEM #",{"$f":"K1540+2","v":110}]
["Tester: ","RR","Date:",{"$f":"NOW()","v":"2025-12-15T11:00:59.760"},null,null,"Tester: ","RR","Date:",{"$f":"NOW()","v":"2025-12-15T11:00:59.760"}]
["Type: ","LAPTOP","SN:",{"$f":"VLOOKUP(E1569,INVENTORYDATA,10,FALSE)","v":{"$error":"#N/A"}},null,null,"Type: ","LAPTOP","SN:",{"$f":"VLOOKUP(K1569,INVENTORYDATA,10,FALSE)","v":{"$error":"#N/A"}}]
[{"$f":"\"Make: \"","v":"Make: "},{"$f":"VLOOKUP(E1569,INVENTORYDATA,2,FALSE)","v":{"$error":"#N/A"}},{"$f":"\"Model: \"","v":"Model: "},{"$f":"VLOOKUP(E1569,INVENTORYDATA,3,FALSE)","v":{"$error":"#N/A"}},null,null,{"$f":"\"Make: \"","v":"Make: "},{"$f":"VLOOKUP(K1569,INVENTORYDATA,2,FALSE)","v":{"$error":"#N/A"}},{"$f":"\"Model: \"","v":"Model: "},{"$f":"VLOOKUP(K1569,INVENTORYDATA,3,FALSE)","v":{"$error":"#N/A"}}]
[{"$f":"\"CPU/Speed: \"","v":"CPU/Speed: "},{"$f":"VLOOKUP(E1569,INVENTORYDATA,4,FALSE)&\" / \"&VLOOKUP(E1569,INVENTORYDATA,5,FALSE)&\"GHz\"","v":{"$error":"#N/A"}},null,{"$f":"\"Memory: \"","v":"Memory: "},{"$f":"VLOOKUP(E1569,INVENTORYDATA,6,FALSE)","v":{"$error":"#N/A"}},null,{"$f":"\"CPU/Speed: \"","v":"CPU/Speed: "},{"$f":"VLOOKUP(K1569,INVENTORYDATA,4,FALSE)&\" / \"&VLOOKUP(K1569,INVENTORYDATA,5,FALSE)&\"GHz\"","v":{"$error":"#N/A"}},null,{"$f":"\"Memory: \"","v":"Memory: "},{"$f":"VLOOKUP(K1569,INVENTORYDATA,6,FALSE)","v":{"$error":"#N/A"}}]
[]
["Key Function",null,"Pass","Fail ","Comments",null,"Key Function",null,"Pass","Fail ","Comments"]
["Hard Drive Removed",null,{"$f":"IF(ISBLANK(VLOOKUP(E1569,INVENTORYDATA,13,FALSE)),\"X\",\"\")","v":""},null,{"$f":"IF(ISBLANK(VLOOKUP(E1569,INVENTORYDATA,13,FALSE)),\"\",VLOOKUP(E1569,INVENTORYDATA,13,FALSE))","v":{"$error":"#N/A"}},null,"Hard Drive Removed",null,{"$f":"IF(ISBLANK(VLOOKUP(K1569,INVENTORYDATA,13,FALSE)),\"X\",\"\")","v":""},null,{"$f":"IF(ISBLANK(VLOOKUP(K1569,INVENTORYDATA,13,FALSE)),\"\",VLOOKUP(K1569,INVENTORYDATA,13,FALSE))","v":{"$error":"#N/A"}}]
["Install Memory",null,"X",{"$nulls":3},"Install Memory",null,"X"]
["Power ON",null,"X",{"$nulls":3},"Power ON",null,"X"]
["Record BIOS info",null,"X",{"$nulls":3},"Record BIOS info",null,"X"]
["Check Optical Drive",null,{"$f":"IF((VLOOKUP(E1569,INVENTORYDATA,7,FALSE))=\"YES\",\"X\",\"\")","v":{"$error":"#N/A"}},{"$f":"IF((VLOOKUP(E1569,INVENTORYDATA,7,FALSE))=\"NO\",\"X\",\"\")","v":{"$error":"#N/A"}},null,null,"Check Optical Drive",null,{"$f":"IF((VLOOKUP(K1569,INVENTORYDATA,7,FALSE))=\"YES\",\"X\",\"\")","v":{"$error":"#N/A"}},{"$f":"IF((VLOOKUP(K1569,INVENTORYDATA,7,FALSE))=\"NO\",\"X\",\"\")","v":{"$error":"#N/A"}}]
["Power Off",null,"X",{"$nulls":3},"Power Off",null,"X"]
["HDD Serial No.",null,{"$f":"IF(ISBLANK(VLOOKUP(E1569,INVENTORYDATA,12,FALSE)),\"\",VLOOKUP(E1569,INVENTORYDATA,12,FALSE))","v":{"$error":"#N/A"}},{"$nulls":3},"HDD Serial No.",null,{"$f":"IF(ISBLANK(VLOOKUP(K1569,INVENTORYDATA,12,FALSE)),\"\",VLOOKUP(K1569,INVENTORYDATA,12,FALSE))","v":{"$error":"#N/A"}}]
[]
["Tested for key functions,R2/Ready for Resale",{"$nulls":5},"Tested for key functions,R2/Ready for Resale"]
["BIOS Lock","Caddy","Optical","WebCam","Battery",null,"BIOS Lock","Caddy","Optical","WebCam","Battery"]
[null,null,{"$f":"VLOOKUP(E1569,INVENTORY!$A$2:$N$100,7,FALSE)","v":{"$error":"#N/A"}},{"$f":"VLOOKUP(E1569,INVENTORY!$A$2:$N$100,8,FALSE)","v":{"$error":"#N/A"}},{"$f":"VLOOKUP(E1569,INVENTORY!$A$2:$N$100,9,FALSE)","v":{"$error":"#N/A"}},{"$nulls":3},{"$f":"VLOOKUP(K1569,INVENTORY!$A$2:$N$100,7,FALSE)","v":{"$error":"#N/A"}},{"$f":"VLOOKUP(K1569,INVENTORY!$A$2:$N$100,8,FALSE)","v":{"$error":"#N/A"}},{"$f":"VLOOKUP(K1569,INVENTORY!$A$2:$N$100,9,FALSE)","v":{"$error":"#N/A"}}]
[]
["CPU Cosmetics Defects:",null,{"$f":"\"Function Code: \"&VLOOKUP(E1569,INVENTORY!$A$2:$Q$100,14,FALSE)","v":{"$error":"#N/A"}},{"$nulls":3},"CPU Cosmetics Defects:",null,{"$f":"\"Function Code: \"&VLOOKUP(K1569,INVENTORY!$A$2:$Q$100,14,FALSE)","v":{"$error":"#N/A"}}]
[]
[null,null,{"$f":"\"Cosmetic Code: \"&VLOOKUP(E1569,INVENTORY!$A$2:$Q$100,15,FALSE)","v":{"$error":"#N/A"}},{"$nulls":5},{"$f":"\"Cosmetic Code: \"&VLOOKUP(K1569,INVENTORY!$A$2:$Q$100,15,FALSE)","v":{"$error":"#N/A"}}]
[]
["Casing","Plugs/Ports",{"$nulls":4},"Casing","Plugs/Ports"]
["Pass","Pass",{"$nulls":4},"Pass","Pass"]
["Fail","Fail",null,"TRRC#:L.T.R.",null,null,"Fail","Fail",null,"TRRC#:L.T.R."]
[]
["LAPTOP TESTING RECORD",{"$nulls":5},"LAPTOP TESTING RECORD"]
[]
[{"$nulls":3},"ITEM #",{"$f":"E1569+2","v":111},{"$nulls":4},"ITEM #",{"$f":"K1569+2","v":112}]
["Tester: ","RR","Date:",{"$f":"NOW()","v":"2025-12-15T11:00:59.760"},null,null,"Tester: ","RR","Date:",{"$f":"NOW()","v":"2025-12-15T11:00:59.760"}]
["Type: ","LAPTOP","SN:",{"$f":"VLOOKUP(E1598,INVENTORYDATA,10,FALSE)","v":{"$error":"#N/A"}},null,null,"Type: ","LAPTOP","SN:",{"$f":"VLOOKUP(K1598,INVENTORYDATA,10,FALSE)","v":{"$error":"#N/A"}}]
[{"$f":"\"Make: \"","v":"Make: "},{"$f":"VLOOKUP(E1598,INVENTORYDATA,2,FALSE)","v":{"$error":"#N/A"}},{"$f":"\"Model: \"","v":"Model: "},{"$f":"VLOOKUP(E1598,INVENTORYDATA,3,FALSE)","v":{"$error":"#N/A"}},null,null,{"$f":"\"Make: \"","v":"Make: "},{"$f":"VLOOKUP(K1598,INVENTORYDATA,2,FALSE)","v":{"$error":"#N/A"}},{"$f":"\"Model: \"","v":"Model: "},{"$f":"VLOOKUP(K1598,INVENTORYDATA,3,FALSE)","v":{"$error":"#N/A"}}]
[{"$f":"\"CPU/Speed: \"","v":"CPU/Speed: "},{"$f":"VLOOKUP(E1598,INVENTORYDATA,4,FALSE)&\" / \"&VLOOKUP(E1598,INVENTORYDATA,5,FALSE)&\"GHz\"","v":{"$error":"#N/A"}},null,{"$f":"\"Memory: \"","v":"Memory: "},{"$f":"VLOOKUP(E1598,INVENTORYDATA,6,FALSE)","v":{"$error":"#N/A"}},null,{"$f":"\"CPU/Speed: \"","v":"CPU/Speed: "},{"$f":"VLOOKUP(K1598,INVENTORYDATA,4,FALSE)&\" / \"&VLOOKUP(K1598,INVENTORYDATA,5,FALSE)&\"GHz\"","v":{"$error":"#N/A"}},null,{"$f":"\"Memory: \"","v":"Memory: "},{"$f":"VLOOKUP(K1598,INVENTORYDATA,6,FALSE)","v":{"$error":"#N/A"}}]
[]
["Key Function",null,"Pass","Fail ","Comments",null,"Key Function",null,"Pass","Fail ","Comments"]
["Hard Drive Removed",null,{"$f":"IF(ISBLANK(VLOOKUP(E1598,INVENTORYDATA,13,FALSE)),\"X\",\"\")","v":""},null,{"$f":"IF(ISBLANK(VLOOKUP(E1598,INVENTORYDATA,13,FALSE)),\"\",VLOOKUP(E1598,INVENTORYDATA,13,FALSE))","v":{"$error":"#N/A"}},null,"Hard Drive Removed",null,{"$f":"IF(ISBLANK(VLOOKUP(K1598,INVENTORYDATA,13,FALSE)),\"X\",\"\")","v":""},null,{"$f":"IF(ISBLANK(VLOOKUP(K1598,INVENTORYDATA,13,FALSE)),\"\",VLOOKUP(K1598,INVENTORYDATA,13,FALSE))","v":{"$error":"#N/A"}}]
["Install Memory",null,"X",{"$nulls":3},"Install Memory",null,"X"]
["Power ON",null,"X",{"$nulls":3},"Power ON",null,"X"]
["Record BIOS info",null,"X",{"$nulls":3},"Record BIOS info",null,"X"]
["Check Optical Drive",null,{"$f":"IF((VLOOKUP(E1598,INVENTORYDATA,7,FALSE))=\"YES\",\"X\",\"\")","v":{"$error":"#N/A"}},{"$f":"IF((VLOOKUP(E1598,INVENTORYDATA,7,FALSE))=\"NO\",\"X\",\"\")","v":{"$error":"#N/A"}},null,null,"Check Optical Drive",null,{"$f":"IF((VLOOKUP(K1598,INVENTORYDATA,7,FALSE))=\"YES\",\"X\",\"\")","v":{"$error":"#N/A"}},{"$f":"IF((VLOOKUP(K1598,INVENTORYDATA,7,FALSE))=\"NO\",\"X\",\"\")","v":{"$error":"#N/A"}}]
["Power Off",null,"X",{"$nulls":3},"Power Off",null,"X"]
["HDD Serial No.",null,{"$f":"IF(ISBLANK(VLOOKUP(E1598,INVENTORYDATA,12,FALSE)),\"\",VLOOKUP(E1598,INVENTORYDATA,12,FALSE))","v":{"$error":"#N/A"}},{"$nulls":3},"HDD Serial No.",null,{"$f":"IF(ISBLANK(VLOOKUP(K1598,INVENTORYDATA,12,FALSE)),\"\",VLOOKUP(K1598,INVENTORYDATA,12,FALSE))","v":{"$error":"#N/A"}}]
[]
["Tested for key functions,R2/Ready for Resale",{"$nulls":5},"Tested for key functions,R2/Ready for Resale"]
["BIOS Lock","Caddy","Optical","WebCam","Battery",null,"BIOS Lock","Caddy","Optical","WebCam","Battery"]
[null,null,{"$f":"VLOOKUP(E1598,INVENTORY!$A$2:$N$100,7,FALSE)","v":{"$error":"#N/A"}},{"$f":"VLOOKUP(E1598,INVENTORY!$A$2:$N$100,8,FALSE)","v":{"$error":"#N/A"}},{"$f":"VLOOKUP(E1598,INVENTORY!$A$2:$N$100,9,FALSE)","v":{"$error":"#N/A"}},{"$nulls":3},{"$f":"VLOOKUP(K1598,INVENTORY!$A$2:$N$100,7,FALSE)","v":{"$error":"#N/A"}},{"$f":"VLOOKUP(K1598,INVENTORY!$A$2:$N$100,8,FALSE)","v":{"$error":"#N/A"}},{"$f":"VLOOKUP(K1598,INVENTORY!$A$2:$N$100,9,FALSE)","v":{"$error":"#N/A"}}]
[]
["CPU Cosmetics Defects:",null,{"$f":"\"Function Code: \"&VLOOKUP(E1598,INVENTORY!$A$2:$Q$100,14,FALSE)","v":{"$error":"#N/A"}},{"$nulls":3},"CPU Cosmetics Defects:",null,{"$f":"\"Function Code: \"&VLOOKUP(K1598,INVENTORY!$A$2:$Q$100,14,FALSE)","v":{"$error":"#N/A"}}]
[]
[null,null,{"$f":"\"Cosmetic Code: \"&VLOOKUP(E1598,INVENTORY!$A$2:$Q$100,15,FALSE)","v":{"$error":"#N/A"}},{"$nulls":5},{"$f":"\"Cosmetic Code: \"&VLOOKUP(K1598,INVENTORY!$A$2:$Q$100,15,FALSE)","v":{"$error":"#N/A"}}]
[]
["Casing","Plugs/Ports",{"$nulls":4},"Casing","Plugs/Ports"]
["Pass","Pass",{"$nulls":4},"Pass","Pass"]
["Fail","Fail",null,"TRRC#:L.T.R.",null,null,"Fail","Fail",null,"TRRC#:L.T.R."]
[]
["LAPTOP TESTING RECORD",{"$nulls":5},"LAPTOP TESTING RECORD"]
[]
[{"$nulls":3},"ITEM #",{"$f":"E1598+2","v":113},{"$nulls":4},"ITEM #",{"$f":"K1598+2","v":114}]
["Tester: ","RR","Date:",{"$f":"NOW()","v":"2025-12-15T11:00:59.760"},null,null,"Tester: ","RR","Date:",{"$f":"NOW()","v":"2025-12-15T11:00:59.760"}]
["Type: ","LAPTOP","SN:",{"$f":"VLOOKUP(E1627,INVENTORYDATA,10,FALSE)","v":{"$error":"#N/A"}},null,null,"Type: ","LAPTOP","SN:",{"$f":"VLOOKUP(K1627,INVENTORYDATA,10,FALSE)","v":{"$error":"#N/A"}}]
[{"$f":"\"Make: \"","v":"Make: "},{"$f":"VLOOKUP(E1627,INVENTORYDATA,2,FALSE)","v":{"$error":"#N/A"}},{"$f":"\"Model: \"","v":"Model: "},{"$f":"VLOOKUP(E1627,INVENTORYDATA,3,FALSE)","v":{"$error":"#N/A"}},null,null,{"$f":"\"Make: \"","v":"Make: "},{"$f":"VLOOKUP(K1627,INVENTORYDATA,2,FALSE)","v":{"$error":"#N/A"}},{"$f":"\"Model: \"","v":"Model: "},{"$f":"VLOOKUP(K1627,INVENTORYDATA,3,FALSE)","v":{"$error":"#N/A"}}]
[{"$f":"\"CPU/Speed: \"","v":"CPU/Speed: "},{"$f":"VLOOKUP(E1627,INVENTORYDATA,4,FALSE)&\" / \"&VLOOKUP(E1627,INVENTORYDATA,5,FALSE)&\"GHz\"","v":{"$error":"#N/A"}},null,{"$f":"\"Memory: \"","v":"Memory: "},{"$f":"VLOOKUP(E1627,INVENTORYDATA,6,FALSE)","v":{"$error":"#N/A"}},null,{"$f":"\"CPU/Speed: \"","v":"CPU/Speed: "},{"$f":"VLOOKUP(K1627,INVENTORYDATA,4,FALSE)&\" / \"&VLOOKUP(K1627,INVENTORYDATA,5,FALSE)&\"GHz\"","v":{"$error":"#N/A"}},null,{"$f":"\"Memory: \"","v":"Memory: "},{"$f":"VLOOKUP(K1627,INVENTORYDATA,6,FALSE)","v":{"$error":"#N/A"}}]
[]
["Key Function",null,"Pass","Fail ","Comments",null,"Key Function",null,"Pass","Fail ","Comments"]
["Hard Drive Removed",null,{"$f":"IF(ISBLANK(VLOOKUP(E1627,INVENTORYDATA,13,FALSE)),\"X\",\"\")","v":""},null,{"$f":"IF(ISBLANK(VLOOKUP(E1627,INVENTORYDATA,13,FALSE)),\"\",VLOOKUP(E1627,INVENTORYDATA,13,FALSE))","v":{"$error":"#N/A"}},null,"Hard Drive Removed",null,{"$f":"IF(ISBLANK(VLOOKUP(K1627,INVENTORYDATA,13,FALSE)),\"X\",\"\")","v":""},null,{"$f":"IF(ISBLANK(VLOOKUP(K1627,INVENTORYDATA,13,FALSE)),\"\",VLOOKUP(K1627,INVENTORYDATA,13,FALSE))","v":{"$error":"#N/A"}}]
["Install Memory",null,"X",{"$nulls":3},"Install Memory",null,"X"]
["Power ON",null,"X",{"$nulls":3},"Power ON",null,"X"]
["Record BIOS info",null,"X",{"$nulls":3},"Record BIOS info",null,"X"]
["Check Optical Drive",null,{"$f":"IF((VLOOKUP(E1627,INVENTORYDATA,7,FALSE))=\"YES\",\"X\",\"\")","v":{"$error":"#N/A"}},{"$f":"IF((VLOOKUP(E1627,INVENTORYDATA,7,FALSE))=\"NO\",\"X\",\"\")","v":{"$error":"#N/A"}},null,null,"Check Optical Drive",null,{"$f":"IF((VLOOKUP(K1627,INVENTORYDATA,7,FALSE))=\"YES\",\"X\",\"\")","v":{"$error":"#N/A"}},{"$f":"IF((VLOOKUP(K1627,INVENTORYDATA,7,FALSE))=\"NO\",\"X\",\"\")","v":{"$error":"#N/A"}}]
["Power Off",null,"X",{"$nulls":3},"Power Off",null,"X"]
["HDD Serial No.",null,{"$f":"IF(ISBLANK(VLOOKUP(E1627,INVENTORYDATA,12,FALSE)),\"\",VLOOKUP(E1627,INVENTORYDATA,12,FALSE))","v":{"$error":"#N/A"}},{"$nulls":3},"HDD Serial No.",null,{"$f":"IF(ISBLANK(VLOOKUP(K1627,INVENTORYDATA,12,FALSE)),\"\",VLOOKUP(K1627,INVENTORYDATA,12,FALSE))","v":{"$error":"#N/A"}}]
[]
["Tested for key functions,R2/Ready for Resale",{"$nulls":5},"Tested for key functions,R2/Ready for Resale"]
["BIOS Lock","Caddy","Optical","WebCam","Battery",null,"BIOS Lock","Caddy","Optical","WebCam","Battery"]
[null,null,{"$f":"VLOOKUP(E1627,INVENTORY!$A$2:$N$100,7,FALSE)","v":{"$error":"#N/A"}},{"$f":"VLOOKUP(E1627,INVENTORY!$A$2:$N$100,8,FALSE)","v":{"$error":"#N/A"}},{"$f":"VLOOKUP(E1627,INVENTORY!$A$2:$N$100,9,FALSE)","v":{"$error":"#N/A"}},{"$nulls":3},{"$f":"VLOOKUP(K1627,INVENTORY!$A$2:$N$100,7,FALSE)","v":{"$error":"#N/A"}},{"$f":"VLOOKUP(K1627,INVENTORY!$A$2:$N$100,8,FALSE)","v":{"$error":"#N/A"}},{"$f":"VLOOKUP(K1627,INVENTORY!$A$2:$N$100,9,FALSE)","v":{"$error":"#N/A"}}]
[]
["CPU Cosmetics Defects:",null,{"$f":"\"Function Code: \"&VLOOKUP(E1627,INVENTORY!$A$2:$Q$100,14,FALSE)","v":{"$error":"#N/A"}},{"$nulls":3},"CPU Cosmetics Defects:",null,{"$f":"\"Function Code: \"&VLOOKUP(K1627,INVENTORY!$A$2:$Q$100,14,FALSE)","v":{"$error":"#N/A"}}]
[]
[null,null,{"$f":"\"Cosmetic Code: \"&VLOOKUP(E1627,INVENTORY!$A$2:$Q$100,15,FALSE)","v":{"$error":"#N/A"}},{"$nulls":5},{"$f":"\"Cosmetic Code: \"&VLOOKUP(K1627,INVENTORY!$A$2:$Q$100,15,FALSE)","v":{"$error":"#N/A"}}]
[]
["Casing","Plugs/Ports",{"$nulls":4},"Casing","Plugs/Ports"]
["Pass","Pass",{"$nulls":4},"Pass","Pass"]
["Fail","Fail",null,"TRRC#:L.T.R.",null,null,"Fail","Fail",null,"TRRC#:L.T.R."]
[]
["LAPTOP TESTING RECORD",{"$nulls":5},"LAPTOP TESTING RECORD"]
[]
[{"$nulls":3},"ITEM #",{"$f":"E1627+2","v":115},{"$nulls":4},"ITEM #",{"$f":"K1627+2","v":116}]
["Tester: ","RR","Date:",{"$f":"NOW()","v":"2025-12-15T11:00:59.760"},null,null,"Tester: ","RR","Date:",{"$f":"NOW()","v":"2025-12-15T11:00:59.760"}]
["Type: ","LAPTOP","SN:",{"$f":"VLOOKUP(E1656,INVENTORYDATA,10,FALSE)","v":{"$error":"#N/A"}},null,null,"Type: ","LAPTOP","SN:",{"$f":"VLOOKUP(K1656,INVENTORYDATA,10,FALSE)","v":{"$error":"#N/A"}}]
[{"$f":"\"Make: \"","v":"Make: "},{"$f":"VLOOKUP(E1656,INVENTORYDATA,2,FALSE)","v":{"$error":"#N/A"}},{"$f":"\"Model: \"","v":"Model: "},{"$f":"VLOOKUP(E1656,INVENTORYDATA,3,FALSE)","v":{"$error":"#N/A"}},null,null,{"$f":"\"Make: \"","v":"Make: "},{"$f":"VLOOKUP(K1656,INVENTORYDATA,2,FALSE)","v":{"$error":"#N/A"}},{"$f":"\"Model: \"","v":"Model: "},{"$f":"VLOOKUP(K1656,INVENTORYDATA,3,FALSE)","v":{"$error":"#N/A"}}]
[{"$f":"\"CPU/Speed: \"","v":"CPU/Speed: "},{"$f":"VLOOKUP(E1656,INVENTORYDATA,4,FALSE)&\" / \"&VLOOKUP(E1656,INVENTORYDATA,5,FALSE)&\"GHz\"","v":{"$error":"#N/A"}},null,{"$f":"\"Memory: \"","v":"Memory: "},{"$f":"VLOOKUP(E1656,INVENTORYDATA,6,FALSE)","v":{"$error":"#N/A"}},null,{"$f":"\"CPU/Speed: \"","v":"CPU/Speed: "},{"$f":"VLOOKUP(K1656,INVENTORYDATA,4,FALSE)&\" / \"&VLOOKUP(K1656,INVENTORYDATA,5,FALSE)&\"GHz\"","v":{"$error":"#N/A"}},null,{"$f":"\"Memory: \"","v":"Memory: "},{"$f":"VLOOKUP(K1656,INVENTORYDATA,6,FALSE)","v":{"$error":"#N/A"}}]
[]
["Key Function",null,"Pass","Fail ","Comments",null,"Key Function",null,"Pass","Fail ","Comments"]
["Hard Drive Removed",null,{"$f":"IF(ISBLANK(VLOOKUP(E1656,INVENTORYDATA,13,FALSE)),\"X\",\"\")","v":""},null,{"$f":"IF(ISBLANK(VLOOKUP(E1656,INVENTORYDATA,13,FALSE)),\"\",VLOOKUP(E1656,INVENTORYDATA,13,FALSE))","v":{"$error":"#N/A"}},null,"Hard Drive Removed",null,{"$f":"IF(ISBLANK(VLOOKUP(K1656,INVENTORYDATA,13,FALSE)),\"X\",\"\")","v":""},null,{"$f":"IF(ISBLANK(VLOOKUP(K1656,INVENTORYDATA,13,FALSE)),\"\",VLOOKUP(K1656,INVENTORYDATA,13,FALSE))","v":{"$error":"#N/A"}}]
["Install Memory",null,"X",{"$nulls":3},"Install Memory",null,"X"]
["Power ON",null,"X",{"$nulls":3},"Power ON",null,"X"]
["Record BIOS info",null,"X",{"$nulls":3},"Record BIOS info",null,"X"]
["Check Optical Drive",null,{"$f":"IF((VLOOKUP(E1656,INVENTORYDATA,7,FALSE))=\"YES\",\"X\",\"\")","v":{"$error":"#N/A"}},{"$f":"IF((VLOOKUP(E1656,INVENTORYDATA,7,FALSE))=\"NO\",\"X\",\"\")","v":{"$error":"#N/A"}},null,null,"Check Optical Drive",null,{"$f":"IF((VLOOKUP(K1656,INVENTORYDATA,7,FALSE))=\"YES\",\"X\",\"\")","v":{"$error":"#N/A"}},{"$f":"IF((VLOOKUP(K1656,INVENTORYDATA,7,FALSE))=\"NO\",\"X\",\"\")","v":{"$error":"#N/A"}}]
["Power Off",null,"X",{"$nulls":3},"Power Off",null,"X"]
["HDD Serial No.",null,{"$f":"IF(ISBLANK(VLOOKUP(E1656,INVENTORYDATA,12,FALSE)),\"\",VLOOKUP(E1656,INVENTORYDATA,12,FALSE))","v":{"$error":"#N/A"}},{"$nulls":3},"HDD Serial No.",null,{"$f":"IF(ISBLANK(VLOOKUP(K1656,INVENTORYDATA,12,FALSE)),\"\",VLOOKUP(K1656,INVENTORYDATA,12,FALSE))","v":{"$error":"#N/A"}}]
[]
["Tested for key functions,R2/Ready for Resale",{"$nulls":5},"Tested for key functions,R2/Ready for Resale"]
["BIOS Lock","Caddy","Optical","WebCam","Battery",null,"BIOS Lock","Caddy","Optical","WebCam","Battery"]
[null,null,{"$f":"VLOOKUP(E1656,INVENTORY!$A$2:$N$100,7,FALSE)","v":{"$error":"#N/A"}},{"$f":"VLOOKUP(E1656,INVENTORY!$A$2:$N$100,8,FALSE)","v":{"$error":"#N/A"}},{"$f":"VLOOKUP(E1656,INVENTORY!$A$2:$N$100,9,FALSE)","v":{"$error":"#N/A"}},{"$nulls":3},{"$f":"VLOOKUP(K1656,INVENTORY!$A$2:$N$100,7,FALSE)","v":{"$error":"#N/A"}},{"$f":"VLOOKUP(K1656,INVENTORY!$A$2:$N$100,8,FALSE)","v":{"$error":"#N/A"}},{"$f":"VLOOKUP(K1656,INVENTORY!$A$2:$N$100,9,FALSE)","v":{"$error":"#N/A"}}]
[]
["CPU Cosmetics Defects:",null,{"$f":"\"Function Code: \"&VLOOKUP(E1656,INVENTORY!$A$2:$Q$100,14,FALSE)","v":{"$error":"#N/A"}},{"$nulls":3},"CPU Cosmetics Defects:",null,{"$f":"\"Function Code: \"&VLOOKUP(K1656,INVENTORY!$A$2:$Q$100,14,FALSE)","v":{"$error":"#N/A"}}]
[]
[null,null,{"$f":"\"Cosmetic Code: \"&VLOOKUP(E1656,INVENTORY!$A$2:$Q$100,15,FALSE)","v":{"$error":"#N/A"}},{"$nulls":5},{"$f":"\"Cosmetic Code: \"&VLOOKUP(K1656,INVENTORY!$A$2:$Q$100,15,FALSE)","v":{"$error":"#N/A"}}]
[]
["Casing","Plugs/Ports",{"$nulls":4},"Casing","Plugs/Ports"]
["Pass","Pass",{"$nulls":4},"Pass","Pass"]
["Fail","Fail",null,"TRRC#:L.T.R.",null,null,"Fail","Fail",null,"TRRC#:L.T.R."]
[]
["LAPTOP TESTING RECORD",{"$nulls":5},"LAPTOP TESTING RECORD"]
[]
[{"$nulls":3},"ITEM #",{"$f":"E1656+2","v":117},{"$nulls":4},"ITEM #",{"$f":"K1656+2","v":118}]
["Tester: ","RR","Date:",{"$f":"NOW()","v":"2025-12-15T11:00:59.760"},null,null,"Tester: ","RR","Date:",{"$f":"NOW()","v":"2025-12-15T11:00:59.760"}]
["Type: ","LAPTOP","SN:",{"$f":"VLOOKUP(E1685,INVENTORYDATA,10,FALSE)","v":{"$error":"#N/A"}},null,null,"Type: ","LAPTOP","SN:",{"$f":"VLOOKUP(K1685,INVENTORYDATA,10,FALSE)","v":{"$error":"#N/A"}}]
[{"$f":"\"Make: \"","v":"Make: "},{"$f":"VLOOKUP(E1685,INVENTORYDATA,2,FALSE)","v":{"$error":"#N/A"}},{"$f":"\"Model: \"","v":"Model: "},{"$f":"VLOOKUP(E1685,INVENTORYDATA,3,FALSE)","v":{"$error":"#N/A"}},null,null,{"$f":"\"Make: \"","v":"Make: "},{"$f":"VLOOKUP(K1685,INVENTORYDATA,2,FALSE)","v":{"$error":"#N/A"}},{"$f":"\"Model: \"","v":"Model: "},{"$f":"VLOOKUP(K1685,INVENTORYDATA,3,FALSE)","v":{"$error":"#N/A"}}]
[{"$f":"\"CPU/Speed: \"","v":"CPU/Speed: "},{"$f":"VLOOKUP(E1685,INVENTORYDATA,4,FALSE)&\" / \"&VLOOKUP(E1685,INVENTORYDATA,5,FALSE)&\"GHz\"","v":{"$error":"#N/A"}},null,{"$f":"\"Memory: \"","v":"Memory: "},{"$f":"VLOOKUP(E1685,INVENTORYDATA,6,FALSE)","v":{"$error":"#N/A"}},null,{"$f":"\"CPU/Speed: \"","v":"CPU/Speed: "},{"$f":"VLOOKUP(K1685,INVENTORYDATA,4,FALSE)&\" / \"&VLOOKUP(K1685,INVENTORYDATA,5,FALSE)&\"GHz\"","v":{"$error":"#N/A"}},null,{"$f":"\"Memory: \"","v":"Memory: "},{"$f":"VLOOKUP(K1685,INVENTORYDATA,6,FALSE)","v":{"$error":"#N/A"}}]
[]
["Key Function",null,"Pass","Fail ","Comments",null,"Key Function",null,"Pass","Fail ","Comments"]
["Hard Drive Removed",null,{"$f":"IF(ISBLANK(VLOOKUP(E1685,INVENTORYDATA,13,FALSE)),\"X\",\"\")","v":""},null,{"$f":"IF(ISBLANK(VLOOKUP(E1685,INVENTORYDATA,13,FALSE)),\"\",VLOOKUP(E1685,INVENTORYDATA,13,FALSE))","v":{"$error":"#N/A"}},null,"Hard Drive Removed",null,{"$f":"IF(ISBLANK(VLOOKUP(K1685,INVENTORYDATA,13,FALSE)),\"X\",\"\")","v":""},null,{"$f":"IF(ISBLANK(VLOOKUP(K1685,INVENTORYDATA,13,FALSE)),\"\",VLOOKUP(K1685,INVENTORYDATA,13,FALSE))","v":{"$error":"#N/A"}}]
["Install Memory",null,"X",{"$nulls":3},"Install Memory",null,"X"]
["Power ON",null,"X",{"$nulls":3},"Power ON",null,"X"]
["Record BIOS info",null,"X",{"$nulls":3},"Record BIOS info",null,"X"]
["Check Optical Drive",null,{"$f":"IF((VLOOKUP(E1685,INVENTORYDATA,7,FALSE))=\"YES\",\"X\",\"\")","v":{"$error":"#N/A"}},{"$f":"IF((VLOOKUP(E1685,INVENTORYDATA,7,FALSE))=\"NO\",\"X\",\"\")","v":{"$error":"#N/A"}},null,null,"Check Optical Drive",null,{"$f":"IF((VLOOKUP(K1685,INVENTORYDATA,7,FALSE))=\"YES\",\"X\",\"\")","v":{"$error":"#N/A"}},{"$f":"IF((VLOOKUP(K1685,INVENTORYDATA,7,FALSE))=\"NO\",\"X\",\"\")","v":{"$error":"#N/A"}}]
["Power Off",null,"X",{"$nulls":3},"Power Off",null,"X"]
["HDD Serial No.",null,{"$f":"IF(ISBLANK(VLOOKUP(E1685,INVENTORYDATA,12,FALSE)),\"\",VLOOKUP(E1685,INVENTORYDATA,12,FALSE))","v":{"$error":"#N/A"}},{"$nulls":3},"HDD Serial No.",null,{"$f":"IF(ISBLANK(VLOOKUP(K1685,INVENTORYDATA,12,FALSE)),\"\",VLOOKUP(K1685,INVENTORYDATA,12,FALSE))","v":{"$error":"#N/A"}}]
[]
["Tested for key functions,R2/Ready for Resale",{"$nulls":5},"Tested for key functions,R2/Ready for Resale"]
["BIOS Lock","Caddy","Optical","WebCam","Battery",null,"BIOS Lock","Caddy","Optical","WebCam","Battery"]
[null,null,{"$f":"VLOOKUP(E1685,INVENTORY!$A$2:$N$100,7,FALSE)","v":{"$error":"#N/A"}},{"$f":"VLOOKUP(E1685,INVENTORY!$A$2:$N$100,8,FALSE)","v":{"$error":"#N/A"}},{"$f":"VLOOKUP(E1685,INVENTORY!$A$2:$N$100,9,FALSE)","v":{"$error":"#N/A"}},{"$nulls":3},{"$f":"VLOOKUP(K1685,INVENTORY!$A$2:$N$100,7,FALSE)","v":{"$error":"#N/A"}},{"$f":"VLOOKUP(K1685,INVENTORY!$A$2:$N$100,8,FALSE)","v":{"$error":"#N/A"}},{"$f":"VLOOKUP(K1685,INVENTORY!$A$2:$N$100,9,FALSE)","v":{"$error":"#N/A"}}]
[]
["CPU Cosmetics Defects:",null,{"$f":"\"Function Code: \"&VLOOKUP(E1685,INVENTORY!$A$2:$Q$100,14,FALSE)","v":{"$error":"#N/A"}},{"$nulls":3},"CPU Cosmetics Defects:",null,{"$f":"\"Function Code: \"&VLOOKUP(K1685,INVENTORY!$A$2:$Q$100,14,FALSE)","v":{"$error":"#N/A"}}]
[]
[null,null,{"$f":"\"Cosmetic Code: \"&VLOOKUP(E1685,INVENTORY!$A$2:$Q$100,15,FALSE)","v":{"$error":"#N/A"}},{"$nulls":5},{"$f":"\"Cosmetic Code: \"&VLOOKUP(K1685,INVENTORY!$A$2:$Q$100,15,FALSE)","v":{"$error":"#N/A"}}]
[]
["Casing","Plugs/Ports",{"$nulls":4},"Casing","Plugs/Ports"]
["Pass","Pass",{"$nulls":4},"Pass","Pass"]
["Fail","Fail",null,"TRRC#:L.T.R.",null,null,"Fail","Fail",null,"TRRC#:L.T.R."]
[]
["LAPTOP TESTING RECORD",{"$nulls":5},"LAPTOP TESTING RECORD"]
[]
[{"$nulls":3},"ITEM #",{"$f":"E1685+2","v":119},{"$nulls":4},"ITEM #",{"$f":"K1685+2","v":120}]
["Tester: ","RR","Date:",{"$f":"NOW()","v":"2025-12-15T11:00:59.760"},null,null,"Tester: ","RR","Date:",{"$f":"NOW()","v":"2025-12-15T11:00:59.760"}]
["Type: ","LAPTOP","SN:",{"$f":"VLOOKUP(E1714,INVENTORYDATA,10,FALSE)","v":{"$error":"#N/A"}},null,null,"Type: ","LAPTOP","SN:",{"$f":"VLOOKUP(K1714,INVENTORYDATA,10,FALSE)","v":{"$error":"#N/A"}}]
[{"$f":"\"Make: \"","v":"Make: "},{"$f":"VLOOKUP(E1714,INVENTORYDATA,2,FALSE)","v":{"$error":"#N/A"}},{"$f":"\"Model: \"","v":"Model: "},{"$f":"VLOOKUP(E1714,INVENTORYDATA,3,FALSE)","v":{"$error":"#N/A"}},null,null,{"$f":"\"Make: \"","v":"Make: "},{"$f":"VLOOKUP(K1714,INVENTORYDATA,2,FALSE)","v":{"$error":"#N/A"}},{"$f":"\"Model: \"","v":"Model: "},{"$f":"VLOOKUP(K1714,INVENTORYDATA,3,FALSE)","v":{"$error":"#N/A"}}]
[{"$f":"\"CPU/Speed: \"","v":"CPU/Speed: "},{"$f":"VLOOKUP(E1714,INVENTORYDATA,4,FALSE)&\" / \"&VLOOKUP(E1714,INVENTORYDATA,5,FALSE)&\"GHz\"","v":{"$error":"#N/A"}},null,{"$f":"\"Memory: \"","v":"Memory: "},{"$f":"VLOOKUP(E1714,INVENTORYDATA,6,FALSE)","v":{"$error":"#N/A"}},null,{"$f":"\"CPU/Speed: \"","v":"CPU/Speed: "},{"$f":"VLOOKUP(K1714,INVENTORYDATA,4,FALSE)&\" / \"&VLOOKUP(K1714,INVENTORYDATA,5,FALSE)&\"GHz\"","v":{"$error":"#N/A"}},null,{"$f":"\"Memory: \"","v":"Memory: "},{"$f":"VLOOKUP(K1714,INVENTORYDATA,6,FALSE)","v":{"$error":"#N/A"}}]
[]
["Key Function",null,"Pass","Fail ","Comments",null,"Key Function",null,"Pass","Fail ","Comments"]
["Hard Drive Removed",null,{"$f":"IF(ISBLANK(VLOOKUP(E1714,INVENTORYDATA,13,FALSE)),\"X\",\"\")","v":""},null,{"$f":"IF(ISBLANK(VLOOKUP(E1714,INVENTORYDATA,13,FALSE)),\"\",VLOOKUP(E1714,INVENTORYDATA,13,FALSE))","v":{"$error":"#N/A"}},null,"Hard Drive Removed",null,{"$f":"IF(ISBLANK(VLOOKUP(K1714,INVENTORYDATA,13,FALSE)),\"X\",\"\")","v":""},null,{"$f":"IF(ISBLANK(VLOOKUP(K1714,INVENTORYDATA,13,FALSE)),\"\",VLOOKUP(K1714,INVENTORYDATA,13,FALSE))","v":{"$error":"#N/A"}}]
["Install Memory",null,"X",{"$nulls":3},"Install Memory",null,"X"]
["Power ON",null,"X",{"$nulls":3},"Power ON",null,"X"]
["Record BIOS info",null,"X",{"$nulls":3},"Record BIOS info",null,"X"]
["Check Optical Drive",null,{"$f":"IF((VLOOKUP(E1714,INVENTORYDATA,7,FALSE))=\"YES\",\"X\",\"\")","v":{"$error":"#N/A"}},{"$f":"IF((VLOOKUP(E1714,INVENTORYDATA,7,FALSE))=\"NO\",\"X\",\"\")","v":{"$error":"#N/A"}},null,null,"Check Optical Drive",null,{"$f":"IF((VLOOKUP(K1714,INVENTORYDATA,7,FALSE))=\"YES\",\"X\",\"\")","v":{"$error":"#N/A"}},{"$f":"IF((VLOOKUP(K1714,INVENTORYDATA,7,FALSE))=\"NO\",\"X\",\"\")","v":{"$error":"#N/A"}}]
["Power Off",null,"X",{"$nulls":3},"Power Off",null,"X"]
["HDD Serial No.",null,{"$f":"IF(ISBLANK(VLOOKUP(E1714,INVENTORYDATA,12,FALSE)),\"\",VLOOKUP(E1714,INVENTORYDATA,12,FALSE))","v":{"$error":"#N/A"}},{"$nulls":3},"HDD Serial No.",null,{"$f":"IF(ISBLANK(VLOOKUP(K1714,INVENTORYDATA,12,FALSE)),\"\",VLOOKUP(K1714,INVENTORYDATA,12,FALSE))","v":{"$error":"#N/A"}}]
[]
["Tested for key functions,R2/Ready for Resale",{"$nulls":5},"Tested for key functions,R2/Ready for Resale"]
["BIOS Lock","Caddy","Optical","WebCam","Battery",null,"BIOS Lock","Caddy","Optical","WebCam","Battery"]
[null,null,{"$f":"VLOOKUP(E1714,INVENTORY!$A$2:$N$100,7,FALSE)","v":{"$error":"#N/A"}},{"$f":"VLOOKUP(E1714,INVENTORY!$A$2:$N$100,8,FALSE)","v":{"$error":"#N/A"}},{"$f":"VLOOKUP(E1714,INVENTORY!$A$2:$N$100,9,FALSE)","v":{"$error":"#N/A"}},{"$nulls":3},{"$f":"VLOOKUP(K1714,INVENTORY!$A$2:$N$100,7,FALSE)","v":{"$error":"#N/A"}},{"$f":"VLOOKUP(K1714,INVENTORY!$A$2:$N$100,8,FALSE)","v":{"$error":"#N/A"}},{"$f":"VLOOKUP(K1714,INVENTORY!$A$2:$N$100,9,FALSE)","v":{"$error":"#N/A"}}]
[]
["CPU Cosmetics Defects:",null,{"$f":"\"Function Code: \"&VLOOKUP(E1714,INVENTORY!$A$2:$Q$100,14,FALSE)","v":{"$error":"#N/A"}},{"$nulls":3},"CPU Cosmetics Defects:",null,{"$f":"\"Function Code: \"&VLOOKUP(K1714,INVENTORY!$A$2:$Q$100,14,FALSE)","v":{"$error":"#N/A"}}]
[]
[null,null,{"$f":"\"Cosmetic Code: \"&VLOOKUP(E1714,INVENTORY!$A$2:$Q$100,15,FALSE)","v":{"$error":"#N/A"}},{"$nulls":5},{"$f":"\"Cosmetic Code: \"&VLOOKUP(K1714,INVENTORY!$A$2:$Q$100,15,FALSE)","v":{"$error":"#N/A"}}]
[]
["Casing","Plugs/Ports",{"$nulls":4},"Casing","Plugs/Ports"]
["Pass","Pass",{"$nulls":4},"Pass","Pass"]
["Fail","Fail",null,"TRRC#:L.T.R.",null,null,"Fail","Fail",null,"TRRC#:L.T.R."]
[]
["LAPTOP TESTING RECORD",{"$nulls":5},"LAPTOP TESTING RECORD"]
[]
[{"$nulls":3},"ITEM #",{"$f":"E1714+2","v":121},{"$nulls":4},"ITEM #",{"$f":"K1714+2","v":122}]
["Tester: ","RR","Date:",{"$f":"NOW()","v":"2025-12-15T11:00:59.760"},null,null,"Tester: ","RR","Date:",{"$f":"NOW()","v":"2025-12-15T11:00:59.760"}]
["Type: ","LAPTOP","SN:",{"$f":"VLOOKUP(E1743,INVENTORYDATA,10,FALSE)","v":{"$error":"#N/A"}},null,null,"Type: ","LAPTOP","SN:",{"$f":"VLOOKUP(K1743,INVENTORYDATA,10,FALSE)","v":{"$error":"#N/A"}}]
[{"$f":"\"Make: \"","v":"Make: "},{"$f":"VLOOKUP(E1743,INVENTORYDATA,2,FALSE)","v":{"$error":"#N/A"}},{"$f":"\"Model: \"","v":"Model: "},{"$f":"VLOOKUP(E1743,INVENTORYDATA,3,FALSE)","v":{"$error":"#N/A"}},null,null,{"$f":"\"Make: \"","v":"Make: "},{"$f":"VLOOKUP(K1743,INVENTORYDATA,2,FALSE)","v":{"$error":"#N/A"}},{"$f":"\"Model: \"","v":"Model: "},{"$f":"VLOOKUP(K1743,INVENTORYDATA,3,FALSE)","v":{"$error":"#N/A"}}]
[{"$f":"\"CPU/Speed: \"","v":"CPU/Speed: "},{"$f":"VLOOKUP(E1743,INVENTORYDATA,4,FALSE)&\" / \"&VLOOKUP(E1743,INVENTORYDATA,5,FALSE)&\"GHz\"","v":{"$error":"#N/A"}},null,{"$f":"\"Memory: \"","v":"Memory: "},{"$f":"VLOOKUP(E1743,INVENTORYDATA,6,FALSE)","v":{"$error":"#N/A"}},null,{"$f":"\"CPU/Speed: \"","v":"CPU/Speed: "},{"$f":"VLOOKUP(K1743,INVENTORYDATA,4,FALSE)&\" / \"&VLOOKUP(K1743,INVENTORYDATA,5,FALSE)&\"GHz\"","v":{"$error":"#N/A"}},null,{"$f":"\"Memory: \"","v":"Memory: "},{"$f":"VLOOKUP(K1743,INVENTORYDATA,6,FALSE)","v":{"$error":"#N/A"}}]
[]
["Key Function",null,"Pass","Fail ","Comments",null,"Key Function",null,"Pass","Fail ","Comments"]
["Hard Drive Removed",null,{"$f":"IF(ISBLANK(VLOOKUP(E1743,INVENTORYDATA,13,FALSE)),\"X\",\"\")","v":""},null,{"$f":"IF(ISBLANK(VLOOKUP(E1743,INVENTORYDATA,13,FALSE)),\"\",VLOOKUP(E1743,INVENTORYDATA,13,FALSE))","v":{"$error":"#N/A"}},null,"Hard Drive Removed",null,{"$f":"IF(ISBLANK(VLOOKUP(K1743,INVENTORYDATA,13,FALSE)),\"X\",\"\")","v":""},null,{"$f":"IF(ISBLANK(VLOOKUP(K1743,INVENTORYDATA,13,FALSE)),\"\",VLOOKUP(K1743,INVENTORYDATA,13,FALSE))","v":{"$error":"#N/A"}}]
["Install Memory",null,"X",{"$nulls":3},"Install Memory",null,"X"]
["Power ON",null,"X",{"$nulls":3},"Power ON",null,"X"]
["Record BIOS info",null,"X",{"$nulls":3},"Record BIOS info",null,"X"]
["Check Optical Drive",null,{"$f":"IF((VLOOKUP(E1743,INVENTORYDATA,7,FALSE))=\"YES\",\"X\",\"\")","v":{"$error":"#N/A"}},{"$f":"IF((VLOOKUP(E1743,INVENTORYDATA,7,FALSE))=\"NO\",\"X\",\"\")","v":{"$error":"#N/A"}},null,null,"Check Optical Drive",null,{"$f":"IF((VLOOKUP(K1743,INVENTORYDATA,7,FALSE))=\"YES\",\"X\",\"\")","v":{"$error":"#N/A"}},{"$f":"IF((VLOOKUP(K1743,INVENTORYDATA,7,FALSE))=\"NO\",\"X\",\"\")","v":{"$error":"#N/A"}}]
["Power Off",null,"X",{"$nulls":3},"Power Off",null,"X"]
["HDD Serial No.",null,{"$f":"IF(ISBLANK(VLOOKUP(E1743,INVENTORYDATA,12,FALSE)),\"\",VLOOKUP(E1743,INVENTORYDATA,12,FALSE))","v":{"$error":"#N/A"}},{"$nulls":3},"HDD Serial No.",null,{"$f":"IF(ISBLANK(VLOOKUP(K1743,INVENTORYDATA,12,FALSE)),\"\",VLOOKUP(K1743,INVENTORYDATA,12,FALSE))","v":{"$error":"#N/A"}}]
[]
["Tested for key functions,R2/Ready for Resale",{"$nulls":5},"Tested for key functions,R2/Ready for Resale"]
["BIOS Lock","Caddy","Optical","WebCam","Battery",null,"BIOS Lock","Caddy","Optical","WebCam","Battery"]
[null,null,{"$f":"VLOOKUP(E1743,INVENTORY!$A$2:$N$100,7,FALSE)","v":{"$error":"#N/A"}},{"$f":"VLOOKUP(E1743,INVENTORY!$A$2:$N$100,8,FALSE)","v":{"$error":"#N/A"}},{"$f":"VLOOKUP(E1743,INVENTORY!$A$2:$N$100,9,FALSE)","v":{"$error":"#N/A"}},{"$nulls":3},{"$f":"VLOOKUP(K1743,INVENTORY!$A$2:$N$100,7,FALSE)","v":{"$error":"#N/A"}},{"$f":"VLOOKUP(K1743,INVENTORY!$A$2:$N$100,8,FALSE)","v":{"$error":"#N/A"}},{"$f":"VLOOKUP(K1743,INVENTORY!$A$2:$N$100,9,FALSE)","v":{"$error":"#N/A"}}]
[]
["CPU Cosmetics Defects:",null,{"$f":"\"Function Code: \"&VLOOKUP(E1743,INVENTORY!$A$2:$Q$100,14,FALSE)","v":{"$error":"#N/A"}},{"$nulls":3},"CPU Cosmetics Defects:",null,{"$f":"\"Function Code: \"&VLOOKUP(K1743,INVENTORY!$A$2:$Q$100,14,FALSE)","v":{"$error":"#N/A"}}]
[]
[null,null,{"$f":"\"Cosmetic Code: \"&VLOOKUP(E1743,INVENTORY!$A$2:$Q$100,15,FALSE)","v":{"$error":"#N/A"}},{"$nulls":5},{"$f":"\"Cosmetic Code: \"&VLOOKUP(K1743,INVENTORY!$A$2:$Q$100,15,FALSE)","v":{"$error":"#N/A"}}]
[]
["Casing","Plugs/Ports",{"$nulls":4},"Casing","Plugs/Ports"]
["Pass","Pass",{"$nulls":4},"Pass","Pass"]
["Fail","Fail",null,"TRRC#:L.T.R.",null,null,"Fail","Fail",null,"TRRC#:L.T.R."]
[]
["LAPTOP TESTING RECORD",{"$nulls":5},"LAPTOP TESTING RECORD"]
[]
[{"$nulls":3},"ITEM #",{"$f":"E1743+2","v":123},{"$nulls":4},"ITEM #",{"$f":"K1743+2","v":124}]
["Tester: ","RR","Date:",{"$f":"NOW()","v":"2025-12-15T11:00:59.760"},null,null,"Tester: ","RR","Date:",{"$f":"NOW()","v":"2025-12-15T11:00:59.760"}]
["Type: ","LAPTOP","SN:",{"$f":"VLOOKUP(E1772,INVENTORYDATA,10,FALSE)","v":{"$error":"#N/A"}},null,null,"Type: ","LAPTOP","SN:",{"$f":"VLOOKUP(K1772,INVENTORYDATA,10,FALSE)","v":{"$error":"#N/A"}}]
[{"$f":"\"Make: \"","v":"Make: "},{"$f":"VLOOKUP(E1772,INVENTORYDATA,2,FALSE)","v":{"$error":"#N/A"}},{"$f":"\"Model: \"","v":"Model: "},{"$f":"VLOOKUP(E1772,INVENTORYDATA,3,FALSE)","v":{"$error":"#N/A"}},null,null,{"$f":"\"Make: \"","v":"Make: "},{"$f":"VLOOKUP(K1772,INVENTORYDATA,2,FALSE)","v":{"$error":"#N/A"}},{"$f":"\"Model: \"","v":"Model: "},{"$f":"VLOOKUP(K1772,INVENTORYDATA,3,FALSE)","v":{"$error":"#N/A"}}]
[{"$f":"\"CPU/Speed: \"","v":"CPU/Speed: "},{"$f":"VLOOKUP(E1772,INVENTORYDATA,4,FALSE)&\" / \"&VLOOKUP(E1772,INVENTORYDATA,5,FALSE)&\"GHz\"","v":{"$error":"#N/A"}},null,{"$f":"\"Memory: \"","v":"Memory: "},{"$f":"VLOOKUP(E1772,INVENTORYDATA,6,FALSE)","v":{"$error":"#N/A"}},null,{"$f":"\"CPU/Speed: \"","v":"CPU/Speed: "},{"$f":"VLOOKUP(K1772,INVENTORYDATA,4,FALSE)&\" / \"&VLOOKUP(K1772,INVENTORYDATA,5,FALSE)&\"GHz\"","v":{"$error":"#N/A"}},null,{"$f":"\"Memory: \"","v":"Memory: "},{"$f":"VLOOKUP(K1772,INVENTORYDATA,6,FALSE)","v":{"$error":"#N/A"}}]
[]
["Key Function",null,"Pass","Fail ","Comments",null,"Key Function",null,"Pass","Fail ","Comments"]
["Hard Drive Removed",null,{"$f":"IF(ISBLANK(VLOOKUP(E1772,INVENTORYDATA,13,FALSE)),\"X\",\"\")","v":""},null,{"$f":"IF(ISBLANK(VLOOKUP(E1772,INVENTORYDATA,13,FALSE)),\"\",VLOOKUP(E1772,INVENTORYDATA,13,FALSE))","v":{"$error":"#N/A"}},null,"Hard Drive Removed",null,{"$f":"IF(ISBLANK(VLOOKUP(K1772,INVENTORYDATA,13,FALSE)),\"X\",\"\")","v":""},null,{"$f":"IF(ISBLANK(VLOOKUP(K1772,INVENTORYDATA,13,FALSE)),\"\",VLOOKUP(K1772,INVENTORYDATA,13,FALSE))","v":{"$error":"#N/A"}}]
["Install Memory",null,"X",{"$nulls":3},"Install Memory",null,"X"]
["Power ON",null,"X",{"$nulls":3},"Power ON",null,"X"]
["Record BIOS info",null,"X",{"$nulls":3},"Record BIOS info",null,"X"]
["Check Optical Drive",null,{"$f":"IF((VLOOKUP(E1772,INVENTORYDATA,7,FALSE))=\"YES\",\"X\",\"\")","v":{"$error":"#N/A"}},{"$f":"IF((VLOOKUP(E1772,INVENTORYDATA,7,FALSE))=\"NO\",\"X\",\"\")","v":{"$error":"#N/A"}},null,null,"Check Optical Drive",null,{"$f":"IF((VLOOKUP(K1772,INVENTORYDATA,7,FALSE))=\"YES\",\"X\",\"\")","v":{"$error":"#N/A"}},{"$f":"IF((VLOOKUP(K1772,INVENTORYDATA,7,FALSE))=\"NO\",\"X\",\"\")","v":{"$error":"#N/A"}}]
["Power Off",null,"X",{"$nulls":3},"Power Off",null,"X"]
["HDD Serial No.",null,{"$f":"IF(ISBLANK(VLOOKUP(E1772,INVENTORYDATA,12,FALSE)),\"\",VLOOKUP(E1772,INVENTORYDATA,12,FALSE))","v":{"$error":"#N/A"}},{"$nulls":3},"HDD Serial No.",null,{"$f":"IF(ISBLANK(VLOOKUP(K1772,INVENTORYDATA,12,FALSE)),\"\",VLOOKUP(K1772,INVENTORYDATA,12,FALSE))","v":{"$error":"#N/A"}}]
[]
["Tested for key functions,R2/Ready for Resale",{"$nulls":5},"Tested for key functions,R2/Ready for Resale"]
["BIOS Lock","Caddy","Optical","WebCam","Battery",null,"BIOS Lock","Caddy","Optical","WebCam","Battery"]
[null,null,{"$f":"VLOOKUP(E1772,INVENTORY!$A$2:$N$100,7,FALSE)","v":{"$error":"#N/A"}},{"$f":"VLOOKUP(E1772,INVENTORY!$A$2:$N$100,8,FALSE)","v":{"$error":"#N/A"}},{"$f":"VLOOKUP(E1772,INVENTORY!$A$2:$N$100,9,FALSE)","v":{"$error":"#N/A"}},{"$nulls":3},{"$f":"VLOOKUP(K1772,INVENTORY!$A$2:$N$100,7,FALSE)","v":{"$error":"#N/A"}},{"$f":"VLOOKUP(K1772,INVENTORY!$A$2:$N$100,8,FALSE)","v":{"$error":"#N/A"}},{"$f":"VLOOKUP(K1772,INVENTORY!$A$2:$N$100,9,FALSE)","v":{"$error":"#N/A"}}]
[]
["CPU Cosmetics Defects:",null,{"$f":"\"Function Code: \"&VLOOKUP(E1772,INVENTORY!$A$2:$Q$100,14,FALSE)","v":{"$error":"#N/A"}},{"$nulls":3},"CPU Cosmetics Defects:",null,{"$f":"\"Function Code: \"&VLOOKUP(K1772,INVENTORY!$A$2:$Q$100,14,FALSE)","v":{"$error":"#N/A"}}]
[]
[null,null,{"$f":"\"Cosmetic Code: \"&VLOOKUP(E1772,INVENTORY!$A$2:$Q$100,15,FALSE)","v":{"$error":"#N/A"}},{"$nulls":5},{"$f":"\"Cosmetic Code: \"&VLOOKUP(K1772,INVENTORY!$A$2:$Q$100,15,FALSE)","v":{"$error":"#N/A"}}]
[]
["Casing","Plugs/Ports",{"$nulls":4},"Casing","Plugs/Ports"]
["Pass","Pass",{"$nulls":4},"Pass","Pass"]
["Fail","Fail",null,"TRRC#:L.T.R.",null,null,"Fail","Fail",null,"TRRC#:L.T.R."]
[]
["LAPTOP TESTING RECORD",{"$nulls":5},"LAPTOP TESTING RECORD"]
[]
[{"$nulls":3},"ITEM #",{"$f":"E1772+2","v":125},{"$nulls":4},"ITEM #",{"$f":"K1772+2","v":126}]
["Tester: ","RR","Date:",{"$f":"NOW()","v":"2025-12-15T11:00:59.760"},null,null,"Tester: ","RR","Date:",{"$f":"NOW()","v":"2025-12-15T11:00:59.760"}]
["Type: ","LAPTOP","SN:",{"$f":"VLOOKUP(E1801,INVENTORYDATA,10,FALSE)","v":{"$error":"#N/A"}},null,null,"Type: ","LAPTOP","SN:",{"$f":"VLOOKUP(K1801,INVENTORYDATA,10,FALSE)","v":{"$error":"#N/A"}}]
[{"$f":"\"Make: \"","v":"Make: "},{"$f":"VLOOKUP(E1801,INVENTORYDATA,2,FALSE)","v":{"$error":"#N/A"}},{"$f":"\"Model: \"","v":"Model: "},{"$f":"VLOOKUP(E1801,INVENTORYDATA,3,FALSE)","v":{"$error":"#N/A"}},null,null,{"$f":"\"Make: \"","v":"Make: "},{"$f":"VLOOKUP(K1801,INVENTORYDATA,2,FALSE)","v":{"$error":"#N/A"}},{"$f":"\"Model: \"","v":"Model: "},{"$f":"VLOOKUP(K1801,INVENTORYDATA,3,FALSE)","v":{"$error":"#N/A"}}]
[{"$f":"\"CPU/Speed: \"","v":"CPU/Speed: "},{"$f":"VLOOKUP(E1801,INVENTORYDATA,4,FALSE)&\" / \"&VLOOKUP(E1801,INVENTORYDATA,5,FALSE)&\"GHz\"","v":{"$error":"#N/A"}},null,{"$f":"\"Memory: \"","v":"Memory: "},{"$f":"VLOOKUP(E1801,INVENTORYDATA,6,FALSE)","v":{"$error":"#N/A"}},null,{"$f":"\"CPU/Speed: \"","v":"CPU/Speed: "},{"$f":"VLOOKUP(K1801,INVENTORYDATA,4,FALSE)&\" / \"&VLOOKUP(K1801,INVENTORYDATA,5,FALSE)&\"GHz\"","v":{"$error":"#N/A"}},null,{"$f":"\"Memory: \"","v":"Memory: "},{"$f":"VLOOKUP(K1801,INVENTORYDATA,6,FALSE)","v":{"$error":"#N/A"}}]
[]
["Key Function",null,"Pass","Fail ","Comments",null,"Key Function",null,"Pass","Fail ","Comments"]
["Hard Drive Removed",null,{"$f":"IF(ISBLANK(VLOOKUP(E1801,INVENTORYDATA,13,FALSE)),\"X\",\"\")","v":""},null,{"$f":"IF(ISBLANK(VLOOKUP(E1801,INVENTORYDATA,13,FALSE)),\"\",VLOOKUP(E1801,INVENTORYDATA,13,FALSE))","v":{"$error":"#N/A"}},null,"Hard Drive Removed",null,{"$f":"IF(ISBLANK(VLOOKUP(K1801,INVENTORYDATA,13,FALSE)),\"X\",\"\")","v":""},null,{"$f":"IF(ISBLANK(VLOOKUP(K1801,INVENTORYDATA,13,FALSE)),\"\",VLOOKUP(K1801,INVENTORYDATA,13,FALSE))","v":{"$error":"#N/A"}}]
["Install Memory",null,"X",{"$nulls":3},"Install Memory",null,"X"]
["Power ON",null,"X",{"$nulls":3},"Power ON",null,"X"]
["Record BIOS info",null,"X",{"$nulls":3},"Record BIOS info",null,"X"]
["Check Optical Drive",null,{"$f":"IF((VLOOKUP(E1801,INVENTORYDATA,7,FALSE))=\"YES\",\"X\",\"\")","v":{"$error":"#N/A"}},{"$f":"IF((VLOOKUP(E1801,INVENTORYDATA,7,FALSE))=\"NO\",\"X\",\"\")","v":{"$error":"#N/A"}},null,null,"Check Optical Drive",null,{"$f":"IF((VLOOKUP(K1801,INVENTORYDATA,7,FALSE))=\"YES\",\"X\",\"\")","v":{"$error":"#N/A"}},{"$f":"IF((VLOOKUP(K1801,INVENTORYDATA,7,FALSE))=\"NO\",\"X\",\"\")","v":{"$error":"#N/A"}}]
["Power Off",null,"X",{"$nulls":3},"Power Off",null,"X"]
["HDD Serial No.",null,{"$f":"IF(ISBLANK(VLOOKUP(E1801,INVENTORYDATA,12,FALSE)),\"\",VLOOKUP(E1801,INVENTORYDATA,12,FALSE))","v":{"$error":"#N/A"}},{"$nulls":3},"HDD Serial No.",null,{"$f":"IF(ISBLANK(VLOOKUP(K1801,INVENTORYDATA,12,FALSE)),\"\",VLOOKUP(K1801,INVENTORYDATA,12,FALSE))","v":{"$error":"#N/A"}}]
[]
["Tested for key functions,R2/Ready for Resale",{"$nulls":5},"Tested for key functions,R2/Ready for Resale"]
["BIOS Lock","Caddy","Optical","WebCam","Battery",null,"BIOS Lock","Caddy","Optical","WebCam","Battery"]
[null,null,{"$f":"VLOOKUP(E1801,INVENTORY!$A$2:$N$100,7,FALSE)","v":{"$error":"#N/A"}},{"$f":"VLOOKUP(E1801,INVENTORY!$A$2:$N$100,8,FALSE)","v":{"$error":"#N/A"}},{"$f":"VLOOKUP(E1801,INVENTORY!$A$2:$N$100,9,FALSE)","v":{"$error":"#N/A"}},{"$nulls":3},{"$f":"VLOOKUP(K1801,INVENTORY!$A$2:$N$100,7,FALSE)","v":{"$error":"#N/A"}},{"$f":"VLOOKUP(K1801,INVENTORY!$A$2:$N$100,8,FALSE)","v":{"$error":"#N/A"}},{"$f":"VLOOKUP(K1801,INVENTORY!$A$2:$N$100,9,FALSE)","v":{"$error":"#N/A"}}]
[]
["CPU Cosmetics Defects:",null,{"$f":"\"Function Code: \"&VLOOKUP(E1801,INVENTORY!$A$2:$Q$100,14,FALSE)","v":{"$error":"#N/A"}},{"$nulls":3},"CPU Cosmetics Defects:",null,{"$f":"\"Function Code: \"&VLOOKUP(K1801,INVENTORY!$A$2:$Q$100,14,FALSE)","v":{"$error":"#N/A"}}]
[]
[null,null,{"$f":"\"Cosmetic Code: \"&VLOOKUP(E1801,INVENTORY!$A$2:$Q$100,15,FALSE)","v":{"$error":"#N/A"}},{"$nulls":5},{"$f":"\"Cosmetic Code: \"&VLOOKUP(K1801,INVENTORY!$A$2:$Q$100,15,FALSE)","v":{"$error":"#N/A"}}]
[]
["Casing","Plugs/Ports",{"$nulls":4},"Casing","Plugs/Ports"]
["Pass","Pass",{"$nulls":4},"Pass","Pass"]
["Fail","Fail",null,"TRRC#:L.T.R.",null,null,"Fail","Fail",null,"TRRC#:L.T.R."]
[]
["LAPTOP TESTING RECORD",{"$nulls":5},"LAPTOP TESTING RECORD"]
[]
[{"$nulls":3},"ITEM #",{"$f":"E1801+2","v":127},{"$nulls":4},"ITEM #",{"$f":"K1801+2","v":128}]
["Tester: ","RR","Date:",{"$f":"NOW()","v":"2025-12-15T11:00:59.760"},null,null,"Tester: ","RR","Date:",{"$f":"NOW()","v":"2025-12-15T11:00:59.760"}]
["Type: ","LAPTOP","SN:",{"$f":"VLOOKUP(E1830,INVENTORYDATA,10,FALSE)","v":{"$error":"#N/A"}},null,null,"Type: ","LAPTOP","SN:",{"$f":"VLOOKUP(K1830,INVENTORYDATA,10,FALSE)","v":{"$error":"#N/A"}}]
[{"$f":"\"Make: \"","v":"Make: "},{"$f":"VLOOKUP(E1830,INVENTORYDATA,2,FALSE)","v":{"$error":"#N/A"}},{"$f":"\"Model: \"","v":"Model: "},{"$f":"VLOOKUP(E1830,INVENTORYDATA,3,FALSE)","v":{"$error":"#N/A"}},null,null,{"$f":"\"Make: \"","v":"Make: "},{"$f":"VLOOKUP(K1830,INVENTORYDATA,2,FALSE)","v":{"$error":"#N/A"}},{"$f":"\"Model: \"","v":"Model: "},{"$f":"VLOOKUP(K1830,INVENTORYDATA,3,FALSE)","v":{"$error":"#N/A"}}]
[{"$f":"\"CPU/Speed: \"","v":"CPU/Speed: "},{"$f":"VLOOKUP(E1830,INVENTORYDATA,4,FALSE)&\" / \"&VLOOKUP(E1830,INVENTORYDATA,5,FALSE)&\"GHz\"","v":{"$error":"#N/A"}},null,{"$f":"\"Memory: \"","v":"Memory: "},{"$f":"VLOOKUP(E1830,INVENTORYDATA,6,FALSE)","v":{"$error":"#N/A"}},null,{"$f":"\"CPU/Speed: \"","v":"CPU/Speed: "},{"$f":"VLOOKUP(K1830,INVENTORYDATA,4,FALSE)&\" / \"&VLOOKUP(K1830,INVENTORYDATA,5,FALSE)&\"GHz\"","v":{"$error":"#N/A"}},null,{"$f":"\"Memory: \"","v":"Memory: "},{"$f":"VLOOKUP(K1830,INVENTORYDATA,6,FALSE)","v":{"$error":"#N/A"}}]
[]
["Key Function",null,"Pass","Fail ","Comments",null,"Key Function",null,"Pass","Fail ","Comments"]
["Hard Drive Removed",null,{"$f":"IF(ISBLANK(VLOOKUP(E1830,INVENTORYDATA,13,FALSE)),\"X\",\"\")","v":""},null,{"$f":"IF(ISBLANK(VLOOKUP(E1830,INVENTORYDATA,13,FALSE)),\"\",VLOOKUP(E1830,INVENTORYDATA,13,FALSE))","v":{"$error":"#N/A"}},null,"Hard Drive Removed",null,{"$f":"IF(ISBLANK(VLOOKUP(K1830,INVENTORYDATA,13,FALSE)),\"X\",\"\")","v":""},null,{"$f":"IF(ISBLANK(VLOOKUP(K1830,INVENTORYDATA,13,FALSE)),\"\",VLOOKUP(K1830,INVENTORYDATA,13,FALSE))","v":{"$error":"#N/A"}}]
["Install Memory",null,"X",{"$nulls":3},"Install Memory",null,"X"]
["Power ON",null,"X",{"$nulls":3},"Power ON",null,"X"]
["Record BIOS info",null,"X",{"$nulls":3},"Record BIOS info",null,"X"]
["Check Optical Drive",null,{"$f":"IF((VLOOKUP(E1830,INVENTORYDATA,7,FALSE))=\"YES\",\"X\",\"\")","v":{"$error":"#N/A"}},{"$f":"IF((VLOOKUP(E1830,INVENTORYDATA,7,FALSE))=\"NO\",\"X\",\"\")","v":{"$error":"#N/A"}},null,null,"Check Optical Drive",null,{"$f":"IF((VLOOKUP(K1830,INVENTORYDATA,7,FALSE))=\"YES\",\"X\",\"\")","v":{"$error":"#N/A"}},{"$f":"IF((VLOOKUP(K1830,INVENTORYDATA,7,FALSE))=\"NO\",\"X\",\"\")","v":{"$error":"#N/A"}}]
["Power Off",null,"X",{"$nulls":3},"Power Off",null,"X"]
["HDD Serial No.",null,{"$f":"IF(ISBLANK(VLOOKUP(E1830,INVENTORYDATA,12,FALSE)),\"\",VLOOKUP(E1830,INVENTORYDATA,12,FALSE))","v":{"$error":"#N/A"}},{"$nulls":3},"HDD Serial No.",null,{"$f":"IF(ISBLANK(VLOOKUP(K1830,INVENTORYDATA,12,FALSE)),\"\",VLOOKUP(K1830,INVENTORYDATA,12,FALSE))","v":{"$error":"#N/A"}}]
[]
["Tested for key functions,R2/Ready for Resale",{"$nulls":5},"Tested for key functions,R2/Ready for Resale"]
["BIOS Lock","Caddy","Optical","WebCam","Battery",null,"BIOS Lock","Caddy","Optical","WebCam","Battery"]
[null,null,{"$f":"VLOOKUP(E1830,INVENTORY!$A$2:$N$100,7,FALSE)","v":{"$error":"#N/A"}},{"$f":"VLOOKUP(E1830,INVENTORY!$A$2:$N$100,8,FALSE)","v":{"$error":"#N/A"}},{"$f":"VLOOKUP(E1830,INVENTORY!$A$2:$N$100,9,FALSE)","v":{"$error":"#N/A"}},{"$nulls":3},{"$f":"VLOOKUP(K1830,INVENTORY!$A$2:$N$100,7,FALSE)","v":{"$error":"#N/A"}},{"$f":"VLOOKUP(K1830,INVENTORY!$A$2:$N$100,8,FALSE)","v":{"$error":"#N/A"}},{"$f":"VLOOKUP(K1830,INVENTORY!$A$2:$N$100,9,FALSE)","v":{"$error":"#N/A"}}]
[]
["CPU Cosmetics Defects:",null,{"$f":"\"Function Code: \"&VLOOKUP(E1830,INVENTORY!$A$2:$Q$100,14,FALSE)","v":{"$error":"#N/A"}},{"$nulls":3},"CPU Cosmetics Defects:",null,{"$f":"\"Function Code: \"&VLOOKUP(K1830,INVENTORY!$A$2:$Q$100,14,FALSE)","v":{"$error":"#N/A"}}]
[]
[null,null,{"$f":"\"Cosmetic Code: \"&VLOOKUP(E1830,INVENTORY!$A$2:$Q$100,15,FALSE)","v":{"$error":"#N/A"}},{"$nulls":5},{"$f":"\"Cosmetic Code: \"&VLOOKUP(K1830,INVENTORY!$A$2:$Q$100,15,FALSE)","v":{"$error":"#N/A"}}]
[]
["Casing","Plugs/Ports",{"$nulls":4},"Casing","Plugs/Ports"]
["Pass","Pass",{"$nulls":4},"Pass","Pass"]
["Fail","Fail",null,"TRRC#:L.T.R.",null,null,"Fail","Fail",null,"TRRC#:L.T.R."]
[]
["LAPTOP TESTING RECORD",{"$nulls":5},"LAPTOP TESTING RECORD"]
[]
[{"$nulls":3},"ITEM #",{"$f":"E1830+2","v":129},{"$nulls":4},"ITEM #",{"$f":"K1830+2","v":130}]
["Tester: ","RR","Date:",{"$f":"NOW()","v":"2025-12-15T11:00:59.760"},null,null,"Tester: ","RR","Date:",{"$f":"NOW()","v":"2025-12-15T11:00:59.760"}]
["Type: ","LAPTOP","SN:",{"$f":"VLOOKUP(E1859,INVENTORYDATA,10,FALSE)","v":{"$error":"#N/A"}},null,null,"Type: ","LAPTOP","SN:",{"$f":"VLOOKUP(K1859,INVENTORYDATA,10,FALSE)","v":{"$error":"#N/A"}}]
[{"$f":"\"Make: \"","v":"Make: "},{"$f":"VLOOKUP(E1859,INVENTORYDATA,2,FALSE)","v":{"$error":"#N/A"}},{"$f":"\"Model: \"","v":"Model: "},{"$f":"VLOOKUP(E1859,INVENTORYDATA,3,FALSE)","v":{"$error":"#N/A"}},null,null,{"$f":"\"Make: \"","v":"Make: "},{"$f":"VLOOKUP(K1859,INVENTORYDATA,2,FALSE)","v":{"$error":"#N/A"}},{"$f":"\"Model: \"","v":"Model: "},{"$f":"VLOOKUP(K1859,INVENTORYDATA,3,FALSE)","v":{"$error":"#N/A"}}]
[{"$f":"\"CPU/Speed: \"","v":"CPU/Speed: "},{"$f":"VLOOKUP(E1859,INVENTORYDATA,4,FALSE)&\" / \"&VLOOKUP(E1859,INVENTORYDATA,5,FALSE)&\"GHz\"","v":{"$error":"#N/A"}},null,{"$f":"\"Memory: \"","v":"Memory: "},{"$f":"VLOOKUP(E1859,INVENTORYDATA,6,FALSE)","v":{"$error":"#N/A"}},null,{"$f":"\"CPU/Speed: \"","v":"CPU/Speed: "},{"$f":"VLOOKUP(K1859,INVENTORYDATA,4,FALSE)&\" / \"&VLOOKUP(K1859,INVENTORYDATA,5,FALSE)&\"GHz\"","v":{"$error":"#N/A"}},null,{"$f":"\"Memory: \"","v":"Memory: "},{"$f":"VLOOKUP(K1859,INVENTORYDATA,6,FALSE)","v":{"$error":"#N/A"}}]
[]
["Key Function",null,"Pass","Fail ","Comments",null,"Key Function",null,"Pass","Fail ","Comments"]
["Hard Drive Removed",null,{"$f":"IF(ISBLANK(VLOOKUP(E1859,INVENTORYDATA,13,FALSE)),\"X\",\"\")","v":""},null,{"$f":"IF(ISBLANK(VLOOKUP(E1859,INVENTORYDATA,13,FALSE)),\"\",VLOOKUP(E1859,INVENTORYDATA,13,FALSE))","v":{"$error":"#N/A"}},null,"Hard Drive Removed",null,{"$f":"IF(ISBLANK(VLOOKUP(K1859,INVENTORYDATA,13,FALSE)),\"X\",\"\")","v":""},null,{"$f":"IF(ISBLANK(VLOOKUP(K1859,INVENTORYDATA,13,FALSE)),\"\",VLOOKUP(K1859,INVENTORYDATA,13,FALSE))","v":{"$error":"#N/A"}}]
["Install Memory",null,"X",{"$nulls":3},"Install Memory",null,"X"]
["Power ON",null,"X",{"$nulls":3},"Power ON",null,"X"]
["Record BIOS info",null,"X",{"$nulls":3},"Record BIOS info",null,"X"]
["Check Optical Drive",null,{"$f":"IF((VLOOKUP(E1859,INVENTORYDATA,7,FALSE))=\"YES\",\"X\",\"\")","v":{"$error":"#N/A"}},{"$f":"IF((VLOOKUP(E1859,INVENTORYDATA,7,FALSE))=\"NO\",\"X\",\"\")","v":{"$error":"#N/A"}},null,null,"Check Optical Drive",null,{"$f":"IF((VLOOKUP(K1859,INVENTORYDATA,7,FALSE))=\"YES\",\"X\",\"\")","v":{"$error":"#N/A"}},{"$f":"IF((VLOOKUP(K1859,INVENTORYDATA,7,FALSE))=\"NO\",\"X\",\"\")","v":{"$error":"#N/A"}}]
["Power Off",null,"X",{"$nulls":3},"Power Off",null,"X"]
["HDD Serial No.",null,{"$f":"IF(ISBLANK(VLOOKUP(E1859,INVENTORYDATA,12,FALSE)),\"\",VLOOKUP(E1859,INVENTORYDATA,12,FALSE))","v":{"$error":"#N/A"}},{"$nulls":3},"HDD Serial No.",null,{"$f":"IF(ISBLANK(VLOOKUP(K1859,INVENTORYDATA,12,FALSE)),\"\",VLOOKUP(K1859,INVENTORYDATA,12,FALSE))","v":{"$error":"#N/A"}}]
[]
["Tested for key functions,R2/Ready for Resale",{"$nulls":5},"Tested for key functions,R2/Ready for Resale"]
["BIOS Lock","Caddy","Optical","WebCam","Battery",null,"BIOS Lock","Caddy","Optical","WebCam","Battery"]
[null,null,{"$f":"VLOOKUP(E1859,INVENTORY!$A$2:$N$100,7,FALSE)","v":{"$error":"#N/A"}},{"$f":"VLOOKUP(E1859,INVENTORY!$A$2:$N$100,8,FALSE)","v":{"$error":"#N/A"}},{"$f":"VLOOKUP(E1859,INVENTORY!$A$2:$N$100,9,FALSE)","v":{"$error":"#N/A"}},{"$nulls":3},{"$f":"VLOOKUP(K1859,INVENTORY!$A$2:$N$100,7,FALSE)","v":{"$error":"#N/A"}},{"$f":"VLOOKUP(K1859,INVENTORY!$A$2:$N$100,8,FALSE)","v":{"$error":"#N/A"}},{"$f":"VLOOKUP(K1859,INVENTORY!$A$2:$N$100,9,FALSE)","v":{"$error":"#N/A"}}]
[]
["CPU Cosmetics Defects:",null,{"$f":"\"Function Code: \"&VLOOKUP(E1859,INVENTORY!$A$2:$Q$100,14,FALSE)","v":{"$error":"#N/A"}},{"$nulls":3},"CPU Cosmetics Defects:",null,{"$f":"\"Function Code: \"&VLOOKUP(K1859,INVENTORY!$A$2:$Q$100,14,FALSE)","v":{"$error":"#N/A"}}]
[]
[null,null,{"$f":"\"Cosmetic Code: \"&VLOOKUP(E1859,INVENTORY!$A$2:$Q$100,15,FALSE)","v":{"$error":"#N/A"}},{"$nulls":5},{"$f":"\"Cosmetic Code: \"&VLOOKUP(K1859,INVENTORY!$A$2:$Q$100,15,FALSE)","v":{"$error":"#N/A"}}]
[]
["Casing","Plugs/Ports",{"$nulls":4},"Casing","Plugs/Ports"]
["Pass","Pass",{"$nulls":4},"Pass","Pass"]
["Fail","Fail",null,"TRRC#:L.T.R.",null,null,"Fail","Fail",null,"TRRC#:L.T.R."]
[]
["LAPTOP TESTING RECORD",{"$nulls":5},"LAPTOP TESTING RECORD"]
[]
[{"$nulls":3},"ITEM #",{"$f":"E1859+2","v":131},{"$nulls":4},"ITEM #",{"$f":"K1859+2","v":132}]
["Tester: ","RR","Date:",{"$f":"NOW()","v":"2025-12-15T11:00:59.760"},null,null,"Tester: ","RR","Date:",{"$f":"NOW()","v":"2025-12-15T11:00:59.760"}]
["Type: ","LAPTOP","SN:",{"$f":"VLOOKUP(E1888,INVENTORYDATA,10,FALSE)","v":{"$error":"#N/A"}},null,null,"Type: ","LAPTOP","SN:",{"$f":"VLOOKUP(K1888,INVENTORYDATA,10,FALSE)","v":{"$error":"#N/A"}}]
[{"$f":"\"Make: \"","v":"Make: "},{"$f":"VLOOKUP(E1888,INVENTORYDATA,2,FALSE)","v":{"$error":"#N/A"}},{"$f":"\"Model: \"","v":"Model: "},{"$f":"VLOOKUP(E1888,INVENTORYDATA,3,FALSE)","v":{"$error":"#N/A"}},null,null,{"$f":"\"Make: \"","v":"Make: "},{"$f":"VLOOKUP(K1888,INVENTORYDATA,2,FALSE)","v":{"$error":"#N/A"}},{"$f":"\"Model: \"","v":"Model: "},{"$f":"VLOOKUP(K1888,INVENTORYDATA,3,FALSE)","v":{"$error":"#N/A"}}]
[{"$f":"\"CPU/Speed: \"","v":"CPU/Speed: "},{"$f":"VLOOKUP(E1888,INVENTORYDATA,4,FALSE)&\" / \"&VLOOKUP(E1888,INVENTORYDATA,5,FALSE)&\"GHz\"","v":{"$error":"#N/A"}},null,{"$f":"\"Memory: \"","v":"Memory: "},{"$f":"VLOOKUP(E1888,INVENTORYDATA,6,FALSE)","v":{"$error":"#N/A"}},null,{"$f":"\"CPU/Speed: \"","v":"CPU/Speed: "},{"$f":"VLOOKUP(K1888,INVENTORYDATA,4,FALSE)&\" / \"&VLOOKUP(K1888,INVENTORYDATA,5,FALSE)&\"GHz\"","v":{"$error":"#N/A"}},null,{"$f":"\"Memory: \"","v":"Memory: "},{"$f":"VLOOKUP(K1888,INVENTORYDATA,6,FALSE)","v":{"$error":"#N/A"}}]
[]
["Key Function",null,"Pass","Fail ","Comments",null,"Key Function",null,"Pass","Fail ","Comments"]
["Hard Drive Removed",null,{"$f":"IF(ISBLANK(VLOOKUP(E1888,INVENTORYDATA,13,FALSE)),\"X\",\"\")","v":""},null,{"$f":"IF(ISBLANK(VLOOKUP(E1888,INVENTORYDATA,13,FALSE)),\"\",VLOOKUP(E1888,INVENTORYDATA,13,FALSE))","v":{"$error":"#N/A"}},null,"Hard Drive Removed",null,{"$f":"IF(ISBLANK(VLOOKUP(K1888,INVENTORYDATA,13,FALSE)),\"X\",\"\")","v":""},null,{"$f":"IF(ISBLANK(VLOOKUP(K1888,INVENTORYDATA,13,FALSE)),\"\",VLOOKUP(K1888,INVENTORYDATA,13,FALSE))","v":{"$error":"#N/A"}}]
["Install Memory",null,"X",{"$nulls":3},"Install Memory",null,"X"]
["Power ON",null,"X",{"$nulls":3},"Power ON",null,"X"]
["Record BIOS info",null,"X",{"$nulls":3},"Record BIOS info",null,"X"]
["Check Optical Drive",null,{"$f":"IF((VLOOKUP(E1888,INVENTORYDATA,7,FALSE))=\"YES\",\"X\",\"\")","v":{"$error":"#N/A"}},{"$f":"IF((VLOOKUP(E1888,INVENTORYDATA,7,FALSE))=\"NO\",\"X\",\"\")","v":{"$error":"#N/A"}},null,null,"Check Optical Drive",null,{"$f":"IF((VLOOKUP(K1888,INVENTORYDATA,7,FALSE))=\"YES\",\"X\",\"\")","v":{"$error":"#N/A"}},{"$f":"IF((VLOOKUP(K1888,INVENTORYDATA,7,FALSE))=\"NO\",\"X\",\"\")","v":{"$error":"#N/A"}}]
["Power Off",null,"X",{"$nulls":3},"Power Off",null,"X"]
["HDD Serial No.",null,{"$f":"IF(ISBLANK(VLOOKUP(E1888,INVENTORYDATA,12,FALSE)),\"\",VLOOKUP(E1888,INVENTORYDATA,12,FALSE))","v":{"$error":"#N/A"}},{"$nulls":3},"HDD Serial No.",null,{"$f":"IF(ISBLANK(VLOOKUP(K1888,INVENTORYDATA,12,FALSE)),\"\",VLOOKUP(K1888,INVENTORYDATA,12,FALSE))","v":{"$error":"#N/A"}}]
[]
["Tested for key functions,R2/Ready for Resale",{"$nulls":5},"Tested for key functions,R2/Ready for Resale"]
["BIOS Lock","Caddy","Optical","WebCam","Battery",null,"BIOS Lock","Caddy","Optical","WebCam","Battery"]
[null,null,{"$f":"VLOOKUP(E1888,INVENTORY!$A$2:$N$100,7,FALSE)","v":{"$error":"#N/A"}},{"$f":"VLOOKUP(E1888,INVENTORY!$A$2:$N$100,8,FALSE)","v":{"$error":"#N/A"}},{"$f":"VLOOKUP(E1888,INVENTORY!$A$2:$N$100,9,FALSE)","v":{"$error":"#N/A"}},{"$nulls":3},{"$f":"VLOOKUP(K1888,INVENTORY!$A$2:$N$100,7,FALSE)","v":{"$error":"#N/A"}},{"$f":"VLOOKUP(K1888,INVENTORY!$A$2:$N$100,8,FALSE)","v":{"$error":"#N/A"}},{"$f":"VLOOKUP(K1888,INVENTORY!$A$2:$N$100,9,FALSE)","v":{"$error":"#N/A"}}]
[]
["CPU Cosmetics Defects:",null,{"$f":"\"Function Code: \"&VLOOKUP(E1888,INVENTORY!$A$2:$Q$100,14,FALSE)","v":{"$error":"#N/A"}},{"$nulls":3},"CPU Cosmetics Defects:",null,{"$f":"\"Function Code: \"&VLOOKUP(K1888,INVENTORY!$A$2:$Q$100,14,FALSE)","v":{"$error":"#N/A"}}]
[]
[null,null,{"$f":"\"Cosmetic Code: \"&VLOOKUP(E1888,INVENTORY!$A$2:$Q$100,15,FALSE)","v":{"$error":"#N/A"}},{"$nulls":5},{"$f":"\"Cosmetic Code: \"&VLOOKUP(K1888,INVENTORY!$A$2:$Q$100,15,FALSE)","v":{"$error":"#N/A"}}]
[]
["Casing","Plugs/Ports",{"$nulls":4},"Casing","Plugs/Ports"]
["Pass","Pass",{"$nulls":4},"Pass","Pass"]
["Fail","Fail",null,"TRRC#:L.T.R.",null,null,"Fail","Fail",null,"TRRC#:L.T.R."]
[]
["LAPTOP TESTING RECORD",{"$nulls":5},"LAPTOP TESTING RECORD"]
[]
[{"$nulls":3},"ITEM #",{"$f":"E1888+2","v":133},{"$nulls":4},"ITEM #",{"$f":"K1888+2","v":134}]
["Tester: ","RR","Date:",{"$f":"NOW()","v":"2025-12-15T11:00:59.760"},null,null,"Tester: ","RR","Date:",{"$f":"NOW()","v":"2025-12-15T11:00:59.760"}]
["Type: ","LAPTOP","SN:",{"$f":"VLOOKUP(E1917,INVENTORYDATA,10,FALSE)","v":{"$error":"#N/A"}},null,null,"Type: ","LAPTOP","SN:",{"$f":"VLOOKUP(K1917,INVENTORYDATA,10,FALSE)","v":{"$error":"#N/A"}}]
[{"$f":"\"Make: \"","v":"Make: "},{"$f":"VLOOKUP(E1917,INVENTORYDATA,2,FALSE)","v":{"$error":"#N/A"}},{"$f":"\"Model: \"","v":"Model: "},{"$f":"VLOOKUP(E1917,INVENTORYDATA,3,FALSE)","v":{"$error":"#N/A"}},null,null,{"$f":"\"Make: \"","v":"Make: "},{"$f":"VLOOKUP(K1917,INVENTORYDATA,2,FALSE)","v":{"$error":"#N/A"}},{"$f":"\"Model: \"","v":"Model: "},{"$f":"VLOOKUP(K1917,INVENTORYDATA,3,FALSE)","v":{"$error":"#N/A"}}]
[{"$f":"\"CPU/Speed: \"","v":"CPU/Speed: "},{"$f":"VLOOKUP(E1917,INVENTORYDATA,4,FALSE)&\" / \"&VLOOKUP(E1917,INVENTORYDATA,5,FALSE)&\"GHz\"","v":{"$error":"#N/A"}},null,{"$f":"\"Memory: \"","v":"Memory: "},{"$f":"VLOOKUP(E1917,INVENTORYDATA,6,FALSE)","v":{"$error":"#N/A"}},null,{"$f":"\"CPU/Speed: \"","v":"CPU/Speed: "},{"$f":"VLOOKUP(K1917,INVENTORYDATA,4,FALSE)&\" / \"&VLOOKUP(K1917,INVENTORYDATA,5,FALSE)&\"GHz\"","v":{"$error":"#N/A"}},null,{"$f":"\"Memory: \"","v":"Memory: "},{"$f":"VLOOKUP(K1917,INVENTORYDATA,6,FALSE)","v":{"$error":"#N/A"}}]
[]
["Key Function",null,"Pass","Fail ","Comments",null,"Key Function",null,"Pass","Fail ","Comments"]
["Hard Drive Removed",null,{"$f":"IF(ISBLANK(VLOOKUP(E1917,INVENTORYDATA,13,FALSE)),\"X\",\"\")","v":""},null,{"$f":"IF(ISBLANK(VLOOKUP(E1917,INVENTORYDATA,13,FALSE)),\"\",VLOOKUP(E1917,INVENTORYDATA,13,FALSE))","v":{"$error":"#N/A"}},null,"Hard Drive Removed",null,{"$f":"IF(ISBLANK(VLOOKUP(K1917,INVENTORYDATA,13,FALSE)),\"X\",\"\")","v":""},null,{"$f":"IF(ISBLANK(VLOOKUP(K1917,INVENTORYDATA,13,FALSE)),\"\",VLOOKUP(K1917,INVENTORYDATA,13,FALSE))","v":{"$error":"#N/A"}}]
["Install Memory",null,"X",{"$nulls":3},"Install Memory",null,"X"]
["Power ON",null,"X",{"$nulls":3},"Power ON",null,"X"]
["Record BIOS info",null,"X",{"$nulls":3},"Record BIOS info",null,"X"]
["Check Optical Drive",null,{"$f":"IF((VLOOKUP(E1917,INVENTORYDATA,7,FALSE))=\"YES\",\"X\",\"\")","v":{"$error":"#N/A"}},{"$f":"IF((VLOOKUP(E1917,INVENTORYDATA,7,FALSE))=\"NO\",\"X\",\"\")","v":{"$error":"#N/A"}},null,null,"Check Optical Drive",null,{"$f":"IF((VLOOKUP(K1917,INVENTORYDATA,7,FALSE))=\"YES\",\"X\",\"\")","v":{"$error":"#N/A"}},{"$f":"IF((VLOOKUP(K1917,INVENTORYDATA,7,FALSE))=\"NO\",\"X\",\"\")","v":{"$error":"#N/A"}}]
["Power Off",null,"X",{"$nulls":3},"Power Off",null,"X"]
["HDD Serial No.",null,{"$f":"IF(ISBLANK(VLOOKUP(E1917,INVENTORYDATA,12,FALSE)),\"\",VLOOKUP(E1917,INVENTORYDATA,12,FALSE))","v":{"$error":"#N/A"}},{"$nulls":3},"HDD Serial No.",null,{"$f":"IF(ISBLANK(VLOOKUP(K1917,INVENTORYDATA,12,FALSE)),\"\",VLOOKUP(K1917,INVENTORYDATA,12,FALSE))","v":{"$error":"#N/A"}}]
[]
["Tested for key functions,R2/Ready for Resale",{"$nulls":5},"Tested for key functions,R2/Ready for Resale"]
["BIOS Lock","Caddy","Optical","WebCam","Battery",null,"BIOS Lock","Caddy","Optical","WebCam","Battery"]
[null,null,{"$f":"VLOOKUP(E1917,INVENTORY!$A$2:$N$100,7,FALSE)","v":{"$error":"#N/A"}},{"$f":"VLOOKUP(E1917,INVENTORY!$A$2:$N$100,8,FALSE)","v":{"$error":"#N/A"}},{"$f":"VLOOKUP(E1917,INVENTORY!$A$2:$N$100,9,FALSE)","v":{"$error":"#N/A"}},{"$nulls":3},{"$f":"VLOOKUP(K1917,INVENTORY!$A$2:$N$100,7,FALSE)","v":{"$error":"#N/A"}},{"$f":"VLOOKUP(K1917,INVENTORY!$A$2:$N$100,8,FALSE)","v":{"$error":"#N/A"}},{"$f":"VLOOKUP(K1917,INVENTORY!$A$2:$N$100,9,FALSE)","v":{"$error":"#N/A"}}]
[]
["CPU Cosmetics Defects:",null,{"$f":"\"Function Code: \"&VLOOKUP(E1917,INVENTORY!$A$2:$Q$100,14,FALSE)","v":{"$error":"#N/A"}},{"$nulls":3},"CPU Cosmetics Defects:",null,{"$f":"\"Function Code: \"&VLOOKUP(K1917,INVENTORY!$A$2:$Q$100,14,FALSE)","v":{"$error":"#N/A"}}]
[]
[null,null,{"$f":"\"Cosmetic Code: \"&VLOOKUP(E1917,INVENTORY!$A$2:$Q$100,15,FALSE)","v":{"$error":"#N/A"}},{"$nulls":5},{"$f":"\"Cosmetic Code: \"&VLOOKUP(K1917,INVENTORY!$A$2:$Q$100,15,FALSE)","v":{"$error":"#N/A"}}]
[]
["Casing","Plugs/Ports",{"$nulls":4},"Casing","Plugs/Ports"]
["Pass","Pass",{"$nulls":4},"Pass","Pass"]
["Fail","Fail",null,"TRRC#:L.T.R.",null,null,"Fail","Fail",null,"TRRC#:L.T.R."]
[]
["LAPTOP TESTING RECORD",{"$nulls":5},"LAPTOP TESTING RECORD"]
[]
[{"$nulls":3},"ITEM #",{"$f":"E1917+2","v":135},{"$nulls":4},"ITEM #",{"$f":"K1917+2","v":136}]
["Tester: ","RR","Date:",{"$f":"NOW()","v":"2025-12-15T11:00:59.760"},null,null,"Tester: ","RR","Date:",{"$f":"NOW()","v":"2025-12-15T11:00:59.760"}]
["Type: ","LAPTOP","SN:",{"$f":"VLOOKUP(E1946,INVENTORYDATA,10,FALSE)","v":{"$error":"#N/A"}},null,null,"Type: ","LAPTOP","SN:",{"$f":"VLOOKUP(K1946,INVENTORYDATA,10,FALSE)","v":{"$error":"#N/A"}}]
[{"$f":"\"Make: \"","v":"Make: "},{"$f":"VLOOKUP(E1946,INVENTORYDATA,2,FALSE)","v":{"$error":"#N/A"}},{"$f":"\"Model: \"","v":"Model: "},{"$f":"VLOOKUP(E1946,INVENTORYDATA,3,FALSE)","v":{"$error":"#N/A"}},null,null,{"$f":"\"Make: \"","v":"Make: "},{"$f":"VLOOKUP(K1946,INVENTORYDATA,2,FALSE)","v":{"$error":"#N/A"}},{"$f":"\"Model: \"","v":"Model: "},{"$f":"VLOOKUP(K1946,INVENTORYDATA,3,FALSE)","v":{"$error":"#N/A"}}]
[{"$f":"\"CPU/Speed: \"","v":"CPU/Speed: "},{"$f":"VLOOKUP(E1946,INVENTORYDATA,4,FALSE)&\" / \"&VLOOKUP(E1946,INVENTORYDATA,5,FALSE)&\"GHz\"","v":{"$error":"#N/A"}},null,{"$f":"\"Memory: \"","v":"Memory: "},{"$f":"VLOOKUP(E1946,INVENTORYDATA,6,FALSE)","v":{"$error":"#N/A"}},null,{"$f":"\"CPU/Speed: \"","v":"CPU/Speed: "},{"$f":"VLOOKUP(K1946,INVENTORYDATA,4,FALSE)&\" / \"&VLOOKUP(K1946,INVENTORYDATA,5,FALSE)&\"GHz\"","v":{"$error":"#N/A"}},null,{"$f":"\"Memory: \"","v":"Memory: "},{"$f":"VLOOKUP(K1946,INVENTORYDATA,6,FALSE)","v":{"$error":"#N/A"}}]
[]
["Key Function",null,"Pass","Fail ","Comments",null,"Key Function",null,"Pass","Fail ","Comments"]
["Hard Drive Removed",null,{"$f":"IF(ISBLANK(VLOOKUP(E1946,INVENTORYDATA,13,FALSE)),\"X\",\"\")","v":""},null,{"$f":"IF(ISBLANK(VLOOKUP(E1946,INVENTORYDATA,13,FALSE)),\"\",VLOOKUP(E1946,INVENTORYDATA,13,FALSE))","v":{"$error":"#N/A"}},null,"Hard Drive Removed",null,{"$f":"IF(ISBLANK(VLOOKUP(K1946,INVENTORYDATA,13,FALSE)),\"X\",\"\")","v":""},null,{"$f":"IF(ISBLANK(VLOOKUP(K1946,INVENTORYDATA,13,FALSE)),\"\",VLOOKUP(K1946,INVENTORYDATA,13,FALSE))","v":{"$error":"#N/A"}}]
["Install Memory",null,"X",{"$nulls":3},"Install Memory",null,"X"]
["Power ON",null,"X",{"$nulls":3},"Power ON",null,"X"]
["Record BIOS info",null,"X",{"$nulls":3},"Record BIOS info",null,"X"]
["Check Optical Drive",null,{"$f":"IF((VLOOKUP(E1946,INVENTORYDATA,7,FALSE))=\"YES\",\"X\",\"\")","v":{"$error":"#N/A"}},{"$f":"IF((VLOOKUP(E1946,INVENTORYDATA,7,FALSE))=\"NO\",\"X\",\"\")","v":{"$error":"#N/A"}},null,null,"Check Optical Drive",null,{"$f":"IF((VLOOKUP(K1946,INVENTORYDATA,7,FALSE))=\"YES\",\"X\",\"\")","v":{"$error":"#N/A"}},{"$f":"IF((VLOOKUP(K1946,INVENTORYDATA,7,FALSE))=\"NO\",\"X\",\"\")","v":{"$error":"#N/A"}}]
["Power Off",null,"X",{"$nulls":3},"Power Off",null,"X"]
["HDD Serial No.",null,{"$f":"IF(ISBLANK(VLOOKUP(E1946,INVENTORYDATA,12,FALSE)),\"\",VLOOKUP(E1946,INVENTORYDATA,12,FALSE))","v":{"$error":"#N/A"}},{"$nulls":3},"HDD Serial No.",null,{"$f":"IF(ISBLANK(VLOOKUP(K1946,INVENTORYDATA,12,FALSE)),\"\",VLOOKUP(K1946,INVENTORYDATA,12,FALSE))","v":{"$error":"#N/A"}}]
[]
["Tested for key functions,R2/Ready for Resale",{"$nulls":5},"Tested for key functions,R2/Ready for Resale"]
["BIOS Lock","Caddy","Optical","WebCam","Battery",null,"BIOS Lock","Caddy","Optical","WebCam","Battery"]
[null,null,{"$f":"VLOOKUP(E1946,INVENTORY!$A$2:$N$100,7,FALSE)","v":{"$error":"#N/A"}},{"$f":"VLOOKUP(E1946,INVENTORY!$A$2:$N$100,8,FALSE)","v":{"$error":"#N/A"}},{"$f":"VLOOKUP(E1946,INVENTORY!$A$2:$N$100,9,FALSE)","v":{"$error":"#N/A"}},{"$nulls":3},{"$f":"VLOOKUP(K1946,INVENTORY!$A$2:$N$100,7,FALSE)","v":{"$error":"#N/A"}},{"$f":"VLOOKUP(K1946,INVENTORY!$A$2:$N$100,8,FALSE)","v":{"$error":"#N/A"}},{"$f":"VLOOKUP(K1946,INVENTORY!$A$2:$N$100,9,FALSE)","v":{"$error":"#N/A"}}]
[]
["CPU Cosmetics Defects:",null,{"$f":"\"Function Code: \"&VLOOKUP(E1946,INVENTORY!$A$2:$Q$100,14,FALSE)","v":{"$error":"#N/A"}},{"$nulls":3},"CPU Cosmetics Defects:",null,{"$f":"\"Function Code: \"&VLOOKUP(K1946,INVENTORY!$A$2:$Q$100,14,FALSE)","v":{"$error":"#N/A"}}]
[]
[null,null,{"$f":"\"Cosmetic Code: \"&VLOOKUP(E1946,INVENTORY!$A$2:$Q$100,15,FALSE)","v":{"$error":"#N/A"}},{"$nulls":5},{"$f":"\"Cosmetic Code: \"&VLOOKUP(K1946,INVENTORY!$A$2:$Q$100,15,FALSE)","v":{"$error":"#N/A"}}]
[]
["Casing","Plugs/Ports",{"$nulls":4},"Casing","Plugs/Ports"]
["Pass","Pass",{"$nulls":4},"Pass","Pass"]
["Fail","Fail",null,"TRRC#:L.T.R.",null,null,"Fail","Fail",null,"TRRC#:L.T.R."]
[]
["LAPTOP TESTING RECORD",{"$nulls":5},"LAPTOP TESTING RECORD"]
[]
[{"$nulls":3},"ITEM #",{"$f":"E1946+2","v":137},{"$nulls":4},"ITEM #",{"$f":"K1946+2","v":138}]
["Tester: ","RR","Date:",{"$f":"NOW()","v":"2025-12-15T11:00:59.760"},null,null,"Tester: ","RR","Date:",{"$f":"NOW()","v":"2025-12-15T11:00:59.760"}]
["Type: ","LAPTOP","SN:",{"$f":"VLOOKUP(E1975,INVENTORYDATA,10,FALSE)","v":{"$error":"#N/A"}},null,null,"Type: ","LAPTOP","SN:",{"$f":"VLOOKUP(K1975,INVENTORYDATA,10,FALSE)","v":{"$error":"#N/A"}}]
[{"$f":"\"Make: \"","v":"Make: "},{"$f":"VLOOKUP(E1975,INVENTORYDATA,2,FALSE)","v":{"$error":"#N/A"}},{"$f":"\"Model: \"","v":"Model: "},{"$f":"VLOOKUP(E1975,INVENTORYDATA,3,FALSE)","v":{"$error":"#N/A"}},null,null,{"$f":"\"Make: \"","v":"Make: "},{"$f":"VLOOKUP(K1975,INVENTORYDATA,2,FALSE)","v":{"$error":"#N/A"}},{"$f":"\"Model: \"","v":"Model: "},{"$f":"VLOOKUP(K1975,INVENTORYDATA,3,FALSE)","v":{"$error":"#N/A"}}]
[{"$f":"\"CPU/Speed: \"","v":"CPU/Speed: "},{"$f":"VLOOKUP(E1975,INVENTORYDATA,4,FALSE)&\" / \"&VLOOKUP(E1975,INVENTORYDATA,5,FALSE)&\"GHz\"","v":{"$error":"#N/A"}},null,{"$f":"\"Memory: \"","v":"Memory: "},{"$f":"VLOOKUP(E1975,INVENTORYDATA,6,FALSE)","v":{"$error":"#N/A"}},null,{"$f":"\"CPU/Speed: \"","v":"CPU/Speed: "},{"$f":"VLOOKUP(K1975,INVENTORYDATA,4,FALSE)&\" / \"&VLOOKUP(K1975,INVENTORYDATA,5,FALSE)&\"GHz\"","v":{"$error":"#N/A"}},null,{"$f":"\"Memory: \"","v":"Memory: "},{"$f":"VLOOKUP(K1975,INVENTORYDATA,6,FALSE)","v":{"$error":"#N/A"}}]
[]
["Key Function",null,"Pass","Fail ","Comments",null,"Key Function",null,"Pass","Fail ","Comments"]
["Hard Drive Removed",null,{"$f":"IF(ISBLANK(VLOOKUP(E1975,INVENTORYDATA,13,FALSE)),\"X\",\"\")","v":""},null,{"$f":"IF(ISBLANK(VLOOKUP(E1975,INVENTORYDATA,13,FALSE)),\"\",VLOOKUP(E1975,INVENTORYDATA,13,FALSE))","v":{"$error":"#N/A"}},null,"Hard Drive Removed",null,{"$f":"IF(ISBLANK(VLOOKUP(K1975,INVENTORYDATA,13,FALSE)),\"X\",\"\")","v":""},null,{"$f":"IF(ISBLANK(VLOOKUP(K1975,INVENTORYDATA,13,FALSE)),\"\",VLOOKUP(K1975,INVENTORYDATA,13,FALSE))","v":{"$error":"#N/A"}}]
["Install Memory",null,"X",{"$nulls":3},"Install Memory",null,"X"]
["Power ON",null,"X",{"$nulls":3},"Power ON",null,"X"]
["Record BIOS info",null,"X",{"$nulls":3},"Record BIOS info",null,"X"]
["Check Optical Drive",null,{"$f":"IF((VLOOKUP(E1975,INVENTORYDATA,7,FALSE))=\"YES\",\"X\",\"\")","v":{"$error":"#N/A"}},{"$f":"IF((VLOOKUP(E1975,INVENTORYDATA,7,FALSE))=\"NO\",\"X\",\"\")","v":{"$error":"#N/A"}},null,null,"Check Optical Drive",null,{"$f":"IF((VLOOKUP(K1975,INVENTORYDATA,7,FALSE))=\"YES\",\"X\",\"\")","v":{"$error":"#N/A"}},{"$f":"IF((VLOOKUP(K1975,INVENTORYDATA,7,FALSE))=\"NO\",\"X\",\"\")","v":{"$error":"#N/A"}}]
["Power Off",null,"X",{"$nulls":3},"Power Off",null,"X"]
["HDD Serial No.",null,{"$f":"IF(ISBLANK(VLOOKUP(E1975,INVENTORYDATA,12,FALSE)),\"\",VLOOKUP(E1975,INVENTORYDATA,12,FALSE))","v":{"$error":"#N/A"}},{"$nulls":3},"HDD Serial No.",null,{"$f":"IF(ISBLANK(VLOOKUP(K1975,INVENTORYDATA,12,FALSE)),\"\",VLOOKUP(K1975,INVENTORYDATA,12,FALSE))","v":{"$error":"#N/A"}}]
[]
["Tested for key functions,R2/Ready for Resale",{"$nulls":5},"Tested for key functions,R2/Ready for Resale"]
["BIOS Lock","Caddy","Optical","WebCam","Battery",null,"BIOS Lock","Caddy","Optical","WebCam","Battery"]
[null,null,{"$f":"VLOOKUP(E1975,INVENTORY!$A$2:$N$100,7,FALSE)","v":{"$error":"#N/A"}},{"$f":"VLOOKUP(E1975,INVENTORY!$A$2:$N$100,8,FALSE)","v":{"$error":"#N/A"}},{"$f":"VLOOKUP(E1975,INVENTORY!$A$2:$N$100,9,FALSE)","v":{"$error":"#N/A"}},{"$nulls":3},{"$f":"VLOOKUP(K1975,INVENTORY!$A$2:$N$100,7,FALSE)","v":{"$error":"#N/A"}},{"$f":"VLOOKUP(K1975,INVENTORY!$A$2:$N$100,8,FALSE)","v":{"$error":"#N/A"}},{"$f":"VLOOKUP(K1975,INVENTORY!$A$2:$N$100,9,FALSE)","v":{"$error":"#N/A"}}]
[]
["CPU Cosmetics Defects:",null,{"$f":"\"Function Code: \"&VLOOKUP(E1975,INVENTORY!$A$2:$Q$100,14,FALSE)","v":{"$error":"#N/A"}},{"$nulls":3},"CPU Cosmetics Defects:",null,{"$f":"\"Function Code: \"&VLOOKUP(K1975,INVENTORY!$A$2:$Q$100,14,FALSE)","v":{"$error":"#N/A"}}]
[]
[null,null,{"$f":"\"Cosmetic Code: \"&VLOOKUP(E1975,INVENTORY!$A$2:$Q$100,15,FALSE)","v":{"$error":"#N/A"}},{"$nulls":5},{"$f":"\"Cosmetic Code: \"&VLOOKUP(K1975,INVENTORY!$A$2:$Q$100,15,FALSE)","v":{"$error":"#N/A"}}]
[]
["Casing","Plugs/Ports",{"$nulls":4},"Casing","Plugs/Ports"]
["Pass","Pass",{"$nulls":4},"Pass","Pass"]
["Fail","Fail",null,"TRRC#:L.T.R.",null,null,"Fail","Fail",null,"TRRC#:L.T.R."]
[]
["LAPTOP TESTING RECORD",{"$nulls":5},"LAPTOP TESTING RECORD"]
[]
[{"$nulls":3},"ITEM #",{"$f":"E1975+2","v":139},{"$nulls":4},"ITEM #",{"$f":"K1975+2","v":140}]
["Tester: ","RR","Date:",{"$f":"NOW()","v":"2025-12-15T11:00:59.760"},null,null,"Tester: ","RR","Date:",{"$f":"NOW()","v":"2025-12-15T11:00:59.760"}]
["Type: ","LAPTOP","SN:",{"$f":"VLOOKUP(E2004,INVENTORYDATA,10,FALSE)","v":{"$error":"#N/A"}},null,null,"Type: ","LAPTOP","SN:",{"$f":"VLOOKUP(K2004,INVENTORYDATA,10,FALSE)","v":{"$error":"#N/A"}}]
[{"$f":"\"Make: \"","v":"Make: "},{"$f":"VLOOKUP(E2004,INVENTORYDATA,2,FALSE)","v":{"$error":"#N/A"}},{"$f":"\"Model: \"","v":"Model: "},{"$f":"VLOOKUP(E2004,INVENTORYDATA,3,FALSE)","v":{"$error":"#N/A"}},null,null,{"$f":"\"Make: \"","v":"Make: "},{"$f":"VLOOKUP(K2004,INVENTORYDATA,2,FALSE)","v":{"$error":"#N/A"}},{"$f":"\"Model: \"","v":"Model: "},{"$f":"VLOOKUP(K2004,INVENTORYDATA,3,FALSE)","v":{"$error":"#N/A"}}]
[{"$f":"\"CPU/Speed: \"","v":"CPU/Speed: "},{"$f":"VLOOKUP(E2004,INVENTORYDATA,4,FALSE)&\" / \"&VLOOKUP(E2004,INVENTORYDATA,5,FALSE)&\"GHz\"","v":{"$error":"#N/A"}},null,{"$f":"\"Memory: \"","v":"Memory: "},{"$f":"VLOOKUP(E2004,INVENTORYDATA,6,FALSE)","v":{"$error":"#N/A"}},null,{"$f":"\"CPU/Speed: \"","v":"CPU/Speed: "},{"$f":"VLOOKUP(K2004,INVENTORYDATA,4,FALSE)&\" / \"&VLOOKUP(K2004,INVENTORYDATA,5,FALSE)&\"GHz\"","v":{"$error":"#N/A"}},null,{"$f":"\"Memory: \"","v":"Memory: "},{"$f":"VLOOKUP(K2004,INVENTORYDATA,6,FALSE)","v":{"$error":"#N/A"}}]
[]
["Key Function",null,"Pass","Fail ","Comments",null,"Key Function",null,"Pass","Fail ","Comments"]
["Hard Drive Removed",null,{"$f":"IF(ISBLANK(VLOOKUP(E2004,INVENTORYDATA,13,FALSE)),\"X\",\"\")","v":""},null,{"$f":"IF(ISBLANK(VLOOKUP(E2004,INVENTORYDATA,13,FALSE)),\"\",VLOOKUP(E2004,INVENTORYDATA,13,FALSE))","v":{"$error":"#N/A"}},null,"Hard Drive Removed",null,{"$f":"IF(ISBLANK(VLOOKUP(K2004,INVENTORYDATA,13,FALSE)),\"X\",\"\")","v":""},null,{"$f":"IF(ISBLANK(VLOOKUP(K2004,INVENTORYDATA,13,FALSE)),\"\",VLOOKUP(K2004,INVENTORYDATA,13,FALSE))","v":{"$error":"#N/A"}}]
["Install Memory",null,"X",{"$nulls":3},"Install Memory",null,"X"]
["Power ON",null,"X",{"$nulls":3},"Power ON",null,"X"]
["Record BIOS info",null,"X",{"$nulls":3},"Record BIOS info",null,"X"]
["Check Optical Drive",null,{"$f":"IF((VLOOKUP(E2004,INVENTORYDATA,7,FALSE))=\"YES\",\"X\",\"\")","v":{"$error":"#N/A"}},{"$f":"IF((VLOOKUP(E2004,INVENTORYDATA,7,FALSE))=\"NO\",\"X\",\"\")","v":{"$error":"#N/A"}},null,null,"Check Optical Drive",null,{"$f":"IF((VLOOKUP(K2004,INVENTORYDATA,7,FALSE))=\"YES\",\"X\",\"\")","v":{"$error":"#N/A"}},{"$f":"IF((VLOOKUP(K2004,INVENTORYDATA,7,FALSE))=\"NO\",\"X\",\"\")","v":{"$error":"#N/A"}}]
["Power Off",null,"X",{"$nulls":3},"Power Off",null,"X"]
["HDD Serial No.",null,{"$f":"IF(ISBLANK(VLOOKUP(E2004,INVENTORYDATA,12,FALSE)),\"\",VLOOKUP(E2004,INVENTORYDATA,12,FALSE))","v":{"$error":"#N/A"}},{"$nulls":3},"HDD Serial No.",null,{"$f":"IF(ISBLANK(VLOOKUP(K2004,INVENTORYDATA,12,FALSE)),\"\",VLOOKUP(K2004,INVENTORYDATA,12,FALSE))","v":{"$error":"#N/A"}}]
[]
["Tested for key functions,R2/Ready for Resale",{"$nulls":5},"Tested for key functions,R2/Ready for Resale"]
["BIOS Lock","Caddy","Optical","WebCam","Battery",null,"BIOS Lock","Caddy","Optical","WebCam","Battery"]
[null,null,{"$f":"VLOOKUP(E2004,INVENTORY!$A$2:$N$100,7,FALSE)","v":{"$error":"#N/A"}},{"$f":"VLOOKUP(E2004,INVENTORY!$A$2:$N$100,8,FALSE)","v":{"$error":"#N/A"}},{"$f":"VLOOKUP(E2004,INVENTORY!$A$2:$N$100,9,FALSE)","v":{"$error":"#N/A"}},{"$nulls":3},{"$f":"VLOOKUP(K2004,INVENTORY!$A$2:$N$100,7,FALSE)","v":{"$error":"#N/A"}},{"$f":"VLOOKUP(K2004,INVENTORY!$A$2:$N$100,8,FALSE)","v":{"$error":"#N/A"}},{"$f":"VLOOKUP(K2004,INVENTORY!$A$2:$N$100,9,FALSE)","v":{"$error":"#N/A"}}]
[]
["CPU Cosmetics Defects:",null,{"$f":"\"Function Code: \"&VLOOKUP(E2004,INVENTORY!$A$2:$Q$100,14,FALSE)","v":{"$error":"#N/A"}},{"$nulls":3},"CPU Cosmetics Defects:",null,{"$f":"\"Function Code: \"&VLOOKUP(K2004,INVENTORY!$A$2:$Q$100,14,FALSE)","v":{"$error":"#N/A"}}]
[]
[null,null,{"$f":"\"Cosmetic Code: \"&VLOOKUP(E2004,INVENTORY!$A$2:$Q$100,15,FALSE)","v":{"$error":"#N/A"}},{"$nulls":5},{"$f":"\"Cosmetic Code: \"&VLOOKUP(K2004,INVENTORY!$A$2:$Q$100,15,FALSE)","v":{"$error":"#N/A"}}]
[]
["Casing","Plugs/Ports",{"$nulls":4},"Casing","Plugs/Ports"]
["Pass","Pass",{"$nulls":4},"Pass","Pass"]
["Fail","Fail",null,"TRRC#:L.T.R.",null,null,"Fail","Fail",null,"TRRC#:L.T.R."]
[]
["LAPTOP TESTING RECORD",{"$nulls":5},"LAPTOP TESTING RECORD"]
[]
[{"$nulls":3},"ITEM #",{"$f":"E2004+2","v":141},{"$nulls":4},"ITEM #",{"$f":"K2004+2","v":142}]
["Tester: ","RR","Date:",{"$f":"NOW()","v":"2025-12-15T11:00:59.760"},null,null,"Tester: ","RR","Date:",{"$f":"NOW()","v":"2025-12-15T11:00:59.760"}]
["Type: ","LAPTOP","SN:",{"$f":"VLOOKUP(E2033,INVENTORYDATA,10,FALSE)","v":{"$error":"#N/A"}},null,null,"Type: ","LAPTOP","SN:",{"$f":"VLOOKUP(K2033,INVENTORYDATA,10,FALSE)","v":{"$error":"#N/A"}}]
[{"$f":"\"Make: \"","v":"Make: "},{"$f":"VLOOKUP(E2033,INVENTORYDATA,2,FALSE)","v":{"$error":"#N/A"}},{"$f":"\"Model: \"","v":"Model: "},{"$f":"VLOOKUP(E2033,INVENTORYDATA,3,FALSE)","v":{"$error":"#N/A"}},null,null,{"$f":"\"Make: \"","v":"Make: "},{"$f":"VLOOKUP(K2033,INVENTORYDATA,2,FALSE)","v":{"$error":"#N/A"}},{"$f":"\"Model: \"","v":"Model: "},{"$f":"VLOOKUP(K2033,INVENTORYDATA,3,FALSE)","v":{"$error":"#N/A"}}]
[{"$f":"\"CPU/Speed: \"","v":"CPU/Speed: "},{"$f":"VLOOKUP(E2033,INVENTORYDATA,4,FALSE)&\" / \"&VLOOKUP(E2033,INVENTORYDATA,5,FALSE)&\"GHz\"","v":{"$error":"#N/A"}},null,{"$f":"\"Memory: \"","v":"Memory: "},{"$f":"VLOOKUP(E2033,INVENTORYDATA,6,FALSE)","v":{"$error":"#N/A"}},null,{"$f":"\"CPU/Speed: \"","v":"CPU/Speed: "},{"$f":"VLOOKUP(K2033,INVENTORYDATA,4,FALSE)&\" / \"&VLOOKUP(K2033,INVENTORYDATA,5,FALSE)&\"GHz\"","v":{"$error":"#N/A"}},null,{"$f":"\"Memory: \"","v":"Memory: "},{"$f":"VLOOKUP(K2033,INVENTORYDATA,6,FALSE)","v":{"$error":"#N/A"}}]
[]
["Key Function",null,"Pass","Fail ","Comments",null,"Key Function",null,"Pass","Fail ","Comments"]
["Hard Drive Removed",null,{"$f":"IF(ISBLANK(VLOOKUP(E2033,INVENTORYDATA,13,FALSE)),\"X\",\"\")","v":""},null,{"$f":"IF(ISBLANK(VLOOKUP(E2033,INVENTORYDATA,13,FALSE)),\"\",VLOOKUP(E2033,INVENTORYDATA,13,FALSE))","v":{"$error":"#N/A"}},null,"Hard Drive Removed",null,{"$f":"IF(ISBLANK(VLOOKUP(K2033,INVENTORYDATA,13,FALSE)),\"X\",\"\")","v":""},null,{"$f":"IF(ISBLANK(VLOOKUP(K2033,INVENTORYDATA,13,FALSE)),\"\",VLOOKUP(K2033,INVENTORYDATA,13,FALSE))","v":{"$error":"#N/A"}}]
["Install Memory",null,"X",{"$nulls":3},"Install Memory",null,"X"]
["Power ON",null,"X",{"$nulls":3},"Power ON",null,"X"]
["Record BIOS info",null,"X",{"$nulls":3},"Record BIOS info",null,"X"]
["Check Optical Drive",null,{"$f":"IF((VLOOKUP(E2033,INVENTORYDATA,7,FALSE))=\"YES\",\"X\",\"\")","v":{"$error":"#N/A"}},{"$f":"IF((VLOOKUP(E2033,INVENTORYDATA,7,FALSE))=\"NO\",\"X\",\"\")","v":{"$error":"#N/A"}},null,null,"Check Optical Drive",null,{"$f":"IF((VLOOKUP(K2033,INVENTORYDATA,7,FALSE))=\"YES\",\"X\",\"\")","v":{"$error":"#N/A"}},{"$f":"IF((VLOOKUP(K2033,INVENTORYDATA,7,FALSE))=\"NO\",\"X\",\"\")","v":{"$error":"#N/A"}}]
["Power Off",null,"X",{"$nulls":3},"Power Off",null,"X"]
["HDD Serial No.",null,{"$f":"IF(ISBLANK(VLOOKUP(E2033,INVENTORYDATA,12,FALSE)),\"\",VLOOKUP(E2033,INVENTORYDATA,12,FALSE))","v":{"$error":"#N/A"}},{"$nulls":3},"HDD Serial No.",null,{"$f":"IF(ISBLANK(VLOOKUP(K2033,INVENTORYDATA,12,FALSE)),\"\",VLOOKUP(K2033,INVENTORYDATA,12,FALSE))","v":{"$error":"#N/A"}}]
[]
["Tested for key functions,R2/Ready for Resale",{"$nulls":5},"Tested for key functions,R2/Ready for Resale"]
["BIOS Lock","Caddy","Optical","WebCam","Battery",null,"BIOS Lock","Caddy","Optical","WebCam","Battery"]
[null,null,{"$f":"VLOOKUP(E2033,INVENTORY!$A$2:$N$100,7,FALSE)","v":{"$error":"#N/A"}},{"$f":"VLOOKUP(E2033,INVENTORY!$A$2:$N$100,8,FALSE)","v":{"$error":"#N/A"}},{"$f":"VLOOKUP(E2033,INVENTORY!$A$2:$N$100,9,FALSE)","v":{"$error":"#N/A"}},{"$nulls":3},{"$f":"VLOOKUP(K2033,INVENTORY!$A$2:$N$100,7,FALSE)","v":{"$error":"#N/A"}},{"$f":"VLOOKUP(K2033,INVENTORY!$A$2:$N$100,8,FALSE)","v":{"$error":"#N/A"}},{"$f":"VLOOKUP(K2033,INVENTORY!$A$2:$N$100,9,FALSE)","v":{"$error":"#N/A"}}]
[]
["CPU Cosmetics Defects:",null,{"$f":"\"Function Code: \"&VLOOKUP(E2033,INVENTORY!$A$2:$Q$100,14,FALSE)","v":{"$error":"#N/A"}},{"$nulls":3},"CPU Cosmetics Defects:",null,{"$f":"\"Function Code: \"&VLOOKUP(K2033,INVENTORY!$A$2:$Q$100,14,FALSE)","v":{"$error":"#N/A"}}]
[]
[null,null,{"$f":"\"Cosmetic Code: \"&VLOOKUP(E2033,INVENTORY!$A$2:$Q$100,15,FALSE)","v":{"$error":"#N/A"}},{"$nulls":5},{"$f":"\"Cosmetic Code: \"&VLOOKUP(K2033,INVENTORY!$A$2:$Q$100,15,FALSE)","v":{"$error":"#N/A"}}]
[]
["Casing","Plugs/Ports",{"$nulls":4},"Casing","Plugs/Ports"]
["Pass","Pass",{"$nulls":4},"Pass","Pass"]
["Fail","Fail",null,"TRRC#:L.T.R.",null,null,"Fail","Fail",null,"TRRC#:L.T.R."]
[]
["LAPTOP TESTING RECORD",{"$nulls":5},"LAPTOP TESTING RECORD"]
[]
[{"$nulls":3},"ITEM #",{"$f":"E2033+2","v":143},{"$nulls":4},"ITEM #",{"$f":"K2033+2","v":144}]
["Tester: ","RR","Date:",{"$f":"NOW()","v":"2025-12-15T11:00:59.760"},null,null,"Tester: ","RR","Date:",{"$f":"NOW()","v":"2025-12-15T11:00:59.760"}]
["Type: ","LAPTOP","SN:",{"$f":"VLOOKUP(E2062,INVENTORYDATA,10,FALSE)","v":{"$error":"#N/A"}},null,null,"Type: ","LAPTOP","SN:",{"$f":"VLOOKUP(K2062,INVENTORYDATA,10,FALSE)","v":{"$error":"#N/A"}}]
[{"$f":"\"Make: \"","v":"Make: "},{"$f":"VLOOKUP(E2062,INVENTORYDATA,2,FALSE)","v":{"$error":"#N/A"}},{"$f":"\"Model: \"","v":"Model: "},{"$f":"VLOOKUP(E2062,INVENTORYDATA,3,FALSE)","v":{"$error":"#N/A"}},null,null,{"$f":"\"Make: \"","v":"Make: "},{"$f":"VLOOKUP(K2062,INVENTORYDATA,2,FALSE)","v":{"$error":"#N/A"}},{"$f":"\"Model: \"","v":"Model: "},{"$f":"VLOOKUP(K2062,INVENTORYDATA,3,FALSE)","v":{"$error":"#N/A"}}]
[{"$f":"\"CPU/Speed: \"","v":"CPU/Speed: "},{"$f":"VLOOKUP(E2062,INVENTORYDATA,4,FALSE)&\" / \"&VLOOKUP(E2062,INVENTORYDATA,5,FALSE)&\"GHz\"","v":{"$error":"#N/A"}},null,{"$f":"\"Memory: \"","v":"Memory: "},{"$f":"VLOOKUP(E2062,INVENTORYDATA,6,FALSE)","v":{"$error":"#N/A"}},null,{"$f":"\"CPU/Speed: \"","v":"CPU/Speed: "},{"$f":"VLOOKUP(K2062,INVENTORYDATA,4,FALSE)&\" / \"&VLOOKUP(K2062,INVENTORYDATA,5,FALSE)&\"GHz\"","v":{"$error":"#N/A"}},null,{"$f":"\"Memory: \"","v":"Memory: "},{"$f":"VLOOKUP(K2062,INVENTORYDATA,6,FALSE)","v":{"$error":"#N/A"}}]
[]
["Key Function",null,"Pass","Fail ","Comments",null,"Key Function",null,"Pass","Fail ","Comments"]
["Hard Drive Removed",null,{"$f":"IF(ISBLANK(VLOOKUP(E2062,INVENTORYDATA,13,FALSE)),\"X\",\"\")","v":""},null,{"$f":"IF(ISBLANK(VLOOKUP(E2062,INVENTORYDATA,13,FALSE)),\"\",VLOOKUP(E2062,INVENTORYDATA,13,FALSE))","v":{"$error":"#N/A"}},null,"Hard Drive Removed",null,{"$f":"IF(ISBLANK(VLOOKUP(K2062,INVENTORYDATA,13,FALSE)),\"X\",\"\")","v":""},null,{"$f":"IF(ISBLANK(VLOOKUP(K2062,INVENTORYDATA,13,FALSE)),\"\",VLOOKUP(K2062,INVENTORYDATA,13,FALSE))","v":{"$error":"#N/A"}}]
["Install Memory",null,"X",{"$nulls":3},"Install Memory",null,"X"]
["Power ON",null,"X",{"$nulls":3},"Power ON",null,"X"]
["Record BIOS info",null,"X",{"$nulls":3},"Record BIOS info",null,"X"]
["Check Optical Drive",null,{"$f":"IF((VLOOKUP(E2062,INVENTORYDATA,7,FALSE))=\"YES\",\"X\",\"\")","v":{"$error":"#N/A"}},{"$f":"IF((VLOOKUP(E2062,INVENTORYDATA,7,FALSE))=\"NO\",\"X\",\"\")","v":{"$error":"#N/A"}},null,null,"Check Optical Drive",null,{"$f":"IF((VLOOKUP(K2062,INVENTORYDATA,7,FALSE))=\"YES\",\"X\",\"\")","v":{"$error":"#N/A"}},{"$f":"IF((VLOOKUP(K2062,INVENTORYDATA,7,FALSE))=\"NO\",\"X\",\"\")","v":{"$error":"#N/A"}}]
["Power Off",null,"X",{"$nulls":3},"Power Off",null,"X"]
["HDD Serial No.",null,{"$f":"IF(ISBLANK(VLOOKUP(E2062,INVENTORYDATA,12,FALSE)),\"\",VLOOKUP(E2062,INVENTORYDATA,12,FALSE))","v":{"$error":"#N/A"}},{"$nulls":3},"HDD Serial No.",null,{"$f":"IF(ISBLANK(VLOOKUP(K2062,INVENTORYDATA,12,FALSE)),\"\",VLOOKUP(K2062,INVENTORYDATA,12,FALSE))","v":{"$error":"#N/A"}}]
[]
["Tested for key functions,R2/Ready for Resale",{"$nulls":5},"Tested for key functions,R2/Ready for Resale"]
["BIOS Lock","Caddy","Optical","WebCam","Battery",null,"BIOS Lock","Caddy","Optical","WebCam","Battery"]
[null,null,{"$f":"VLOOKUP(E2062,INVENTORY!$A$2:$N$100,7,FALSE)","v":{"$error":"#N/A"}},{"$f":"VLOOKUP(E2062,INVENTORY!$A$2:$N$100,8,FALSE)","v":{"$error":"#N/A"}},{"$f":"VLOOKUP(E2062,INVENTORY!$A$2:$N$100,9,FALSE)","v":{"$error":"#N/A"}},{"$nulls":3},{"$f":"VLOOKUP(K2062,INVENTORY!$A$2:$N$100,7,FALSE)","v":{"$error":"#N/A"}},{"$f":"VLOOKUP(K2062,INVENTORY!$A$2:$N$100,8,FALSE)","v":{"$error":"#N/A"}},{"$f":"VLOOKUP(K2062,INVENTORY!$A$2:$N$100,9,FALSE)","v":{"$error":"#N/A"}}]
[]
["CPU Cosmetics Defects:",null,{"$f":"\"Function Code: \"&VLOOKUP(E2062,INVENTORY!$A$2:$Q$100,14,FALSE)","v":{"$error":"#N/A"}},{"$nulls":3},"CPU Cosmetics Defects:",null,{"$f":"\"Function Code: \"&VLOOKUP(K2062,INVENTORY!$A$2:$Q$100,14,FALSE)","v":{"$error":"#N/A"}}]
[]
[null,null,{"$f":"\"Cosmetic Code: \"&VLOOKUP(E2062,INVENTORY!$A$2:$Q$100,15,FALSE)","v":{"$error":"#N/A"}},{"$nulls":5},{"$f":"\"Cosmetic Code: \"&VLOOKUP(K2062,INVENTORY!$A$2:$Q$100,15,FALSE)","v":{"$error":"#N/A"}}]
[]
["Casing","Plugs/Ports",{"$nulls":4},"Casing","Plugs/Ports"]
["Pass","Pass",{"$nulls":4},"Pass","Pass"]
["Fail","Fail",null,"TRRC#:L.T.R.",null,null,"Fail","Fail",null,"TRRC#:L.T.R."]
[]
["LAPTOP TESTING RECORD",{"$nulls":5},"LAPTOP TESTING RECORD"]
[]
[{"$nulls":3},"ITEM #",{"$f":"E2062+2","v":145},{"$nulls":4},"ITEM #",{"$f":"K2062+2","v":146}]
["Tester: ","RR","Date:",{"$f":"NOW()","v":"2025-12-15T11:00:59.760"},null,null,"Tester: ","RR","Date:",{"$f":"NOW()","v":"2025-12-15T11:00:59.760"}]
["Type: ","LAPTOP","SN:",{"$f":"VLOOKUP(E2091,INVENTORYDATA,10,FALSE)","v":{"$error":"#N/A"}},null,null,"Type: ","LAPTOP","SN:",{"$f":"VLOOKUP(K2091,INVENTORYDATA,10,FALSE)","v":{"$error":"#N/A"}}]
[{"$f":"\"Make: \"","v":"Make: "},{"$f":"VLOOKUP(E2091,INVENTORYDATA,2,FALSE)","v":{"$error":"#N/A"}},{"$f":"\"Model: \"","v":"Model: "},{"$f":"VLOOKUP(E2091,INVENTORYDATA,3,FALSE)","v":{"$error":"#N/A"}},null,null,{"$f":"\"Make: \"","v":"Make: "},{"$f":"VLOOKUP(K2091,INVENTORYDATA,2,FALSE)","v":{"$error":"#N/A"}},{"$f":"\"Model: \"","v":"Model: "},{"$f":"VLOOKUP(K2091,INVENTORYDATA,3,FALSE)","v":{"$error":"#N/A"}}]
[{"$f":"\"CPU/Speed: \"","v":"CPU/Speed: "},{"$f":"VLOOKUP(E2091,INVENTORYDATA,4,FALSE)&\" / \"&VLOOKUP(E2091,INVENTORYDATA,5,FALSE)&\"GHz\"","v":{"$error":"#N/A"}},null,{"$f":"\"Memory: \"","v":"Memory: "},{"$f":"VLOOKUP(E2091,INVENTORYDATA,6,FALSE)","v":{"$error":"#N/A"}},null,{"$f":"\"CPU/Speed: \"","v":"CPU/Speed: "},{"$f":"VLOOKUP(K2091,INVENTORYDATA,4,FALSE)&\" / \"&VLOOKUP(K2091,INVENTORYDATA,5,FALSE)&\"GHz\"","v":{"$error":"#N/A"}},null,{"$f":"\"Memory: \"","v":"Memory: "},{"$f":"VLOOKUP(K2091,INVENTORYDATA,6,FALSE)","v":{"$error":"#N/A"}}]
[]
["Key Function",null,"Pass","Fail ","Comments",null,"Key Function",null,"Pass","Fail ","Comments"]
["Hard Drive Removed",null,{"$f":"IF(ISBLANK(VLOOKUP(E2091,INVENTORYDATA,13,FALSE)),\"X\",\"\")","v":""},null,{"$f":"IF(ISBLANK(VLOOKUP(E2091,INVENTORYDATA,13,FALSE)),\"\",VLOOKUP(E2091,INVENTORYDATA,13,FALSE))","v":{"$error":"#N/A"}},null,"Hard Drive Removed",null,{"$f":"IF(ISBLANK(VLOOKUP(K2091,INVENTORYDATA,13,FALSE)),\"X\",\"\")","v":""},null,{"$f":"IF(ISBLANK(VLOOKUP(K2091,INVENTORYDATA,13,FALSE)),\"\",VLOOKUP(K2091,INVENTORYDATA,13,FALSE))","v":{"$error":"#N/A"}}]
["Install Memory",null,"X",{"$nulls":3},"Install Memory",null,"X"]
["Power ON",null,"X",{"$nulls":3},"Power ON",null,"X"]
["Record BIOS info",null,"X",{"$nulls":3},"Record BIOS info",null,"X"]
["Check Optical Drive",null,{"$f":"IF((VLOOKUP(E2091,INVENTORYDATA,7,FALSE))=\"YES\",\"X\",\"\")","v":{"$error":"#N/A"}},{"$f":"IF((VLOOKUP(E2091,INVENTORYDATA,7,FALSE))=\"NO\",\"X\",\"\")","v":{"$error":"#N/A"}},null,null,"Check Optical Drive",null,{"$f":"IF((VLOOKUP(K2091,INVENTORYDATA,7,FALSE))=\"YES\",\"X\",\"\")","v":{"$error":"#N/A"}},{"$f":"IF((VLOOKUP(K2091,INVENTORYDATA,7,FALSE))=\"NO\",\"X\",\"\")","v":{"$error":"#N/A"}}]
["Power Off",null,"X",{"$nulls":3},"Power Off",null,"X"]
["HDD Serial No.",null,{"$f":"IF(ISBLANK(VLOOKUP(E2091,INVENTORYDATA,12,FALSE)),\"\",VLOOKUP(E2091,INVENTORYDATA,12,FALSE))","v":{"$error":"#N/A"}},{"$nulls":3},"HDD Serial No.",null,{"$f":"IF(ISBLANK(VLOOKUP(K2091,INVENTORYDATA,12,FALSE)),\"\",VLOOKUP(K2091,INVENTORYDATA,12,FALSE))","v":{"$error":"#N/A"}}]
[]
["Tested for key functions,R2/Ready for Resale",{"$nulls":5},"Tested for key functions,R2/Ready for Resale"]
["BIOS Lock","Caddy","Optical","WebCam","Battery",null,"BIOS Lock","Caddy","Optical","WebCam","Battery"]
[null,null,{"$f":"VLOOKUP(E2091,INVENTORY!$A$2:$N$100,7,FALSE)","v":{"$error":"#N/A"}},{"$f":"VLOOKUP(E2091,INVENTORY!$A$2:$N$100,8,FALSE)","v":{"$error":"#N/A"}},{"$f":"VLOOKUP(E2091,INVENTORY!$A$2:$N$100,9,FALSE)","v":{"$error":"#N/A"}},{"$nulls":3},{"$f":"VLOOKUP(K2091,INVENTORY!$A$2:$N$100,7,FALSE)","v":{"$error":"#N/A"}},{"$f":"VLOOKUP(K2091,INVENTORY!$A$2:$N$100,8,FALSE)","v":{"$error":"#N/A"}},{"$f":"VLOOKUP(K2091,INVENTORY!$A$2:$N$100,9,FALSE)","v":{"$error":"#N/A"}}]
[]
["CPU Cosmetics Defects:",null,{"$f":"\"Function Code: \"&VLOOKUP(E2091,INVENTORY!$A$2:$Q$100,14,FALSE)","v":{"$error":"#N/A"}},{"$nulls":3},"CPU Cosmetics Defects:",null,{"$f":"\"Function Code: \"&VLOOKUP(K2091,INVENTORY!$A$2:$Q$100,14,FALSE)","v":{"$error":"#N/A"}}]
[]
[null,null,{"$f":"\"Cosmetic Code: \"&VLOOKUP(E2091,INVENTORY!$A$2:$Q$100,15,FALSE)","v":{"$error":"#N/A"}},{"$nulls":5},{"$f":"\"Cosmetic Code: \"&VLOOKUP(K2091,INVENTORY!$A$2:$Q$100,15,FALSE)","v":{"$error":"#N/A"}}]
[]
["Casing","Plugs/Ports",{"$nulls":4},"Casing","Plugs/Ports"]
["Pass","Pass",{"$nulls":4},"Pass","Pass"]
["Fail","Fail",null,"TRRC#:L.T.R.",null,null,"Fail","Fail",null,"TRRC#:L.T.R."]
[]
["LAPTOP TESTING RECORD",{"$nulls":5},"LAPTOP TESTING RECORD"]
[]
[{"$nulls":3},"ITEM #",{"$f":"E2091+2","v":147},{"$nulls":4},"ITEM #",{"$f":"K2091+2","v":148}]
["Tester: ","RR","Date:",{"$f":"NOW()","v":"2025-12-15T11:00:59.760"},null,null,"Tester: ","RR","Date:",{"$f":"NOW()","v":"2025-12-15T11:00:59.760"}]
["Type: ","LAPTOP","SN:",{"$f":"VLOOKUP(E2120,INVENTORYDATA,10,FALSE)","v":{"$error":"#N/A"}},null,null,"Type: ","LAPTOP","SN:",{"$f":"VLOOKUP(K2120,INVENTORYDATA,10,FALSE)","v":{"$error":"#N/A"}}]
[{"$f":"\"Make: \"","v":"Make: "},{"$f":"VLOOKUP(E2120,INVENTORYDATA,2,FALSE)","v":{"$error":"#N/A"}},{"$f":"\"Model: \"","v":"Model: "},{"$f":"VLOOKUP(E2120,INVENTORYDATA,3,FALSE)","v":{"$error":"#N/A"}},null,null,{"$f":"\"Make: \"","v":"Make: "},{"$f":"VLOOKUP(K2120,INVENTORYDATA,2,FALSE)","v":{"$error":"#N/A"}},{"$f":"\"Model: \"","v":"Model: "},{"$f":"VLOOKUP(K2120,INVENTORYDATA,3,FALSE)","v":{"$error":"#N/A"}}]
[{"$f":"\"CPU/Speed: \"","v":"CPU/Speed: "},{"$f":"VLOOKUP(E2120,INVENTORYDATA,4,FALSE)&\" / \"&VLOOKUP(E2120,INVENTORYDATA,5,FALSE)&\"GHz\"","v":{"$error":"#N/A"}},null,{"$f":"\"Memory: \"","v":"Memory: "},{"$f":"VLOOKUP(E2120,INVENTORYDATA,6,FALSE)","v":{"$error":"#N/A"}},null,{"$f":"\"CPU/Speed: \"","v":"CPU/Speed: "},{"$f":"VLOOKUP(K2120,INVENTORYDATA,4,FALSE)&\" / \"&VLOOKUP(K2120,INVENTORYDATA,5,FALSE)&\"GHz\"","v":{"$error":"#N/A"}},null,{"$f":"\"Memory: \"","v":"Memory: "},{"$f":"VLOOKUP(K2120,INVENTORYDATA,6,FALSE)","v":{"$error":"#N/A"}}]
[]
["Key Function",null,"Pass","Fail ","Comments",null,"Key Function",null,"Pass","Fail ","Comments"]
["Hard Drive Removed",null,{"$f":"IF(ISBLANK(VLOOKUP(E2120,INVENTORYDATA,13,FALSE)),\"X\",\"\")","v":""},null,{"$f":"IF(ISBLANK(VLOOKUP(E2120,INVENTORYDATA,13,FALSE)),\"\",VLOOKUP(E2120,INVENTORYDATA,13,FALSE))","v":{"$error":"#N/A"}},null,"Hard Drive Removed",null,{"$f":"IF(ISBLANK(VLOOKUP(K2120,INVENTORYDATA,13,FALSE)),\"X\",\"\")","v":""},null,{"$f":"IF(ISBLANK(VLOOKUP(K2120,INVENTORYDATA,13,FALSE)),\"\",VLOOKUP(K2120,INVENTORYDATA,13,FALSE))","v":{"$error":"#N/A"}}]
["Install Memory",null,"X",{"$nulls":3},"Install Memory",null,"X"]
["Power ON",null,"X",{"$nulls":3},"Power ON",null,"X"]
["Record BIOS info",null,"X",{"$nulls":3},"Record BIOS info",null,"X"]
["Check Optical Drive",null,{"$f":"IF((VLOOKUP(E2120,INVENTORYDATA,7,FALSE))=\"YES\",\"X\",\"\")","v":{"$error":"#N/A"}},{"$f":"IF((VLOOKUP(E2120,INVENTORYDATA,7,FALSE))=\"NO\",\"X\",\"\")","v":{"$error":"#N/A"}},null,null,"Check Optical Drive",null,{"$f":"IF((VLOOKUP(K2120,INVENTORYDATA,7,FALSE))=\"YES\",\"X\",\"\")","v":{"$error":"#N/A"}},{"$f":"IF((VLOOKUP(K2120,INVENTORYDATA,7,FALSE))=\"NO\",\"X\",\"\")","v":{"$error":"#N/A"}}]
["Power Off",null,"X",{"$nulls":3},"Power Off",null,"X"]
["HDD Serial No.",null,{"$f":"IF(ISBLANK(VLOOKUP(E2120,INVENTORYDATA,12,FALSE)),\"\",VLOOKUP(E2120,INVENTORYDATA,12,FALSE))","v":{"$error":"#N/A"}},{"$nulls":3},"HDD Serial No.",null,{"$f":"IF(ISBLANK(VLOOKUP(K2120,INVENTORYDATA,12,FALSE)),\"\",VLOOKUP(K2120,INVENTORYDATA,12,FALSE))","v":{"$error":"#N/A"}}]
[]
["Tested for key functions,R2/Ready for Resale",{"$nulls":5},"Tested for key functions,R2/Ready for Resale"]
["BIOS Lock","Caddy","Optical","WebCam","Battery",null,"BIOS Lock","Caddy","Optical","WebCam","Battery"]
[null,null,{"$f":"VLOOKUP(E2120,INVENTORY!$A$2:$N$100,7,FALSE)","v":{"$error":"#N/A"}},{"$f":"VLOOKUP(E2120,INVENTORY!$A$2:$N$100,8,FALSE)","v":{"$error":"#N/A"}},{"$f":"VLOOKUP(E2120,INVENTORY!$A$2:$N$100,9,FALSE)","v":{"$error":"#N/A"}},{"$nulls":3},{"$f":"VLOOKUP(K2120,INVENTORY!$A$2:$N$100,7,FALSE)","v":{"$error":"#N/A"}},{"$f":"VLOOKUP(K2120,INVENTORY!$A$2:$N$100,8,FALSE)","v":{"$error":"#N/A"}},{"$f":"VLOOKUP(K2120,INVENTORY!$A$2:$N$100,9,FALSE)","v":{"$error":"#N/A"}}]
[]
["CPU Cosmetics Defects:",null,{"$f":"\"Function Code: \"&VLOOKUP(E2120,INVENTORY!$A$2:$Q$100,14,FALSE)","v":{"$error":"#N/A"}},{"$nulls":3},"CPU Cosmetics Defects:",null,{"$f":"\"Function Code: \"&VLOOKUP(K2120,INVENTORY!$A$2:$Q$100,14,FALSE)","v":{"$error":"#N/A"}}]
[]
[null,null,{"$f":"\"Cosmetic Code: \"&VLOOKUP(E2120,INVENTORY!$A$2:$Q$100,15,FALSE)","v":{"$error":"#N/A"}},{"$nulls":5},{"$f":"\"Cosmetic Code: \"&VLOOKUP(K2120,INVENTORY!$A$2:$Q$100,15,FALSE)","v":{"$error":"#N/A"}}]
[]
["Casing","Plugs/Ports",{"$nulls":4},"Casing","Plugs/Ports"]
["Pass","Pass",{"$nulls":4},"Pass","Pass"]
["Fail","Fail",null,"TRRC#:L.T.R.",null,null,"Fail","Fail",null,"TRRC#:L.T.R."]
[]
["LAPTOP TESTING RECORD",{"$nulls":5},"LAPTOP TESTING RECORD"]
[]
[{"$nulls":3},"ITEM #",{"$f":"E2120+2","v":149},{"$nulls":4},"ITEM #",{"$f":"K2120+2","v":150}]
["Tester: ","RR","Date:",{"$f":"NOW()","v":"2025-12-15T11:00:59.760"},null,null,"Tester: ","RR","Date:",{"$f":"NOW()","v":"2025-12-15T11:00:59.760"}]
["Type: ","LAPTOP","SN:",{"$f":"VLOOKUP(E2149,INVENTORYDATA,10,FALSE)","v":{"$error":"#N/A"}},null,null,"Type: ","LAPTOP","SN:",{"$f":"VLOOKUP(K2149,INVENTORYDATA,10,FALSE)","v":{"$error":"#N/A"}}]
[{"$f":"\"Make: \"","v":"Make: "},{"$f":"VLOOKUP(E2149,INVENTORYDATA,2,FALSE)","v":{"$error":"#N/A"}},{"$f":"\"Model: \"","v":"Model: "},{"$f":"VLOOKUP(E2149,INVENTORYDATA,3,FALSE)","v":{"$error":"#N/A"}},null,null,{"$f":"\"Make: \"","v":"Make: "},{"$f":"VLOOKUP(K2149,INVENTORYDATA,2,FALSE)","v":{"$error":"#N/A"}},{"$f":"\"Model: \"","v":"Model: "},{"$f":"VLOOKUP(K2149,INVENTORYDATA,3,FALSE)","v":{"$error":"#N/A"}}]
[{"$f":"\"CPU/Speed: \"","v":"CPU/Speed: "},{"$f":"VLOOKUP(E2149,INVENTORYDATA,4,FALSE)&\" / \"&VLOOKUP(E2149,INVENTORYDATA,5,FALSE)&\"GHz\"","v":{"$error":"#N/A"}},null,{"$f":"\"Memory: \"","v":"Memory: "},{"$f":"VLOOKUP(E2149,INVENTORYDATA,6,FALSE)","v":{"$error":"#N/A"}},null,{"$f":"\"CPU/Speed: \"","v":"CPU/Speed: "},{"$f":"VLOOKUP(K2149,INVENTORYDATA,4,FALSE)&\" / \"&VLOOKUP(K2149,INVENTORYDATA,5,FALSE)&\"GHz\"","v":{"$error":"#N/A"}},null,{"$f":"\"Memory: \"","v":"Memory: "},{"$f":"VLOOKUP(K2149,INVENTORYDATA,6,FALSE)","v":{"$error":"#N/A"}}]
[]
["Key Function",null,"Pass","Fail ","Comments",null,"Key Function",null,"Pass","Fail ","Comments"]
["Hard Drive Removed",null,{"$f":"IF(ISBLANK(VLOOKUP(E2149,INVENTORYDATA,13,FALSE)),\"X\",\"\")","v":""},null,{"$f":"IF(ISBLANK(VLOOKUP(E2149,INVENTORYDATA,13,FALSE)),\"\",VLOOKUP(E2149,INVENTORYDATA,13,FALSE))","v":{"$error":"#N/A"}},null,"Hard Drive Removed",null,{"$f":"IF(ISBLANK(VLOOKUP(K2149,INVENTORYDATA,13,FALSE)),\"X\",\"\")","v":""},null,{"$f":"IF(ISBLANK(VLOOKUP(K2149,INVENTORYDATA,13,FALSE)),\"\",VLOOKUP(K2149,INVENTORYDATA,13,FALSE))","v":{"$error":"#N/A"}}]
["Install Memory",null,"X",{"$nulls":3},"Install Memory",null,"X"]
["Power ON",null,"X",{"$nulls":3},"Power ON",null,"X"]
["Record BIOS info",null,"X",{"$nulls":3},"Record BIOS info",null,"X"]
["Check Optical Drive",null,{"$f":"IF((VLOOKUP(E2149,INVENTORYDATA,7,FALSE))=\"YES\",\"X\",\"\")","v":{"$error":"#N/A"}},{"$f":"IF((VLOOKUP(E2149,INVENTORYDATA,7,FALSE))=\"NO\",\"X\",\"\")","v":{"$error":"#N/A"}},null,null,"Check Optical Drive",null,{"$f":"IF((VLOOKUP(K2149,INVENTORYDATA,7,FALSE))=\"YES\",\"X\",\"\")","v":{"$error":"#N/A"}},{"$f":"IF((VLOOKUP(K2149,INVENTORYDATA,7,FALSE))=\"NO\",\"X\",\"\")","v":{"$error":"#N/A"}}]
["Power Off",null,"X",{"$nulls":3},"Power Off",null,"X"]
["HDD Serial No.",null,{"$f":"IF(ISBLANK(VLOOKUP(E2149,INVENTORYDATA,12,FALSE)),\"\",VLOOKUP(E2149,INVENTORYDATA,12,FALSE))","v":{"$error":"#N/A"}},{"$nulls":3},"HDD Serial No.",null,{"$f":"IF(ISBLANK(VLOOKUP(K2149,INVENTORYDATA,12,FALSE)),\"\",VLOOKUP(K2149,INVENTORYDATA,12,FALSE))","v":{"$error":"#N/A"}}]
[]
["Tested for key functions,R2/Ready for Resale",{"$nulls":5},"Tested for key functions,R2/Ready for Resale"]
["BIOS Lock","Caddy","Optical","WebCam","Battery",null,"BIOS Lock","Caddy","Optical","WebCam","Battery"]
[null,null,{"$f":"VLOOKUP(E2149,INVENTORY!$A$2:$N$100,7,FALSE)","v":{"$error":"#N/A"}},{"$f":"VLOOKUP(E2149,INVENTORY!$A$2:$N$100,8,FALSE)","v":{"$error":"#N/A"}},{"$f":"VLOOKUP(E2149,INVENTORY!$A$2:$N$100,9,FALSE)","v":{"$error":"#N/A"}},{"$nulls":3},{"$f":"VLOOKUP(K2149,INVENTORY!$A$2:$N$100,7,FALSE)","v":{"$error":"#N/A"}},{"$f":"VLOOKUP(K2149,INVENTORY!$A$2:$N$100,8,FALSE)","v":{"$error":"#N/A"}},{"$f":"VLOOKUP(K2149,INVENTORY!$A$2:$N$100,9,FALSE)","v":{"$error":"#N/A"}}]
[]
["CPU Cosmetics Defects:",null,{"$f":"\"Function Code: \"&VLOOKUP(E2149,INVENTORY!$A$2:$Q$100,14,FALSE)","v":{"$error":"#N/A"}},{"$nulls":3},"CPU Cosmetics Defects:",null,{"$f":"\"Function Code: \"&VLOOKUP(K2149,INVENTORY!$A$2:$Q$100,14,FALSE)","v":{"$error":"#N/A"}}]
[]
[null,null,{"$f":"\"Cosmetic Code: \"&VLOOKUP(E2149,INVENTORY!$A$2:$Q$100,15,FALSE)","v":{"$error":"#N/A"}},{"$nulls":5},{"$f":"\"Cosmetic Code: \"&VLOOKUP(K2149,INVENTORY!$A$2:$Q$100,15,FALSE)","v":{"$error":"#N/A"}}]
[]
["Casing","Plugs/Ports",{"$nulls":4},"Casing","Plugs/Ports"]
["Pass","Pass",{"$nulls":4},"Pass","Pass"]
["Fail","Fail",null,"TRRC#:L.T.R.",null,null,"Fail","Fail",null,"TRRC#:L.T.R."]
[]
["LAPTOP TESTING RECORD",{"$nulls":5},"LAPTOP TESTING RECORD"]
[]
[{"$nulls":3},"ITEM #",{"$f":"E2149+2","v":151},{"$nulls":4},"ITEM #",{"$f":"K2149+2","v":152}]
["Tester: ","RR","Date:",{"$f":"NOW()","v":"2025-12-15T11:00:59.760"},null,null,"Tester: ","RR","Date:",{"$f":"NOW()","v":"2025-12-15T11:00:59.760"}]
["Type: ","LAPTOP","SN:",{"$f":"VLOOKUP(E2178,INVENTORYDATA,10,FALSE)","v":{"$error":"#N/A"}},null,null,"Type: ","LAPTOP","SN:",{"$f":"VLOOKUP(K2178,INVENTORYDATA,10,FALSE)","v":{"$error":"#N/A"}}]
[{"$f":"\"Make: \"","v":"Make: "},{"$f":"VLOOKUP(E2178,INVENTORYDATA,2,FALSE)","v":{"$error":"#N/A"}},{"$f":"\"Model: \"","v":"Model: "},{"$f":"VLOOKUP(E2178,INVENTORYDATA,3,FALSE)","v":{"$error":"#N/A"}},null,null,{"$f":"\"Make: \"","v":"Make: "},{"$f":"VLOOKUP(K2178,INVENTORYDATA,2,FALSE)","v":{"$error":"#N/A"}},{"$f":"\"Model: \"","v":"Model: "},{"$f":"VLOOKUP(K2178,INVENTORYDATA,3,FALSE)","v":{"$error":"#N/A"}}]
[{"$f":"\"CPU/Speed: \"","v":"CPU/Speed: "},{"$f":"VLOOKUP(E2178,INVENTORYDATA,4,FALSE)&\" / \"&VLOOKUP(E2178,INVENTORYDATA,5,FALSE)&\"GHz\"","v":{"$error":"#N/A"}},null,{"$f":"\"Memory: \"","v":"Memory: "},{"$f":"VLOOKUP(E2178,INVENTORYDATA,6,FALSE)","v":{"$error":"#N/A"}},null,{"$f":"\"CPU/Speed: \"","v":"CPU/Speed: "},{"$f":"VLOOKUP(K2178,INVENTORYDATA,4,FALSE)&\" / \"&VLOOKUP(K2178,INVENTORYDATA,5,FALSE)&\"GHz\"","v":{"$error":"#N/A"}},null,{"$f":"\"Memory: \"","v":"Memory: "},{"$f":"VLOOKUP(K2178,INVENTORYDATA,6,FALSE)","v":{"$error":"#N/A"}}]
[]
["Key Function",null,"Pass","Fail ","Comments",null,"Key Function",null,"Pass","Fail ","Comments"]
["Hard Drive Removed",null,{"$f":"IF(ISBLANK(VLOOKUP(E2178,INVENTORYDATA,13,FALSE)),\"X\",\"\")","v":""},null,{"$f":"IF(ISBLANK(VLOOKUP(E2178,INVENTORYDATA,13,FALSE)),\"\",VLOOKUP(E2178,INVENTORYDATA,13,FALSE))","v":{"$error":"#N/A"}},null,"Hard Drive Removed",null,{"$f":"IF(ISBLANK(VLOOKUP(K2178,INVENTORYDATA,13,FALSE)),\"X\",\"\")","v":""},null,{"$f":"IF(ISBLANK(VLOOKUP(K2178,INVENTORYDATA,13,FALSE)),\"\",VLOOKUP(K2178,INVENTORYDATA,13,FALSE))","v":{"$error":"#N/A"}}]
["Install Memory",null,"X",{"$nulls":3},"Install Memory",null,"X"]
["Power ON",null,"X",{"$nulls":3},"Power ON",null,"X"]
["Record BIOS info",null,"X",{"$nulls":3},"Record BIOS info",null,"X"]
["Check Optical Drive",null,{"$f":"IF((VLOOKUP(E2178,INVENTORYDATA,7,FALSE))=\"YES\",\"X\",\"\")","v":{"$error":"#N/A"}},{"$f":"IF((VLOOKUP(E2178,INVENTORYDATA,7,FALSE))=\"NO\",\"X\",\"\")","v":{"$error":"#N/A"}},null,null,"Check Optical Drive",null,{"$f":"IF((VLOOKUP(K2178,INVENTORYDATA,7,FALSE))=\"YES\",\"X\",\"\")","v":{"$error":"#N/A"}},{"$f":"IF((VLOOKUP(K2178,INVENTORYDATA,7,FALSE))=\"NO\",\"X\",\"\")","v":{"$error":"#N/A"}}]
["Power Off",null,"X",{"$nulls":3},"Power Off",null,"X"]
["HDD Serial No.",null,{"$f":"IF(ISBLANK(VLOOKUP(E2178,INVENTORYDATA,12,FALSE)),\"\",VLOOKUP(E2178,INVENTORYDATA,12,FALSE))","v":{"$error":"#N/A"}},{"$nulls":3},"HDD Serial No.",null,{"$f":"IF(ISBLANK(VLOOKUP(K2178,INVENTORYDATA,12,FALSE)),\"\",VLOOKUP(K2178,INVENTORYDATA,12,FALSE))","v":{"$error":"#N/A"}}]
[]
["Tested for key functions,R2/Ready for Resale",{"$nulls":5},"Tested for key functions,R2/Ready for Resale"]
["BIOS Lock","Caddy","Optical","WebCam","Battery",null,"BIOS Lock","Caddy","Optical","WebCam","Battery"]
[null,null,{"$f":"VLOOKUP(E2178,INVENTORY!$A$2:$N$100,7,FALSE)","v":{"$error":"#N/A"}},{"$f":"VLOOKUP(E2178,INVENTORY!$A$2:$N$100,8,FALSE)","v":{"$error":"#N/A"}},{"$f":"VLOOKUP(E2178,INVENTORY!$A$2:$N$100,9,FALSE)","v":{"$error":"#N/A"}},{"$nulls":3},{"$f":"VLOOKUP(K2178,INVENTORY!$A$2:$N$100,7,FALSE)","v":{"$error":"#N/A"}},{"$f":"VLOOKUP(K2178,INVENTORY!$A$2:$N$100,8,FALSE)","v":{"$error":"#N/A"}},{"$f":"VLOOKUP(K2178,INVENTORY!$A$2:$N$100,9,FALSE)","v":{"$error":"#N/A"}}]
[]
["CPU Cosmetics Defects:",null,{"$f":"\"Function Code: \"&VLOOKUP(E2178,INVENTORY!$A$2:$Q$100,14,FALSE)","v":{"$error":"#N/A"}},{"$nulls":3},"CPU Cosmetics Defects:",null,{"$f":"\"Function Code: \"&VLOOKUP(K2178,INVENTORY!$A$2:$Q$100,14,FALSE)","v":{"$error":"#N/A"}}]
[]
[null,null,{"$f":"\"Cosmetic Code: \"&VLOOKUP(E2178,INVENTORY!$A$2:$Q$100,15,FALSE)","v":{"$error":"#N/A"}},{"$nulls":5},{"$f":"\"Cosmetic Code: \"&VLOOKUP(K2178,INVENTORY!$A$2:$Q$100,15,FALSE)","v":{"$error":"#N/A"}}]
[]
["Casing","Plugs/Ports",{"$nulls":4},"Casing","Plugs/Ports"]
["Pass","Pass",{"$nulls":4},"Pass","Pass"]
["Fail","Fail",null,"TRRC#:L.T.R.",null,null,"Fail","Fail",null,"TRRC#:L.T.R."]
[]
["LAPTOP TESTING RECORD",{"$nulls":5},"LAPTOP TESTING RECORD"]
[]
[{"$nulls":3},"ITEM #",{"$f":"E2178+2","v":153},{"$nulls":4},"ITEM #",{"$f":"K2178+2","v":154}]
["Tester: ","RR","Date:",{"$f":"NOW()","v":"2025-12-15T11:00:59.760"},null,null,"Tester: ","RR","Date:",{"$f":"NOW()","v":"2025-12-15T11:00:59.760"}]
["Type: ","LAPTOP","SN:",{"$f":"VLOOKUP(E2207,INVENTORYDATA,10,FALSE)","v":{"$error":"#N/A"}},null,null,"Type: ","LAPTOP","SN:",{"$f":"VLOOKUP(K2207,INVENTORYDATA,10,FALSE)","v":{"$error":"#N/A"}}]
[{"$f":"\"Make: \"","v":"Make: "},{"$f":"VLOOKUP(E2207,INVENTORYDATA,2,FALSE)","v":{"$error":"#N/A"}},{"$f":"\"Model: \"","v":"Model: "},{"$f":"VLOOKUP(E2207,INVENTORYDATA,3,FALSE)","v":{"$error":"#N/A"}},null,null,{"$f":"\"Make: \"","v":"Make: "},{"$f":"VLOOKUP(K2207,INVENTORYDATA,2,FALSE)","v":{"$error":"#N/A"}},{"$f":"\"Model: \"","v":"Model: "},{"$f":"VLOOKUP(K2207,INVENTORYDATA,3,FALSE)","v":{"$error":"#N/A"}}]
[{"$f":"\"CPU/Speed: \"","v":"CPU/Speed: "},{"$f":"VLOOKUP(E2207,INVENTORYDATA,4,FALSE)&\" / \"&VLOOKUP(E2207,INVENTORYDATA,5,FALSE)&\"GHz\"","v":{"$error":"#N/A"}},null,{"$f":"\"Memory: \"","v":"Memory: "},{"$f":"VLOOKUP(E2207,INVENTORYDATA,6,FALSE)","v":{"$error":"#N/A"}},null,{"$f":"\"CPU/Speed: \"","v":"CPU/Speed: "},{"$f":"VLOOKUP(K2207,INVENTORYDATA,4,FALSE)&\" / \"&VLOOKUP(K2207,INVENTORYDATA,5,FALSE)&\"GHz\"","v":{"$error":"#N/A"}},null,{"$f":"\"Memory: \"","v":"Memory: "},{"$f":"VLOOKUP(K2207,INVENTORYDATA,6,FALSE)","v":{"$error":"#N/A"}}]
[]
["Key Function",null,"Pass","Fail ","Comments",null,"Key Function",null,"Pass","Fail ","Comments"]
["Hard Drive Removed",null,{"$f":"IF(ISBLANK(VLOOKUP(E2207,INVENTORYDATA,13,FALSE)),\"X\",\"\")","v":""},null,{"$f":"IF(ISBLANK(VLOOKUP(E2207,INVENTORYDATA,13,FALSE)),\"\",VLOOKUP(E2207,INVENTORYDATA,13,FALSE))","v":{"$error":"#N/A"}},null,"Hard Drive Removed",null,{"$f":"IF(ISBLANK(VLOOKUP(K2207,INVENTORYDATA,13,FALSE)),\"X\",\"\")","v":""},null,{"$f":"IF(ISBLANK(VLOOKUP(K2207,INVENTORYDATA,13,FALSE)),\"\",VLOOKUP(K2207,INVENTORYDATA,13,FALSE))","v":{"$error":"#N/A"}}]
["Install Memory",null,"X",{"$nulls":3},"Install Memory",null,"X"]
["Power ON",null,"X",{"$nulls":3},"Power ON",null,"X"]
["Record BIOS info",null,"X",{"$nulls":3},"Record BIOS info",null,"X"]
["Check Optical Drive",null,{"$f":"IF((VLOOKUP(E2207,INVENTORYDATA,7,FALSE))=\"YES\",\"X\",\"\")","v":{"$error":"#N/A"}},{"$f":"IF((VLOOKUP(E2207,INVENTORYDATA,7,FALSE))=\"NO\",\"X\",\"\")","v":{"$error":"#N/A"}},null,null,"Check Optical Drive",null,{"$f":"IF((VLOOKUP(K2207,INVENTORYDATA,7,FALSE))=\"YES\",\"X\",\"\")","v":{"$error":"#N/A"}},{"$f":"IF((VLOOKUP(K2207,INVENTORYDATA,7,FALSE))=\"NO\",\"X\",\"\")","v":{"$error":"#N/A"}}]
["Power Off",null,"X",{"$nulls":3},"Power Off",null,"X"]
["HDD Serial No.",null,{"$f":"IF(ISBLANK(VLOOKUP(E2207,INVENTORYDATA,12,FALSE)),\"\",VLOOKUP(E2207,INVENTORYDATA,12,FALSE))","v":{"$error":"#N/A"}},{"$nulls":3},"HDD Serial No.",null,{"$f":"IF(ISBLANK(VLOOKUP(K2207,INVENTORYDATA,12,FALSE)),\"\",VLOOKUP(K2207,INVENTORYDATA,12,FALSE))","v":{"$error":"#N/A"}}]
[]
["Tested for key functions,R2/Ready for Resale",{"$nulls":5},"Tested for key functions,R2/Ready for Resale"]
["BIOS Lock","Caddy","Optical","WebCam","Battery",null,"BIOS Lock","Caddy","Optical","WebCam","Battery"]
[null,null,{"$f":"VLOOKUP(E2207,INVENTORY!$A$2:$N$100,7,FALSE)","v":{"$error":"#N/A"}},{"$f":"VLOOKUP(E2207,INVENTORY!$A$2:$N$100,8,FALSE)","v":{"$error":"#N/A"}},{"$f":"VLOOKUP(E2207,INVENTORY!$A$2:$N$100,9,FALSE)","v":{"$error":"#N/A"}},{"$nulls":3},{"$f":"VLOOKUP(K2207,INVENTORY!$A$2:$N$100,7,FALSE)","v":{"$error":"#N/A"}},{"$f":"VLOOKUP(K2207,INVENTORY!$A$2:$N$100,8,FALSE)","v":{"$error":"#N/A"}},{"$f":"VLOOKUP(K2207,INVENTORY!$A$2:$N$100,9,FALSE)","v":{"$error":"#N/A"}}]
[]
["CPU Cosmetics Defects:",null,{"$f":"\"Function Code: \"&VLOOKUP(E2207,INVENTORY!$A$2:$Q$100,14,FALSE)","v":{"$error":"#N/A"}},{"$nulls":3},"CPU Cosmetics Defects:",null,{"$f":"\"Function Code: \"&VLOOKUP(K2207,INVENTORY!$A$2:$Q$100,14,FALSE)","v":{"$error":"#N/A"}}]
[]
[null,null,{"$f":"\"Cosmetic Code: \"&VLOOKUP(E2207,INVENTORY!$A$2:$Q$100,15,FALSE)","v":{"$error":"#N/A"}},{"$nulls":5},{"$f":"\"Cosmetic Code: \"&VLOOKUP(K2207,INVENTORY!$A$2:$Q$100,15,FALSE)","v":{"$error":"#N/A"}}]
[]
["Casing","Plugs/Ports",{"$nulls":4},"Casing","Plugs/Ports"]
["Pass","Pass",{"$nulls":4},"Pass","Pass"]
["Fail","Fail",null,"TRRC#:L.T.R.",null,null,"Fail","Fail",null,"TRRC#:L.T.R."]
[]
["LAPTOP TESTING RECORD",{"$nulls":5},"LAPTOP TESTING RECORD"]
[]
[{"$nulls":3},"ITEM #",{"$f":"E2207+2","v":155},{"$nulls":4},"ITEM #",{"$f":"K2207+2","v":156}]
["Tester: ","RR","Date:",{"$f":"NOW()","v":"2025-12-15T11:00:59.760"},null,null,"Tester: ","RR","Date:",{"$f":"NOW()","v":"2025-12-15T11:00:59.760"}]
["Type: ","LAPTOP","SN:",{"$f":"VLOOKUP(E2236,INVENTORYDATA,10,FALSE)","v":{"$error":"#N/A"}},null,null,"Type: ","LAPTOP","SN:",{"$f":"VLOOKUP(K2236,INVENTORYDATA,10,FALSE)","v":{"$error":"#N/A"}}]
[{"$f":"\"Make: \"","v":"Make: "},{"$f":"VLOOKUP(E2236,INVENTORYDATA,2,FALSE)","v":{"$error":"#N/A"}},{"$f":"\"Model: \"","v":"Model: "},{"$f":"VLOOKUP(E2236,INVENTORYDATA,3,FALSE)","v":{"$error":"#N/A"}},null,null,{"$f":"\"Make: \"","v":"Make: "},{"$f":"VLOOKUP(K2236,INVENTORYDATA,2,FALSE)","v":{"$error":"#N/A"}},{"$f":"\"Model: \"","v":"Model: "},{"$f":"VLOOKUP(K2236,INVENTORYDATA,3,FALSE)","v":{"$error":"#N/A"}}]
[{"$f":"\"CPU/Speed: \"","v":"CPU/Speed: "},{"$f":"VLOOKUP(E2236,INVENTORYDATA,4,FALSE)&\" / \"&VLOOKUP(E2236,INVENTORYDATA,5,FALSE)&\"GHz\"","v":{"$error":"#N/A"}},null,{"$f":"\"Memory: \"","v":"Memory: "},{"$f":"VLOOKUP(E2236,INVENTORYDATA,6,FALSE)","v":{"$error":"#N/A"}},null,{"$f":"\"CPU/Speed: \"","v":"CPU/Speed: "},{"$f":"VLOOKUP(K2236,INVENTORYDATA,4,FALSE)&\" / \"&VLOOKUP(K2236,INVENTORYDATA,5,FALSE)&\"GHz\"","v":{"$error":"#N/A"}},null,{"$f":"\"Memory: \"","v":"Memory: "},{"$f":"VLOOKUP(K2236,INVENTORYDATA,6,FALSE)","v":{"$error":"#N/A"}}]
[]
["Key Function",null,"Pass","Fail ","Comments",null,"Key Function",null,"Pass","Fail ","Comments"]
["Hard Drive Removed",null,{"$f":"IF(ISBLANK(VLOOKUP(E2236,INVENTORYDATA,13,FALSE)),\"X\",\"\")","v":""},null,{"$f":"IF(ISBLANK(VLOOKUP(E2236,INVENTORYDATA,13,FALSE)),\"\",VLOOKUP(E2236,INVENTORYDATA,13,FALSE))","v":{"$error":"#N/A"}},null,"Hard Drive Removed",null,{"$f":"IF(ISBLANK(VLOOKUP(K2236,INVENTORYDATA,13,FALSE)),\"X\",\"\")","v":""},null,{"$f":"IF(ISBLANK(VLOOKUP(K2236,INVENTORYDATA,13,FALSE)),\"\",VLOOKUP(K2236,INVENTORYDATA,13,FALSE))","v":{"$error":"#N/A"}}]
["Install Memory",null,"X",{"$nulls":3},"Install Memory",null,"X"]
["Power ON",null,"X",{"$nulls":3},"Power ON",null,"X"]
["Record BIOS info",null,"X",{"$nulls":3},"Record BIOS info",null,"X"]
["Check Optical Drive",null,{"$f":"IF((VLOOKUP(E2236,INVENTORYDATA,7,FALSE))=\"YES\",\"X\",\"\")","v":{"$error":"#N/A"}},{"$f":"IF((VLOOKUP(E2236,INVENTORYDATA,7,FALSE))=\"NO\",\"X\",\"\")","v":{"$error":"#N/A"}},null,null,"Check Optical Drive",null,{"$f":"IF((VLOOKUP(K2236,INVENTORYDATA,7,FALSE))=\"YES\",\"X\",\"\")","v":{"$error":"#N/A"}},{"$f":"IF((VLOOKUP(K2236,INVENTORYDATA,7,FALSE))=\"NO\",\"X\",\"\")","v":{"$error":"#N/A"}}]
["Power Off",null,"X",{"$nulls":3},"Power Off",null,"X"]
["HDD Serial No.",null,{"$f":"IF(ISBLANK(VLOOKUP(E2236,INVENTORYDATA,12,FALSE)),\"\",VLOOKUP(E2236,INVENTORYDATA,12,FALSE))","v":{"$error":"#N/A"}},{"$nulls":3},"HDD Serial No.",null,{"$f":"IF(ISBLANK(VLOOKUP(K2236,INVENTORYDATA,12,FALSE)),\"\",VLOOKUP(K2236,INVENTORYDATA,12,FALSE))","v":{"$error":"#N/A"}}]
[]
["Tested for key functions,R2/Ready for Resale",{"$nulls":5},"Tested for key functions,R2/Ready for Resale"]
["BIOS Lock","Caddy","Optical","WebCam","Battery",null,"BIOS Lock","Caddy","Optical","WebCam","Battery"]
[null,null,{"$f":"VLOOKUP(E2236,INVENTORY!$A$2:$N$100,7,FALSE)","v":{"$error":"#N/A"}},{"$f":"VLOOKUP(E2236,INVENTORY!$A$2:$N$100,8,FALSE)","v":{"$error":"#N/A"}},{"$f":"VLOOKUP(E2236,INVENTORY!$A$2:$N$100,9,FALSE)","v":{"$error":"#N/A"}},{"$nulls":3},{"$f":"VLOOKUP(K2236,INVENTORY!$A$2:$N$100,7,FALSE)","v":{"$error":"#N/A"}},{"$f":"VLOOKUP(K2236,INVENTORY!$A$2:$N$100,8,FALSE)","v":{"$error":"#N/A"}},{"$f":"VLOOKUP(K2236,INVENTORY!$A$2:$N$100,9,FALSE)","v":{"$error":"#N/A"}}]
[]
["CPU Cosmetics Defects:",null,{"$f":"\"Function Code: \"&VLOOKUP(E2236,INVENTORY!$A$2:$Q$100,14,FALSE)","v":{"$error":"#N/A"}},{"$nulls":3},"CPU Cosmetics Defects:",null,{"$f":"\"Function Code: \"&VLOOKUP(K2236,INVENTORY!$A$2:$Q$100,14,FALSE)","v":{"$error":"#N/A"}}]
[]
[null,null,{"$f":"\"Cosmetic Code: \"&VLOOKUP(E2236,INVENTORY!$A$2:$Q$100,15,FALSE)","v":{"$error":"#N/A"}},{"$nulls":5},{"$f":"\"Cosmetic Code: \"&VLOOKUP(K2236,INVENTORY!$A$2:$Q$100,15,FALSE)","v":{"$error":"#N/A"}}]
[]
["Casing","Plugs/Ports",{"$nulls":4},"Casing","Plugs/Ports"]
["Pass","Pass",{"$nulls":4},"Pass","Pass"]
["Fail","Fail",null,"TRRC#:L.T.R.",null,null,"Fail","Fail",null,"TRRC#:L.T.R."]
[]
["LAPTOP TESTING RECORD",{"$nulls":5},"LAPTOP TESTING RECORD"]
[]
[{"$nulls":3},"ITEM #",{"$f":"E2236+2","v":157},{"$nulls":4},"ITEM #",{"$f":"K2236+2","v":158}]
["Tester: ","RR","Date:",{"$f":"NOW()","v":"2025-12-15T11:00:59.760"},null,null,"Tester: ","RR","Date:",{"$f":"NOW()","v":"2025-12-15T11:00:59.760"}]
["Type: ","LAPTOP","SN:",{"$f":"VLOOKUP(E2265,INVENTORYDATA,10,FALSE)","v":{"$error":"#N/A"}},null,null,"Type: ","LAPTOP","SN:",{"$f":"VLOOKUP(K2265,INVENTORYDATA,10,FALSE)","v":{"$error":"#N/A"}}]
[{"$f":"\"Make: \"","v":"Make: "},{"$f":"VLOOKUP(E2265,INVENTORYDATA,2,FALSE)","v":{"$error":"#N/A"}},{"$f":"\"Model: \"","v":"Model: "},{"$f":"VLOOKUP(E2265,INVENTORYDATA,3,FALSE)","v":{"$error":"#N/A"}},null,null,{"$f":"\"Make: \"","v":"Make: "},{"$f":"VLOOKUP(K2265,INVENTORYDATA,2,FALSE)","v":{"$error":"#N/A"}},{"$f":"\"Model: \"","v":"Model: "},{"$f":"VLOOKUP(K2265,INVENTORYDATA,3,FALSE)","v":{"$error":"#N/A"}}]
[{"$f":"\"CPU/Speed: \"","v":"CPU/Speed: "},{"$f":"VLOOKUP(E2265,INVENTORYDATA,4,FALSE)&\" / \"&VLOOKUP(E2265,INVENTORYDATA,5,FALSE)&\"GHz\"","v":{"$error":"#N/A"}},null,{"$f":"\"Memory: \"","v":"Memory: "},{"$f":"VLOOKUP(E2265,INVENTORYDATA,6,FALSE)","v":{"$error":"#N/A"}},null,{"$f":"\"CPU/Speed: \"","v":"CPU/Speed: "},{"$f":"VLOOKUP(K2265,INVENTORYDATA,4,FALSE)&\" / \"&VLOOKUP(K2265,INVENTORYDATA,5,FALSE)&\"GHz\"","v":{"$error":"#N/A"}},null,{"$f":"\"Memory: \"","v":"Memory: "},{"$f":"VLOOKUP(K2265,INVENTORYDATA,6,FALSE)","v":{"$error":"#N/A"}}]
[]
["Key Function",null,"Pass","Fail ","Comments",null,"Key Function",null,"Pass","Fail ","Comments"]
["Hard Drive Removed",null,{"$f":"IF(ISBLANK(VLOOKUP(E2265,INVENTORYDATA,13,FALSE)),\"X\",\"\")","v":""},null,{"$f":"IF(ISBLANK(VLOOKUP(E2265,INVENTORYDATA,13,FALSE)),\"\",VLOOKUP(E2265,INVENTORYDATA,13,FALSE))","v":{"$error":"#N/A"}},null,"Hard Drive Removed",null,{"$f":"IF(ISBLANK(VLOOKUP(K2265,INVENTORYDATA,13,FALSE)),\"X\",\"\")","v":""},null,{"$f":"IF(ISBLANK(VLOOKUP(K2265,INVENTORYDATA,13,FALSE)),\"\",VLOOKUP(K2265,INVENTORYDATA,13,FALSE))","v":{"$error":"#N/A"}}]
["Install Memory",null,"X",{"$nulls":3},"Install Memory",null,"X"]
["Power ON",null,"X",{"$nulls":3},"Power ON",null,"X"]
["Record BIOS info",null,"X",{"$nulls":3},"Record BIOS info",null,"X"]
["Check Optical Drive",null,{"$f":"IF((VLOOKUP(E2265,INVENTORYDATA,7,FALSE))=\"YES\",\"X\",\"\")","v":{"$error":"#N/A"}},{"$f":"IF((VLOOKUP(E2265,INVENTORYDATA,7,FALSE))=\"NO\",\"X\",\"\")","v":{"$error":"#N/A"}},null,null,"Check Optical Drive",null,{"$f":"IF((VLOOKUP(K2265,INVENTORYDATA,7,FALSE))=\"YES\",\"X\",\"\")","v":{"$error":"#N/A"}},{"$f":"IF((VLOOKUP(K2265,INVENTORYDATA,7,FALSE))=\"NO\",\"X\",\"\")","v":{"$error":"#N/A"}}]
["Power Off",null,"X",{"$nulls":3},"Power Off",null,"X"]
["HDD Serial No.",null,{"$f":"IF(ISBLANK(VLOOKUP(E2265,INVENTORYDATA,12,FALSE)),\"\",VLOOKUP(E2265,INVENTORYDATA,12,FALSE))","v":{"$error":"#N/A"}},{"$nulls":3},"HDD Serial No.",null,{"$f":"IF(ISBLANK(VLOOKUP(K2265,INVENTORYDATA,12,FALSE)),\"\",VLOOKUP(K2265,INVENTORYDATA,12,FALSE))","v":{"$error":"#N/A"}}]
[]
["Tested for key functions,R2/Ready for Resale",{"$nulls":5},"Tested for key functions,R2/Ready for Resale"]
["BIOS Lock","Caddy","Optical","WebCam","Battery",null,"BIOS Lock","Caddy","Optical","WebCam","Battery"]
[null,null,{"$f":"VLOOKUP(E2265,INVENTORY!$A$2:$N$100,7,FALSE)","v":{"$error":"#N/A"}},{"$f":"VLOOKUP(E2265,INVENTORY!$A$2:$N$100,8,FALSE)","v":{"$error":"#N/A"}},{"$f":"VLOOKUP(E2265,INVENTORY!$A$2:$N$100,9,FALSE)","v":{"$error":"#N/A"}},{"$nulls":3},{"$f":"VLOOKUP(K2265,INVENTORY!$A$2:$N$100,7,FALSE)","v":{"$error":"#N/A"}},{"$f":"VLOOKUP(K2265,INVENTORY!$A$2:$N$100,8,FALSE)","v":{"$error":"#N/A"}},{"$f":"VLOOKUP(K2265,INVENTORY!$A$2:$N$100,9,FALSE)","v":{"$error":"#N/A"}}]
[]
["CPU Cosmetics Defects:",null,{"$f":"\"Function Code: \"&VLOOKUP(E2265,INVENTORY!$A$2:$Q$100,14,FALSE)","v":{"$error":"#N/A"}},{"$nulls":3},"CPU Cosmetics Defects:",null,{"$f":"\"Function Code: \"&VLOOKUP(K2265,INVENTORY!$A$2:$Q$100,14,FALSE)","v":{"$error":"#N/A"}}]
[]
[null,null,{"$f":"\"Cosmetic Code: \"&VLOOKUP(E2265,INVENTORY!$A$2:$Q$100,15,FALSE)","v":{"$error":"#N/A"}},{"$nulls":5},{"$f":"\"Cosmetic Code: \"&VLOOKUP(K2265,INVENTORY!$A$2:$Q$100,15,FALSE)","v":{"$error":"#N/A"}}]
[]
["Casing","Plugs/Ports",{"$nulls":4},"Casing","Plugs/Ports"]
["Pass","Pass",{"$nulls":4},"Pass","Pass"]
["Fail","Fail",null,"TRRC#:L.T.R.",null,null,"Fail","Fail",null,"TRRC#:L.T.R."]
[]
["LAPTOP TESTING RECORD",{"$nulls":5},"LAPTOP TESTING RECORD"]
[]
[{"$nulls":3},"ITEM #",{"$f":"E2265+2","v":159},{"$nulls":4},"ITEM #",{"$f":"K2265+2","v":160}]
["Tester: ","RR","Date:",{"$f":"NOW()","v":"2025-12-15T11:00:59.760"},null,null,"Tester: ","RR","Date:",{"$f":"NOW()","v":"2025-12-15T11:00:59.760"}]
["Type: ","LAPTOP","SN:",{"$f":"VLOOKUP(E2294,INVENTORYDATA,10,FALSE)","v":{"$error":"#N/A"}},null,null,"Type: ","LAPTOP","SN:",{"$f":"VLOOKUP(K2294,INVENTORYDATA,10,FALSE)","v":{"$error":"#N/A"}}]
[{"$f":"\"Make: \"","v":"Make: "},{"$f":"VLOOKUP(E2294,INVENTORYDATA,2,FALSE)","v":{"$error":"#N/A"}},{"$f":"\"Model: \"","v":"Model: "},{"$f":"VLOOKUP(E2294,INVENTORYDATA,3,FALSE)","v":{"$error":"#N/A"}},null,null,{"$f":"\"Make: \"","v":"Make: "},{"$f":"VLOOKUP(K2294,INVENTORYDATA,2,FALSE)","v":{"$error":"#N/A"}},{"$f":"\"Model: \"","v":"Model: "},{"$f":"VLOOKUP(K2294,INVENTORYDATA,3,FALSE)","v":{"$error":"#N/A"}}]
[{"$f":"\"CPU/Speed: \"","v":"CPU/Speed: "},{"$f":"VLOOKUP(E2294,INVENTORYDATA,4,FALSE)&\" / \"&VLOOKUP(E2294,INVENTORYDATA,5,FALSE)&\"GHz\"","v":{"$error":"#N/A"}},null,{"$f":"\"Memory: \"","v":"Memory: "},{"$f":"VLOOKUP(E2294,INVENTORYDATA,6,FALSE)","v":{"$error":"#N/A"}},null,{"$f":"\"CPU/Speed: \"","v":"CPU/Speed: "},{"$f":"VLOOKUP(K2294,INVENTORYDATA,4,FALSE)&\" / \"&VLOOKUP(K2294,INVENTORYDATA,5,FALSE)&\"GHz\"","v":{"$error":"#N/A"}},null,{"$f":"\"Memory: \"","v":"Memory: "},{"$f":"VLOOKUP(K2294,INVENTORYDATA,6,FALSE)","v":{"$error":"#N/A"}}]
[]
["Key Function",null,"Pass","Fail ","Comments",null,"Key Function",null,"Pass","Fail ","Comments"]
["Hard Drive Removed",null,{"$f":"IF(ISBLANK(VLOOKUP(E2294,INVENTORYDATA,13,FALSE)),\"X\",\"\")","v":""},null,{"$f":"IF(ISBLANK(VLOOKUP(E2294,INVENTORYDATA,13,FALSE)),\"\",VLOOKUP(E2294,INVENTORYDATA,13,FALSE))","v":{"$error":"#N/A"}},null,"Hard Drive Removed",null,{"$f":"IF(ISBLANK(VLOOKUP(K2294,INVENTORYDATA,13,FALSE)),\"X\",\"\")","v":""},null,{"$f":"IF(ISBLANK(VLOOKUP(K2294,INVENTORYDATA,13,FALSE)),\"\",VLOOKUP(K2294,INVENTORYDATA,13,FALSE))","v":{"$error":"#N/A"}}]
["Install Memory",null,"X",{"$nulls":3},"Install Memory",null,"X"]
["Power ON",null,"X",{"$nulls":3},"Power ON",null,"X"]
["Record BIOS info",null,"X",{"$nulls":3},"Record BIOS info",null,"X"]
["Check Optical Drive",null,{"$f":"IF((VLOOKUP(E2294,INVENTORYDATA,7,FALSE))=\"YES\",\"X\",\"\")","v":{"$error":"#N/A"}},{"$f":"IF((VLOOKUP(E2294,INVENTORYDATA,7,FALSE))=\"NO\",\"X\",\"\")","v":{"$error":"#N/A"}},null,null,"Check Optical Drive",null,{"$f":"IF((VLOOKUP(K2294,INVENTORYDATA,7,FALSE))=\"YES\",\"X\",\"\")","v":{"$error":"#N/A"}},{"$f":"IF((VLOOKUP(K2294,INVENTORYDATA,7,FALSE))=\"NO\",\"X\",\"\")","v":{"$error":"#N/A"}}]
["Power Off",null,"X",{"$nulls":3},"Power Off",null,"X"]
["HDD Serial No.",null,{"$f":"IF(ISBLANK(VLOOKUP(E2294,INVENTORYDATA,12,FALSE)),\"\",VLOOKUP(E2294,INVENTORYDATA,12,FALSE))","v":{"$error":"#N/A"}},{"$nulls":3},"HDD Serial No.",null,{"$f":"IF(ISBLANK(VLOOKUP(K2294,INVENTORYDATA,12,FALSE)),\"\",VLOOKUP(K2294,INVENTORYDATA,12,FALSE))","v":{"$error":"#N/A"}}]
[]
["Tested for key functions,R2/Ready for Resale",{"$nulls":5},"Tested for key functions,R2/Ready for Resale"]
["BIOS Lock","Caddy","Optical","WebCam","Battery",null,"BIOS Lock","Caddy","Optical","WebCam","Battery"]
[null,null,{"$f":"VLOOKUP(E2294,INVENTORY!$A$2:$N$100,7,FALSE)","v":{"$error":"#N/A"}},{"$f":"VLOOKUP(E2294,INVENTORY!$A$2:$N$100,8,FALSE)","v":{"$error":"#N/A"}},{"$f":"VLOOKUP(E2294,INVENTORY!$A$2:$N$100,9,FALSE)","v":{"$error":"#N/A"}},{"$nulls":3},{"$f":"VLOOKUP(K2294,INVENTORY!$A$2:$N$100,7,FALSE)","v":{"$error":"#N/A"}},{"$f":"VLOOKUP(K2294,INVENTORY!$A$2:$N$100,8,FALSE)","v":{"$error":"#N/A"}},{"$f":"VLOOKUP(K2294,INVENTORY!$A$2:$N$100,9,FALSE)","v":{"$error":"#N/A"}}]
[]
["CPU Cosmetics Defects:",null,{"$f":"\"Function Code: \"&VLOOKUP(E2294,INVENTORY!$A$2:$Q$100,14,FALSE)","v":{"$error":"#N/A"}},{"$nulls":3},"CPU Cosmetics Defects:",null,{"$f":"\"Function Code: \"&VLOOKUP(K2294,INVENTORY!$A$2:$Q$100,14,FALSE)","v":{"$error":"#N/A"}}]
[]
[null,null,{"$f":"\"Cosmetic Code: \"&VLOOKUP(E2294,INVENTORY!$A$2:$Q$100,15,FALSE)","v":{"$error":"#N/A"}},{"$nulls":5},{"$f":"\"Cosmetic Code: \"&VLOOKUP(K2294,INVENTORY!$A$2:$Q$100,15,FALSE)","v":{"$error":"#N/A"}}]
[]
["Casing","Plugs/Ports",{"$nulls":4},"Casing","Plugs/Ports"]
["Pass","Pass",{"$nulls":4},"Pass","Pass"]
["Fail","Fail",null,"TRRC#:L.T.R.",null,null,"Fail","Fail",null,"TRRC#:L.T.R."]
[]
["LAPTOP TESTING RECORD",{"$nulls":5},"LAPTOP TESTING RECORD"]
[]
[{"$nulls":3},"ITEM #",{"$f":"E2294+2","v":161},{"$nulls":4},"ITEM #",{"$f":"K2294+2","v":162}]
["Tester: ","RR","Date:",{"$f":"NOW()","v":"2025-12-15T11:00:59.760"},null,null,"Tester: ","RR","Date:",{"$f":"NOW()","v":"2025-12-15T11:00:59.760"}]
["Type: ","LAPTOP","SN:",{"$f":"VLOOKUP(E2323,INVENTORYDATA,10,FALSE)","v":{"$error":"#N/A"}},null,null,"Type: ","LAPTOP","SN:",{"$f":"VLOOKUP(K2323,INVENTORYDATA,10,FALSE)","v":{"$error":"#N/A"}}]
[{"$f":"\"Make: \"","v":"Make: "},{"$f":"VLOOKUP(E2323,INVENTORYDATA,2,FALSE)","v":{"$error":"#N/A"}},{"$f":"\"Model: \"","v":"Model: "},{"$f":"VLOOKUP(E2323,INVENTORYDATA,3,FALSE)","v":{"$error":"#N/A"}},null,null,{"$f":"\"Make: \"","v":"Make: "},{"$f":"VLOOKUP(K2323,INVENTORYDATA,2,FALSE)","v":{"$error":"#N/A"}},{"$f":"\"Model: \"","v":"Model: "},{"$f":"VLOOKUP(K2323,INVENTORYDATA,3,FALSE)","v":{"$error":"#N/A"}}]
[{"$f":"\"CPU/Speed: \"","v":"CPU/Speed: "},{"$f":"VLOOKUP(E2323,INVENTORYDATA,4,FALSE)&\" / \"&VLOOKUP(E2323,INVENTORYDATA,5,FALSE)&\"GHz\"","v":{"$error":"#N/A"}},null,{"$f":"\"Memory: \"","v":"Memory: "},{"$f":"VLOOKUP(E2323,INVENTORYDATA,6,FALSE)","v":{"$error":"#N/A"}},null,{"$f":"\"CPU/Speed: \"","v":"CPU/Speed: "},{"$f":"VLOOKUP(K2323,INVENTORYDATA,4,FALSE)&\" / \"&VLOOKUP(K2323,INVENTORYDATA,5,FALSE)&\"GHz\"","v":{"$error":"#N/A"}},null,{"$f":"\"Memory: \"","v":"Memory: "},{"$f":"VLOOKUP(K2323,INVENTORYDATA,6,FALSE)","v":{"$error":"#N/A"}}]
[]
["Key Function",null,"Pass","Fail ","Comments",null,"Key Function",null,"Pass","Fail ","Comments"]
["Hard Drive Removed",null,{"$f":"IF(ISBLANK(VLOOKUP(E2323,INVENTORYDATA,13,FALSE)),\"X\",\"\")","v":""},null,{"$f":"IF(ISBLANK(VLOOKUP(E2323,INVENTORYDATA,13,FALSE)),\"\",VLOOKUP(E2323,INVENTORYDATA,13,FALSE))","v":{"$error":"#N/A"}},null,"Hard Drive Removed",null,{"$f":"IF(ISBLANK(VLOOKUP(K2323,INVENTORYDATA,13,FALSE)),\"X\",\"\")","v":""},null,{"$f":"IF(ISBLANK(VLOOKUP(K2323,INVENTORYDATA,13,FALSE)),\"\",VLOOKUP(K2323,INVENTORYDATA,13,FALSE))","v":{"$error":"#N/A"}}]
["Install Memory",null,"X",{"$nulls":3},"Install Memory",null,"X"]
["Power ON",null,"X",{"$nulls":3},"Power ON",null,"X"]
["Record BIOS info",null,"X",{"$nulls":3},"Record BIOS info",null,"X"]
["Check Optical Drive",null,{"$f":"IF((VLOOKUP(E2323,INVENTORYDATA,7,FALSE))=\"YES\",\"X\",\"\")","v":{"$error":"#N/A"}},{"$f":"IF((VLOOKUP(E2323,INVENTORYDATA,7,FALSE))=\"NO\",\"X\",\"\")","v":{"$error":"#N/A"}},null,null,"Check Optical Drive",null,{"$f":"IF((VLOOKUP(K2323,INVENTORYDATA,7,FALSE))=\"YES\",\"X\",\"\")","v":{"$error":"#N/A"}},{"$f":"IF((VLOOKUP(K2323,INVENTORYDATA,7,FALSE))=\"NO\",\"X\",\"\")","v":{"$error":"#N/A"}}]
["Power Off",null,"X",{"$nulls":3},"Power Off",null,"X"]
["HDD Serial No.",null,{"$f":"IF(ISBLANK(VLOOKUP(E2323,INVENTORYDATA,12,FALSE)),\"\",VLOOKUP(E2323,INVENTORYDATA,12,FALSE))","v":{"$error":"#N/A"}},{"$nulls":3},"HDD Serial No.",null,{"$f":"IF(ISBLANK(VLOOKUP(K2323,INVENTORYDATA,12,FALSE)),\"\",VLOOKUP(K2323,INVENTORYDATA,12,FALSE))","v":{"$error":"#N/A"}}]
[]
["Tested for key functions,R2/Ready for Resale",{"$nulls":5},"Tested for key functions,R2/Ready for Resale"]
["BIOS Lock","Caddy","Optical","WebCam","Battery",null,"BIOS Lock","Caddy","Optical","WebCam","Battery"]
[null,null,{"$f":"VLOOKUP(E2323,INVENTORY!$A$2:$N$100,7,FALSE)","v":{"$error":"#N/A"}},{"$f":"VLOOKUP(E2323,INVENTORY!$A$2:$N$100,8,FALSE)","v":{"$error":"#N/A"}},{"$f":"VLOOKUP(E2323,INVENTORY!$A$2:$N$100,9,FALSE)","v":{"$error":"#N/A"}},{"$nulls":3},{"$f":"VLOOKUP(K2323,INVENTORY!$A$2:$N$100,7,FALSE)","v":{"$error":"#N/A"}},{"$f":"VLOOKUP(K2323,INVENTORY!$A$2:$N$100,8,FALSE)","v":{"$error":"#N/A"}},{"$f":"VLOOKUP(K2323,INVENTORY!$A$2:$N$100,9,FALSE)","v":{"$error":"#N/A"}}]
[]
["CPU Cosmetics Defects:",null,{"$f":"\"Function Code: \"&VLOOKUP(E2323,INVENTORY!$A$2:$Q$100,14,FALSE)","v":{"$error":"#N/A"}},{"$nulls":3},"CPU Cosmetics Defects:",null,{"$f":"\"Function Code: \"&VLOOKUP(K2323,INVENTORY!$A$2:$Q$100,14,FALSE)","v":{"$error":"#N/A"}}]
[]
[null,null,{"$f":"\"Cosmetic Code: \"&VLOOKUP(E2323,INVENTORY!$A$2:$Q$100,15,FALSE)","v":{"$error":"#N/A"}},{"$nulls":5},{"$f":"\"Cosmetic Code: \"&VLOOKUP(K2323,INVENTORY!$A$2:$Q$100,15,FALSE)","v":{"$error":"#N/A"}}]
[]
["Casing","Plugs/Ports",{"$nulls":4},"Casing","Plugs/Ports"]
["Pass","Pass",{"$nulls":4},"Pass","Pass"]
["Fail","Fail",null,"TRRC#:L.T.R.",null,null,"Fail","Fail",null,"TRRC#:L.T.R."]
[]
["LAPTOP TESTING RECORD",{"$nulls":5},"LAPTOP TESTING RECORD"]
[]
[{"$nulls":3},"ITEM #",{"$f":"E2323+2","v":163},{"$nulls":4},"ITEM #",{"$f":"K2323+2","v":164}]
["Tester: ","RR","Date:",{"$f":"NOW()","v":"2025-12-15T11:00:59.760"},null,null,"Tester: ","RR","Date:",{"$f":"NOW()","v":"2025-12-15T11:00:59.760"}]
["Type: ","LAPTOP","SN:",{"$f":"VLOOKUP(E2352,INVENTORYDATA,10,FALSE)","v":{"$error":"#N/A"}},null,null,"Type: ","LAPTOP","SN:",{"$f":"VLOOKUP(K2352,INVENTORYDATA,10,FALSE)","v":{"$error":"#N/A"}}]
[{"$f":"\"Make: \"","v":"Make: "},{"$f":"VLOOKUP(E2352,INVENTORYDATA,2,FALSE)","v":{"$error":"#N/A"}},{"$f":"\"Model: \"","v":"Model: "},{"$f":"VLOOKUP(E2352,INVENTORYDATA,3,FALSE)","v":{"$error":"#N/A"}},null,null,{"$f":"\"Make: \"","v":"Make: "},{"$f":"VLOOKUP(K2352,INVENTORYDATA,2,FALSE)","v":{"$error":"#N/A"}},{"$f":"\"Model: \"","v":"Model: "},{"$f":"VLOOKUP(K2352,INVENTORYDATA,3,FALSE)","v":{"$error":"#N/A"}}]
[{"$f":"\"CPU/Speed: \"","v":"CPU/Speed: "},{"$f":"VLOOKUP(E2352,INVENTORYDATA,4,FALSE)&\" / \"&VLOOKUP(E2352,INVENTORYDATA,5,FALSE)&\"GHz\"","v":{"$error":"#N/A"}},null,{"$f":"\"Memory: \"","v":"Memory: "},{"$f":"VLOOKUP(E2352,INVENTORYDATA,6,FALSE)","v":{"$error":"#N/A"}},null,{"$f":"\"CPU/Speed: \"","v":"CPU/Speed: "},{"$f":"VLOOKUP(K2352,INVENTORYDATA,4,FALSE)&\" / \"&VLOOKUP(K2352,INVENTORYDATA,5,FALSE)&\"GHz\"","v":{"$error":"#N/A"}},null,{"$f":"\"Memory: \"","v":"Memory: "},{"$f":"VLOOKUP(K2352,INVENTORYDATA,6,FALSE)","v":{"$error":"#N/A"}}]
[]
["Key Function",null,"Pass","Fail ","Comments",null,"Key Function",null,"Pass","Fail ","Comments"]
["Hard Drive Removed",null,{"$f":"IF(ISBLANK(VLOOKUP(E2352,INVENTORYDATA,13,FALSE)),\"X\",\"\")","v":""},null,{"$f":"IF(ISBLANK(VLOOKUP(E2352,INVENTORYDATA,13,FALSE)),\"\",VLOOKUP(E2352,INVENTORYDATA,13,FALSE))","v":{"$error":"#N/A"}},null,"Hard Drive Removed",null,{"$f":"IF(ISBLANK(VLOOKUP(K2352,INVENTORYDATA,13,FALSE)),\"X\",\"\")","v":""},null,{"$f":"IF(ISBLANK(VLOOKUP(K2352,INVENTORYDATA,13,FALSE)),\"\",VLOOKUP(K2352,INVENTORYDATA,13,FALSE))","v":{"$error":"#N/A"}}]
["Install Memory",null,"X",{"$nulls":3},"Install Memory",null,"X"]
["Power ON",null,"X",{"$nulls":3},"Power ON",null,"X"]
["Record BIOS info",null,"X",{"$nulls":3},"Record BIOS info",null,"X"]
["Check Optical Drive",null,{"$f":"IF((VLOOKUP(E2352,INVENTORYDATA,7,FALSE))=\"YES\",\"X\",\"\")","v":{"$error":"#N/A"}},{"$f":"IF((VLOOKUP(E2352,INVENTORYDATA,7,FALSE))=\"NO\",\"X\",\"\")","v":{"$error":"#N/A"}},null,null,"Check Optical Drive",null,{"$f":"IF((VLOOKUP(K2352,INVENTORYDATA,7,FALSE))=\"YES\",\"X\",\"\")","v":{"$error":"#N/A"}},{"$f":"IF((VLOOKUP(K2352,INVENTORYDATA,7,FALSE))=\"NO\",\"X\",\"\")","v":{"$error":"#N/A"}}]
["Power Off",null,"X",{"$nulls":3},"Power Off",null,"X"]
["HDD Serial No.",null,{"$f":"IF(ISBLANK(VLOOKUP(E2352,INVENTORYDATA,12,FALSE)),\"\",VLOOKUP(E2352,INVENTORYDATA,12,FALSE))","v":{"$error":"#N/A"}},{"$nulls":3},"HDD Serial No.",null,{"$f":"IF(ISBLANK(VLOOKUP(K2352,INVENTORYDATA,12,FALSE)),\"\",VLOOKUP(K2352,INVENTORYDATA,12,FALSE))","v":{"$error":"#N/A"}}]
[]
["Tested for key functions,R2/Ready for Resale",{"$nulls":5},"Tested for key functions,R2/Ready for Resale"]
["BIOS Lock","Caddy","Optical","WebCam","Battery",null,"BIOS Lock","Caddy","Optical","WebCam","Battery"]
[null,null,{"$f":"VLOOKUP(E2352,INVENTORY!$A$2:$N$100,7,FALSE)","v":{"$error":"#N/A"}},{"$f":"VLOOKUP(E2352,INVENTORY!$A$2:$N$100,8,FALSE)","v":{"$error":"#N/A"}},{"$f":"VLOOKUP(E2352,INVENTORY!$A$2:$N$100,9,FALSE)","v":{"$error":"#N/A"}},{"$nulls":3},{"$f":"VLOOKUP(K2352,INVENTORY!$A$2:$N$100,7,FALSE)","v":{"$error":"#N/A"}},{"$f":"VLOOKUP(K2352,INVENTORY!$A$2:$N$100,8,FALSE)","v":{"$error":"#N/A"}},{"$f":"VLOOKUP(K2352,INVENTORY!$A$2:$N$100,9,FALSE)","v":{"$error":"#N/A"}}]
[]
["CPU Cosmetics Defects:",null,{"$f":"\"Function Code: \"&VLOOKUP(E2352,INVENTORY!$A$2:$Q$100,14,FALSE)","v":{"$error":"#N/A"}},{"$nulls":3},"CPU Cosmetics Defects:",null,{"$f":"\"Function Code: \"&VLOOKUP(K2352,INVENTORY!$A$2:$Q$100,14,FALSE)","v":{"$error":"#N/A"}}]
[]
[null,null,{"$f":"\"Cosmetic Code: \"&VLOOKUP(E2352,INVENTORY!$A$2:$Q$100,15,FALSE)","v":{"$error":"#N/A"}},{"$nulls":5},{"$f":"\"Cosmetic Code: \"&VLOOKUP(K2352,INVENTORY!$A$2:$Q$100,15,FALSE)","v":{"$error":"#N/A"}}]
[]
["Casing","Plugs/Ports",{"$nulls":4},"Casing","Plugs/Ports"]
["Pass","Pass",{"$nulls":4},"Pass","Pass"]
["Fail","Fail",null,"TRRC#:L.T.R.",null,null,"Fail","Fail",null,"TRRC#:L.T.R."]
[]
["LAPTOP TESTING RECORD",{"$nulls":5},"LAPTOP TESTING RECORD"]
[]
[{"$nulls":3},"ITEM #",{"$f":"E2352+2","v":165},{"$nulls":4},"ITEM #",{"$f":"K2352+2","v":166}]
["Tester: ","RR","Date:",{"$f":"NOW()","v":"2025-12-15T11:00:59.760"},null,null,"Tester: ","RR","Date:",{"$f":"NOW()","v":"2025-12-15T11:00:59.760"}]
["Type: ","LAPTOP","SN:",{"$f":"VLOOKUP(E2381,INVENTORYDATA,10,FALSE)","v":{"$error":"#N/A"}},null,null,"Type: ","LAPTOP","SN:",{"$f":"VLOOKUP(K2381,INVENTORYDATA,10,FALSE)","v":{"$error":"#N/A"}}]
[{"$f":"\"Make: \"","v":"Make: "},{"$f":"VLOOKUP(E2381,INVENTORYDATA,2,FALSE)","v":{"$error":"#N/A"}},{"$f":"\"Model: \"","v":"Model: "},{"$f":"VLOOKUP(E2381,INVENTORYDATA,3,FALSE)","v":{"$error":"#N/A"}},null,null,{"$f":"\"Make: \"","v":"Make: "},{"$f":"VLOOKUP(K2381,INVENTORYDATA,2,FALSE)","v":{"$error":"#N/A"}},{"$f":"\"Model: \"","v":"Model: "},{"$f":"VLOOKUP(K2381,INVENTORYDATA,3,FALSE)","v":{"$error":"#N/A"}}]
[{"$f":"\"CPU/Speed: \"","v":"CPU/Speed: "},{"$f":"VLOOKUP(E2381,INVENTORYDATA,4,FALSE)&\" / \"&VLOOKUP(E2381,INVENTORYDATA,5,FALSE)&\"GHz\"","v":{"$error":"#N/A"}},null,{"$f":"\"Memory: \"","v":"Memory: "},{"$f":"VLOOKUP(E2381,INVENTORYDATA,6,FALSE)","v":{"$error":"#N/A"}},null,{"$f":"\"CPU/Speed: \"","v":"CPU/Speed: "},{"$f":"VLOOKUP(K2381,INVENTORYDATA,4,FALSE)&\" / \"&VLOOKUP(K2381,INVENTORYDATA,5,FALSE)&\"GHz\"","v":{"$error":"#N/A"}},null,{"$f":"\"Memory: \"","v":"Memory: "},{"$f":"VLOOKUP(K2381,INVENTORYDATA,6,FALSE)","v":{"$error":"#N/A"}}]
[]
["Key Function",null,"Pass","Fail ","Comments",null,"Key Function",null,"Pass","Fail ","Comments"]
["Hard Drive Removed",null,{"$f":"IF(ISBLANK(VLOOKUP(E2381,INVENTORYDATA,13,FALSE)),\"X\",\"\")","v":""},null,{"$f":"IF(ISBLANK(VLOOKUP(E2381,INVENTORYDATA,13,FALSE)),\"\",VLOOKUP(E2381,INVENTORYDATA,13,FALSE))","v":{"$error":"#N/A"}},null,"Hard Drive Removed",null,{"$f":"IF(ISBLANK(VLOOKUP(K2381,INVENTORYDATA,13,FALSE)),\"X\",\"\")","v":""},null,{"$f":"IF(ISBLANK(VLOOKUP(K2381,INVENTORYDATA,13,FALSE)),\"\",VLOOKUP(K2381,INVENTORYDATA,13,FALSE))","v":{"$error":"#N/A"}}]
["Install Memory",null,"X",{"$nulls":3},"Install Memory",null,"X"]
["Power ON",null,"X",{"$nulls":3},"Power ON",null,"X"]
["Record BIOS info",null,"X",{"$nulls":3},"Record BIOS info",null,"X"]
["Check Optical Drive",null,{"$f":"IF((VLOOKUP(E2381,INVENTORYDATA,7,FALSE))=\"YES\",\"X\",\"\")","v":{"$error":"#N/A"}},{"$f":"IF((VLOOKUP(E2381,INVENTORYDATA,7,FALSE))=\"NO\",\"X\",\"\")","v":{"$error":"#N/A"}},null,null,"Check Optical Drive",null,{"$f":"IF((VLOOKUP(K2381,INVENTORYDATA,7,FALSE))=\"YES\",\"X\",\"\")","v":{"$error":"#N/A"}},{"$f":"IF((VLOOKUP(K2381,INVENTORYDATA,7,FALSE))=\"NO\",\"X\",\"\")","v":{"$error":"#N/A"}}]
["Power Off",null,"X",{"$nulls":3},"Power Off",null,"X"]
["HDD Serial No.",null,{"$f":"IF(ISBLANK(VLOOKUP(E2381,INVENTORYDATA,12,FALSE)),\"\",VLOOKUP(E2381,INVENTORYDATA,12,FALSE))","v":{"$error":"#N/A"}},{"$nulls":3},"HDD Serial No.",null,{"$f":"IF(ISBLANK(VLOOKUP(K2381,INVENTORYDATA,12,FALSE)),\"\",VLOOKUP(K2381,INVENTORYDATA,12,FALSE))","v":{"$error":"#N/A"}}]
[]
["Tested for key functions,R2/Ready for Resale",{"$nulls":5},"Tested for key functions,R2/Ready for Resale"]
["BIOS Lock","Caddy","Optical","WebCam","Battery",null,"BIOS Lock","Caddy","Optical","WebCam","Battery"]
[null,null,{"$f":"VLOOKUP(E2381,INVENTORY!$A$2:$N$100,7,FALSE)","v":{"$error":"#N/A"}},{"$f":"VLOOKUP(E2381,INVENTORY!$A$2:$N$100,8,FALSE)","v":{"$error":"#N/A"}},{"$f":"VLOOKUP(E2381,INVENTORY!$A$2:$N$100,9,FALSE)","v":{"$error":"#N/A"}},{"$nulls":3},{"$f":"VLOOKUP(K2381,INVENTORY!$A$2:$N$100,7,FALSE)","v":{"$error":"#N/A"}},{"$f":"VLOOKUP(K2381,INVENTORY!$A$2:$N$100,8,FALSE)","v":{"$error":"#N/A"}},{"$f":"VLOOKUP(K2381,INVENTORY!$A$2:$N$100,9,FALSE)","v":{"$error":"#N/A"}}]
[]
["CPU Cosmetics Defects:",null,{"$f":"\"Function Code: \"&VLOOKUP(E2381,INVENTORY!$A$2:$Q$100,14,FALSE)","v":{"$error":"#N/A"}},{"$nulls":3},"CPU Cosmetics Defects:",null,{"$f":"\"Function Code: \"&VLOOKUP(K2381,INVENTORY!$A$2:$Q$100,14,FALSE)","v":{"$error":"#N/A"}}]
[]
[null,null,{"$f":"\"Cosmetic Code: \"&VLOOKUP(E2381,INVENTORY!$A$2:$Q$100,15,FALSE)","v":{"$error":"#N/A"}},{"$nulls":5},{"$f":"\"Cosmetic Code: \"&VLOOKUP(K2381,INVENTORY!$A$2:$Q$100,15,FALSE)","v":{"$error":"#N/A"}}]
[]
["Casing","Plugs/Ports",{"$nulls":4},"Casing","Plugs/Ports"]
["Pass","Pass",{"$nulls":4},"Pass","Pass"]
["Fail","Fail",null,"TRRC#:L.T.R.",null,null,"Fail","Fail",null,"TRRC#:L.T.R."]
[]
["LAPTOP TESTING RECORD",{"$nulls":5},"LAPTOP TESTING RECORD"]
[]
[{"$nulls":3},"ITEM #",{"$f":"E2381+2","v":167},{"$nulls":4},"ITEM #",{"$f":"K2381+2","v":168}]
["Tester: ","RR","Date:",{"$f":"NOW()","v":"2025-12-15T11:00:59.760"},null,null,"Tester: ","RR","Date:",{"$f":"NOW()","v":"2025-12-15T11:00:59.760"}]
["Type: ","LAPTOP","SN:",{"$f":"VLOOKUP(E2410,INVENTORYDATA,10,FALSE)","v":{"$error":"#N/A"}},null,null,"Type: ","LAPTOP","SN:",{"$f":"VLOOKUP(K2410,INVENTORYDATA,10,FALSE)","v":{"$error":"#N/A"}}]
[{"$f":"\"Make: \"","v":"Make: "},{"$f":"VLOOKUP(E2410,INVENTORYDATA,2,FALSE)","v":{"$error":"#N/A"}},{"$f":"\"Model: \"","v":"Model: "},{"$f":"VLOOKUP(E2410,INVENTORYDATA,3,FALSE)","v":{"$error":"#N/A"}},null,null,{"$f":"\"Make: \"","v":"Make: "},{"$f":"VLOOKUP(K2410,INVENTORYDATA,2,FALSE)","v":{"$error":"#N/A"}},{"$f":"\"Model: \"","v":"Model: "},{"$f":"VLOOKUP(K2410,INVENTORYDATA,3,FALSE)","v":{"$error":"#N/A"}}]
[{"$f":"\"CPU/Speed: \"","v":"CPU/Speed: "},{"$f":"VLOOKUP(E2410,INVENTORYDATA,4,FALSE)&\" / \"&VLOOKUP(E2410,INVENTORYDATA,5,FALSE)&\"GHz\"","v":{"$error":"#N/A"}},null,{"$f":"\"Memory: \"","v":"Memory: "},{"$f":"VLOOKUP(E2410,INVENTORYDATA,6,FALSE)","v":{"$error":"#N/A"}},null,{"$f":"\"CPU/Speed: \"","v":"CPU/Speed: "},{"$f":"VLOOKUP(K2410,INVENTORYDATA,4,FALSE)&\" / \"&VLOOKUP(K2410,INVENTORYDATA,5,FALSE)&\"GHz\"","v":{"$error":"#N/A"}},null,{"$f":"\"Memory: \"","v":"Memory: "},{"$f":"VLOOKUP(K2410,INVENTORYDATA,6,FALSE)","v":{"$error":"#N/A"}}]
[]
["Key Function",null,"Pass","Fail ","Comments",null,"Key Function",null,"Pass","Fail ","Comments"]
["Hard Drive Removed",null,{"$f":"IF(ISBLANK(VLOOKUP(E2410,INVENTORYDATA,13,FALSE)),\"X\",\"\")","v":""},null,{"$f":"IF(ISBLANK(VLOOKUP(E2410,INVENTORYDATA,13,FALSE)),\"\",VLOOKUP(E2410,INVENTORYDATA,13,FALSE))","v":{"$error":"#N/A"}},null,"Hard Drive Removed",null,{"$f":"IF(ISBLANK(VLOOKUP(K2410,INVENTORYDATA,13,FALSE)),\"X\",\"\")","v":""},null,{"$f":"IF(ISBLANK(VLOOKUP(K2410,INVENTORYDATA,13,FALSE)),\"\",VLOOKUP(K2410,INVENTORYDATA,13,FALSE))","v":{"$error":"#N/A"}}]
["Install Memory",null,"X",{"$nulls":3},"Install Memory",null,"X"]
["Power ON",null,"X",{"$nulls":3},"Power ON",null,"X"]
["Record BIOS info",null,"X",{"$nulls":3},"Record BIOS info",null,"X"]
["Check Optical Drive",null,{"$f":"IF((VLOOKUP(E2410,INVENTORYDATA,7,FALSE))=\"YES\",\"X\",\"\")","v":{"$error":"#N/A"}},{"$f":"IF((VLOOKUP(E2410,INVENTORYDATA,7,FALSE))=\"NO\",\"X\",\"\")","v":{"$error":"#N/A"}},null,null,"Check Optical Drive",null,{"$f":"IF((VLOOKUP(K2410,INVENTORYDATA,7,FALSE))=\"YES\",\"X\",\"\")","v":{"$error":"#N/A"}},{"$f":"IF((VLOOKUP(K2410,INVENTORYDATA,7,FALSE))=\"NO\",\"X\",\"\")","v":{"$error":"#N/A"}}]
["Power Off",null,"X",{"$nulls":3},"Power Off",null,"X"]
["HDD Serial No.",null,{"$f":"IF(ISBLANK(VLOOKUP(E2410,INVENTORYDATA,12,FALSE)),\"\",VLOOKUP(E2410,INVENTORYDATA,12,FALSE))","v":{"$error":"#N/A"}},{"$nulls":3},"HDD Serial No.",null,{"$f":"IF(ISBLANK(VLOOKUP(K2410,INVENTORYDATA,12,FALSE)),\"\",VLOOKUP(K2410,INVENTORYDATA,12,FALSE))","v":{"$error":"#N/A"}}]
[]
["Tested for key functions,R2/Ready for Resale",{"$nulls":5},"Tested for key functions,R2/Ready for Resale"]
["BIOS Lock","Caddy","Optical","WebCam","Battery",null,"BIOS Lock","Caddy","Optical","WebCam","Battery"]
[null,null,{"$f":"VLOOKUP(E2410,INVENTORY!$A$2:$N$100,7,FALSE)","v":{"$error":"#N/A"}},{"$f":"VLOOKUP(E2410,INVENTORY!$A$2:$N$100,8,FALSE)","v":{"$error":"#N/A"}},{"$f":"VLOOKUP(E2410,INVENTORY!$A$2:$N$100,9,FALSE)","v":{"$error":"#N/A"}},{"$nulls":3},{"$f":"VLOOKUP(K2410,INVENTORY!$A$2:$N$100,7,FALSE)","v":{"$error":"#N/A"}},{"$f":"VLOOKUP(K2410,INVENTORY!$A$2:$N$100,8,FALSE)","v":{"$error":"#N/A"}},{"$f":"VLOOKUP(K2410,INVENTORY!$A$2:$N$100,9,FALSE)","v":{"$error":"#N/A"}}]
[]
["CPU Cosmetics Defects:",null,{"$f":"\"Function Code: \"&VLOOKUP(E2410,INVENTORY!$A$2:$Q$100,14,FALSE)","v":{"$error":"#N/A"}},{"$nulls":3},"CPU Cosmetics Defects:",null,{"$f":"\"Function Code: \"&VLOOKUP(K2410,INVENTORY!$A$2:$Q$100,14,FALSE)","v":{"$error":"#N/A"}}]
[]
[null,null,{"$f":"\"Cosmetic Code: \"&VLOOKUP(E2410,INVENTORY!$A$2:$Q$100,15,FALSE)","v":{"$error":"#N/A"}},{"$nulls":5},{"$f":"\"Cosmetic Code: \"&VLOOKUP(K2410,INVENTORY!$A$2:$Q$100,15,FALSE)","v":{"$error":"#N/A"}}]
[]
["Casing","Plugs/Ports",{"$nulls":4},"Casing","Plugs/Ports"]
["Pass","Pass",{"$nulls":4},"Pass","Pass"]
["Fail","Fail",null,"TRRC#:L.T.R.",null,null,"Fail","Fail",null,"TRRC#:L.T.R."]
[]
["LAPTOP TESTING RECORD",{"$nulls":5},"LAPTOP TESTING RECORD"]
[]
[{"$nulls":3},"ITEM #",{"$f":"E2410+2","v":169},{"$nulls":4},"ITEM #",{"$f":"K2410+2","v":170}]
["Tester: ","RR","Date:",{"$f":"NOW()","v":"2025-12-15T11:00:59.760"},null,null,"Tester: ","RR","Date:",{"$f":"NOW()","v":"2025-12-15T11:00:59.760"}]
["Type: ","LAPTOP","SN:",{"$f":"VLOOKUP(E2439,INVENTORYDATA,10,FALSE)","v":{"$error":"#N/A"}},null,null,"Type: ","LAPTOP","SN:",{"$f":"VLOOKUP(K2439,INVENTORYDATA,10,FALSE)","v":{"$error":"#N/A"}}]
[{"$f":"\"Make: \"","v":"Make: "},{"$f":"VLOOKUP(E2439,INVENTORYDATA,2,FALSE)","v":{"$error":"#N/A"}},{"$f":"\"Model: \"","v":"Model: "},{"$f":"VLOOKUP(E2439,INVENTORYDATA,3,FALSE)","v":{"$error":"#N/A"}},null,null,{"$f":"\"Make: \"","v":"Make: "},{"$f":"VLOOKUP(K2439,INVENTORYDATA,2,FALSE)","v":{"$error":"#N/A"}},{"$f":"\"Model: \"","v":"Model: "},{"$f":"VLOOKUP(K2439,INVENTORYDATA,3,FALSE)","v":{"$error":"#N/A"}}]
[{"$f":"\"CPU/Speed: \"","v":"CPU/Speed: "},{"$f":"VLOOKUP(E2439,INVENTORYDATA,4,FALSE)&\" / \"&VLOOKUP(E2439,INVENTORYDATA,5,FALSE)&\"GHz\"","v":{"$error":"#N/A"}},null,{"$f":"\"Memory: \"","v":"Memory: "},{"$f":"VLOOKUP(E2439,INVENTORYDATA,6,FALSE)","v":{"$error":"#N/A"}},null,{"$f":"\"CPU/Speed: \"","v":"CPU/Speed: "},{"$f":"VLOOKUP(K2439,INVENTORYDATA,4,FALSE)&\" / \"&VLOOKUP(K2439,INVENTORYDATA,5,FALSE)&\"GHz\"","v":{"$error":"#N/A"}},null,{"$f":"\"Memory: \"","v":"Memory: "},{"$f":"VLOOKUP(K2439,INVENTORYDATA,6,FALSE)","v":{"$error":"#N/A"}}]
[]
["Key Function",null,"Pass","Fail ","Comments",null,"Key Function",null,"Pass","Fail ","Comments"]
["Hard Drive Removed",null,{"$f":"IF(ISBLANK(VLOOKUP(E2439,INVENTORYDATA,13,FALSE)),\"X\",\"\")","v":""},null,{"$f":"IF(ISBLANK(VLOOKUP(E2439,INVENTORYDATA,13,FALSE)),\"\",VLOOKUP(E2439,INVENTORYDATA,13,FALSE))","v":{"$error":"#N/A"}},null,"Hard Drive Removed",null,{"$f":"IF(ISBLANK(VLOOKUP(K2439,INVENTORYDATA,13,FALSE)),\"X\",\"\")","v":""},null,{"$f":"IF(ISBLANK(VLOOKUP(K2439,INVENTORYDATA,13,FALSE)),\"\",VLOOKUP(K2439,INVENTORYDATA,13,FALSE))","v":{"$error":"#N/A"}}]
["Install Memory",null,"X",{"$nulls":3},"Install Memory",null,"X"]
["Power ON",null,"X",{"$nulls":3},"Power ON",null,"X"]
["Record BIOS info",null,"X",{"$nulls":3},"Record BIOS info",null,"X"]
["Check Optical Drive",null,{"$f":"IF((VLOOKUP(E2439,INVENTORYDATA,7,FALSE))=\"YES\",\"X\",\"\")","v":{"$error":"#N/A"}},{"$f":"IF((VLOOKUP(E2439,INVENTORYDATA,7,FALSE))=\"NO\",\"X\",\"\")","v":{"$error":"#N/A"}},null,null,"Check Optical Drive",null,{"$f":"IF((VLOOKUP(K2439,INVENTORYDATA,7,FALSE))=\"YES\",\"X\",\"\")","v":{"$error":"#N/A"}},{"$f":"IF((VLOOKUP(K2439,INVENTORYDATA,7,FALSE))=\"NO\",\"X\",\"\")","v":{"$error":"#N/A"}}]
["Power Off",null,"X",{"$nulls":3},"Power Off",null,"X"]
["HDD Serial No.",null,{"$f":"IF(ISBLANK(VLOOKUP(E2439,INVENTORYDATA,12,FALSE)),\"\",VLOOKUP(E2439,INVENTORYDATA,12,FALSE))","v":{"$error":"#N/A"}},{"$nulls":3},"HDD Serial No.",null,{"$f":"IF(ISBLANK(VLOOKUP(K2439,INVENTORYDATA,12,FALSE)),\"\",VLOOKUP(K2439,INVENTORYDATA,12,FALSE))","v":{"$error":"#N/A"}}]
[]
["Tested for key functions,R2/Ready for Resale",{"$nulls":5},"Tested for key functions,R2/Ready for Resale"]
["BIOS Lock","Caddy","Optical","WebCam","Battery",null,"BIOS Lock","Caddy","Optical","WebCam","Battery"]
[null,null,{"$f":"VLOOKUP(E2439,INVENTORY!$A$2:$N$100,7,FALSE)","v":{"$error":"#N/A"}},{"$f":"VLOOKUP(E2439,INVENTORY!$A$2:$N$100,8,FALSE)","v":{"$error":"#N/A"}},{"$f":"VLOOKUP(E2439,INVENTORY!$A$2:$N$100,9,FALSE)","v":{"$error":"#N/A"}},{"$nulls":3},{"$f":"VLOOKUP(K2439,INVENTORY!$A$2:$N$100,7,FALSE)","v":{"$error":"#N/A"}},{"$f":"VLOOKUP(K2439,INVENTORY!$A$2:$N$100,8,FALSE)","v":{"$error":"#N/A"}},{"$f":"VLOOKUP(K2439,INVENTORY!$A$2:$N$100,9,FALSE)","v":{"$error":"#N/A"}}]
[]
["CPU Cosmetics Defects:",null,{"$f":"\"Function Code: \"&VLOOKUP(E2439,INVENTORY!$A$2:$Q$100,14,FALSE)","v":{"$error":"#N/A"}},{"$nulls":3},"CPU Cosmetics Defects:",null,{"$f":"\"Function Code: \"&VLOOKUP(K2439,INVENTORY!$A$2:$Q$100,14,FALSE)","v":{"$error":"#N/A"}}]
[]
[null,null,{"$f":"\"Cosmetic Code: \"&VLOOKUP(E2439,INVENTORY!$A$2:$Q$100,15,FALSE)","v":{"$error":"#N/A"}},{"$nulls":5},{"$f":"\"Cosmetic Code: \"&VLOOKUP(K2439,INVENTORY!$A$2:$Q$100,15,FALSE)","v":{"$error":"#N/A"}}]
[]
["Casing","Plugs/Ports",{"$nulls":4},"Casing","Plugs/Ports"]
["Pass","Pass",{"$nulls":4},"Pass","Pass"]
["Fail","Fail",null,"TRRC#:L.T.R.",null,null,"Fail","Fail",null,"TRRC#:L.T.R."]
[]
["LAPTOP TESTING RECORD",{"$nulls":5},"LAPTOP TESTING RECORD"]
[]
[{"$nulls":3},"ITEM #",{"$f":"E2439+2","v":171},{"$nulls":4},"ITEM #",{"$f":"K2439+2","v":172}]
["Tester: ","RR","Date:",{"$f":"NOW()","v":"2025-12-15T11:00:59.760"},null,null,"Tester: ","RR","Date:",{"$f":"NOW()","v":"2025-12-15T11:00:59.760"}]
["Type: ","LAPTOP","SN:",{"$f":"VLOOKUP(E2468,INVENTORYDATA,10,FALSE)","v":{"$error":"#N/A"}},null,null,"Type: ","LAPTOP","SN:",{"$f":"VLOOKUP(K2468,INVENTORYDATA,10,FALSE)","v":{"$error":"#N/A"}}]
[{"$f":"\"Make: \"","v":"Make: "},{"$f":"VLOOKUP(E2468,INVENTORYDATA,2,FALSE)","v":{"$error":"#N/A"}},{"$f":"\"Model: \"","v":"Model: "},{"$f":"VLOOKUP(E2468,INVENTORYDATA,3,FALSE)","v":{"$error":"#N/A"}},null,null,{"$f":"\"Make: \"","v":"Make: "},{"$f":"VLOOKUP(K2468,INVENTORYDATA,2,FALSE)","v":{"$error":"#N/A"}},{"$f":"\"Model: \"","v":"Model: "},{"$f":"VLOOKUP(K2468,INVENTORYDATA,3,FALSE)","v":{"$error":"#N/A"}}]
[{"$f":"\"CPU/Speed: \"","v":"CPU/Speed: "},{"$f":"VLOOKUP(E2468,INVENTORYDATA,4,FALSE)&\" / \"&VLOOKUP(E2468,INVENTORYDATA,5,FALSE)&\"GHz\"","v":{"$error":"#N/A"}},null,{"$f":"\"Memory: \"","v":"Memory: "},{"$f":"VLOOKUP(E2468,INVENTORYDATA,6,FALSE)","v":{"$error":"#N/A"}},null,{"$f":"\"CPU/Speed: \"","v":"CPU/Speed: "},{"$f":"VLOOKUP(K2468,INVENTORYDATA,4,FALSE)&\" / \"&VLOOKUP(K2468,INVENTORYDATA,5,FALSE)&\"GHz\"","v":{"$error":"#N/A"}},null,{"$f":"\"Memory: \"","v":"Memory: "},{"$f":"VLOOKUP(K2468,INVENTORYDATA,6,FALSE)","v":{"$error":"#N/A"}}]
[]
["Key Function",null,"Pass","Fail ","Comments",null,"Key Function",null,"Pass","Fail ","Comments"]
["Hard Drive Removed",null,{"$f":"IF(ISBLANK(VLOOKUP(E2468,INVENTORYDATA,13,FALSE)),\"X\",\"\")","v":""},null,{"$f":"IF(ISBLANK(VLOOKUP(E2468,INVENTORYDATA,13,FALSE)),\"\",VLOOKUP(E2468,INVENTORYDATA,13,FALSE))","v":{"$error":"#N/A"}},null,"Hard Drive Removed",null,{"$f":"IF(ISBLANK(VLOOKUP(K2468,INVENTORYDATA,13,FALSE)),\"X\",\"\")","v":""},null,{"$f":"IF(ISBLANK(VLOOKUP(K2468,INVENTORYDATA,13,FALSE)),\"\",VLOOKUP(K2468,INVENTORYDATA,13,FALSE))","v":{"$error":"#N/A"}}]
["Install Memory",null,"X",{"$nulls":3},"Install Memory",null,"X"]
["Power ON",null,"X",{"$nulls":3},"Power ON",null,"X"]
["Record BIOS info",null,"X",{"$nulls":3},"Record BIOS info",null,"X"]
["Check Optical Drive",null,{"$f":"IF((VLOOKUP(E2468,INVENTORYDATA,7,FALSE))=\"YES\",\"X\",\"\")","v":{"$error":"#N/A"}},{"$f":"IF((VLOOKUP(E2468,INVENTORYDATA,7,FALSE))=\"NO\",\"X\",\"\")","v":{"$error":"#N/A"}},null,null,"Check Optical Drive",null,{"$f":"IF((VLOOKUP(K2468,INVENTORYDATA,7,FALSE))=\"YES\",\"X\",\"\")","v":{"$error":"#N/A"}},{"$f":"IF((VLOOKUP(K2468,INVENTORYDATA,7,FALSE))=\"NO\",\"X\",\"\")","v":{"$error":"#N/A"}}]
["Power Off",null,"X",{"$nulls":3},"Power Off",null,"X"]
["HDD Serial No.",null,{"$f":"IF(ISBLANK(VLOOKUP(E2468,INVENTORYDATA,12,FALSE)),\"\",VLOOKUP(E2468,INVENTORYDATA,12,FALSE))","v":{"$error":"#N/A"}},{"$nulls":3},"HDD Serial No.",null,{"$f":"IF(ISBLANK(VLOOKUP(K2468,INVENTORYDATA,12,FALSE)),\"\",VLOOKUP(K2468,INVENTORYDATA,12,FALSE))","v":{"$error":"#N/A"}}]
[]
["Tested for key functions,R2/Ready for Resale",{"$nulls":5},"Tested for key functions,R2/Ready for Resale"]
["BIOS Lock","Caddy","Optical","WebCam","Battery",null,"BIOS Lock","Caddy","Optical","WebCam","Battery"]
[null,null,{"$f":"VLOOKUP(E2468,INVENTORY!$A$2:$N$100,7,FALSE)","v":{"$error":"#N/A"}},{"$f":"VLOOKUP(E2468,INVENTORY!$A$2:$N$100,8,FALSE)","v":{"$error":"#N/A"}},{"$f":"VLOOKUP(E2468,INVENTORY!$A$2:$N$100,9,FALSE)","v":{"$error":"#N/A"}},{"$nulls":3},{"$f":"VLOOKUP(K2468,INVENTORY!$A$2:$N$100,7,FALSE)","v":{"$error":"#N/A"}},{"$f":"VLOOKUP(K2468,INVENTORY!$A$2:$N$100,8,FALSE)","v":{"$error":"#N/A"}},{"$f":"VLOOKUP(K2468,INVENTORY!$A$2:$N$100,9,FALSE)","v":{"$error":"#N/A"}}]
[]
["CPU Cosmetics Defects:",null,{"$f":"\"Function Code: \"&VLOOKUP(E2468,INVENTORY!$A$2:$Q$100,14,FALSE)","v":{"$error":"#N/A"}},{"$nulls":3},"CPU Cosmetics Defects:",null,{"$f":"\"Function Code: \"&VLOOKUP(K2468,INVENTORY!$A$2:$Q$100,14,FALSE)","v":{"$error":"#N/A"}}]
[]
[null,null,{"$f":"\"Cosmetic Code: \"&VLOOKUP(E2468,INVENTORY!$A$2:$Q$100,15,FALSE)","v":{"$error":"#N/A"}},{"$nulls":5},{"$f":"\"Cosmetic Code: \"&VLOOKUP(K2468,INVENTORY!$A$2:$Q$100,15,FALSE)","v":{"$error":"#N/A"}}]
[]
["Casing","Plugs/Ports",{"$nulls":4},"Casing","Plugs/Ports"]
["Pass","Pass",{"$nulls":4},"Pass","Pass"]
["Fail","Fail",null,"TRRC#:L.T.R.",null,null,"Fail","Fail",null,"TRRC#:L.T.R."]
[]
["LAPTOP TESTING RECORD",{"$nulls":5},"LAPTOP TESTING RECORD"]
[]
[{"$nulls":3},"ITEM #",{"$f":"E2468+2","v":173},{"$nulls":4},"ITEM #",{"$f":"K2468+2","v":174}]
["Tester: ","RR","Date:",{"$f":"NOW()","v":"2025-12-15T11:00:59.760"},null,null,"Tester: ","RR","Date:",{"$f":"NOW()","v":"2025-12-15T11:00:59.760"}]
["Type: ","LAPTOP","SN:",{"$f":"VLOOKUP(E2497,INVENTORYDATA,10,FALSE)","v":{"$error":"#N/A"}},null,null,"Type: ","LAPTOP","SN:",{"$f":"VLOOKUP(K2497,INVENTORYDATA,10,FALSE)","v":{"$error":"#N/A"}}]
[{"$f":"\"Make: \"","v":"Make: "},{"$f":"VLOOKUP(E2497,INVENTORYDATA,2,FALSE)","v":{"$error":"#N/A"}},{"$f":"\"Model: \"","v":"Model: "},{"$f":"VLOOKUP(E2497,INVENTORYDATA,3,FALSE)","v":{"$error":"#N/A"}},null,null,{"$f":"\"Make: \"","v":"Make: "},{"$f":"VLOOKUP(K2497,INVENTORYDATA,2,FALSE)","v":{"$error":"#N/A"}},{"$f":"\"Model: \"","v":"Model: "},{"$f":"VLOOKUP(K2497,INVENTORYDATA,3,FALSE)","v":{"$error":"#N/A"}}]
[{"$f":"\"CPU/Speed: \"","v":"CPU/Speed: "},{"$f":"VLOOKUP(E2497,INVENTORYDATA,4,FALSE)&\" / \"&VLOOKUP(E2497,INVENTORYDATA,5,FALSE)&\"GHz\"","v":{"$error":"#N/A"}},null,{"$f":"\"Memory: \"","v":"Memory: "},{"$f":"VLOOKUP(E2497,INVENTORYDATA,6,FALSE)","v":{"$error":"#N/A"}},null,{"$f":"\"CPU/Speed: \"","v":"CPU/Speed: "},{"$f":"VLOOKUP(K2497,INVENTORYDATA,4,FALSE)&\" / \"&VLOOKUP(K2497,INVENTORYDATA,5,FALSE)&\"GHz\"","v":{"$error":"#N/A"}},null,{"$f":"\"Memory: \"","v":"Memory: "},{"$f":"VLOOKUP(K2497,INVENTORYDATA,6,FALSE)","v":{"$error":"#N/A"}}]
[]
["Key Function",null,"Pass","Fail ","Comments",null,"Key Function",null,"Pass","Fail ","Comments"]
["Hard Drive Removed",null,{"$f":"IF(ISBLANK(VLOOKUP(E2497,INVENTORYDATA,13,FALSE)),\"X\",\"\")","v":""},null,{"$f":"IF(ISBLANK(VLOOKUP(E2497,INVENTORYDATA,13,FALSE)),\"\",VLOOKUP(E2497,INVENTORYDATA,13,FALSE))","v":{"$error":"#N/A"}},null,"Hard Drive Removed",null,{"$f":"IF(ISBLANK(VLOOKUP(K2497,INVENTORYDATA,13,FALSE)),\"X\",\"\")","v":""},null,{"$f":"IF(ISBLANK(VLOOKUP(K2497,INVENTORYDATA,13,FALSE)),\"\",VLOOKUP(K2497,INVENTORYDATA,13,FALSE))","v":{"$error":"#N/A"}}]
["Install Memory",null,"X",{"$nulls":3},"Install Memory",null,"X"]
["Power ON",null,"X",{"$nulls":3},"Power ON",null,"X"]
["Record BIOS info",null,"X",{"$nulls":3},"Record BIOS info",null,"X"]
["Check Optical Drive",null,{"$f":"IF((VLOOKUP(E2497,INVENTORYDATA,7,FALSE))=\"YES\",\"X\",\"\")","v":{"$error":"#N/A"}},{"$f":"IF((VLOOKUP(E2497,INVENTORYDATA,7,FALSE))=\"NO\",\"X\",\"\")","v":{"$error":"#N/A"}},null,null,"Check Optical Drive",null,{"$f":"IF((VLOOKUP(K2497,INVENTORYDATA,7,FALSE))=\"YES\",\"X\",\"\")","v":{"$error":"#N/A"}},{"$f":"IF((VLOOKUP(K2497,INVENTORYDATA,7,FALSE))=\"NO\",\"X\",\"\")","v":{"$error":"#N/A"}}]
["Power Off",null,"X",{"$nulls":3},"Power Off",null,"X"]
["HDD Serial No.",null,{"$f":"IF(ISBLANK(VLOOKUP(E2497,INVENTORYDATA,12,FALSE)),\"\",VLOOKUP(E2497,INVENTORYDATA,12,FALSE))","v":{"$error":"#N/A"}},{"$nulls":3},"HDD Serial No.",null,{"$f":"IF(ISBLANK(VLOOKUP(K2497,INVENTORYDATA,12,FALSE)),\"\",VLOOKUP(K2497,INVENTORYDATA,12,FALSE))","v":{"$error":"#N/A"}}]
[]
["Tested for key functions,R2/Ready for Resale",{"$nulls":5},"Tested for key functions,R2/Ready for Resale"]
["BIOS Lock","Caddy","Optical","WebCam","Battery",null,"BIOS Lock","Caddy","Optical","WebCam","Battery"]
[null,null,{"$f":"VLOOKUP(E2497,INVENTORY!$A$2:$N$100,7,FALSE)","v":{"$error":"#N/A"}},{"$f":"VLOOKUP(E2497,INVENTORY!$A$2:$N$100,8,FALSE)","v":{"$error":"#N/A"}},{"$f":"VLOOKUP(E2497,INVENTORY!$A$2:$N$100,9,FALSE)","v":{"$error":"#N/A"}},{"$nulls":3},{"$f":"VLOOKUP(K2497,INVENTORY!$A$2:$N$100,7,FALSE)","v":{"$error":"#N/A"}},{"$f":"VLOOKUP(K2497,INVENTORY!$A$2:$N$100,8,FALSE)","v":{"$error":"#N/A"}},{"$f":"VLOOKUP(K2497,INVENTORY!$A$2:$N$100,9,FALSE)","v":{"$error":"#N/A"}}]
[]
["CPU Cosmetics Defects:",null,{"$f":"\"Function Code: \"&VLOOKUP(E2497,INVENTORY!$A$2:$Q$100,14,FALSE)","v":{"$error":"#N/A"}},{"$nulls":3},"CPU Cosmetics Defects:",null,{"$f":"\"Function Code: \"&VLOOKUP(K2497,INVENTORY!$A$2:$Q$100,14,FALSE)","v":{"$error":"#N/A"}}]
[]
[null,null,{"$f":"\"Cosmetic Code: \"&VLOOKUP(E2497,INVENTORY!$A$2:$Q$100,15,FALSE)","v":{"$error":"#N/A"}},{"$nulls":5},{"$f":"\"Cosmetic Code: \"&VLOOKUP(K2497,INVENTORY!$A$2:$Q$100,15,FALSE)","v":{"$error":"#N/A"}}]
[]
["Casing","Plugs/Ports",{"$nulls":4},"Casing","Plugs/Ports"]
["Pass","Pass",{"$nulls":4},"Pass","Pass"]
["Fail","Fail",null,"TRRC#:L.T.R.",null,null,"Fail","Fail",null,"TRRC#:L.T.R."]
[]
["LAPTOP TESTING RECORD",{"$nulls":5},"LAPTOP TESTING RECORD"]
[]
[{"$nulls":3},"ITEM #",{"$f":"E2497+2","v":175},{"$nulls":4},"ITEM #",{"$f":"K2497+2","v":176}]
["Tester: ","RR","Date:",{"$f":"NOW()","v":"2025-12-15T11:00:59.760"},null,null,"Tester: ","RR","Date:",{"$f":"NOW()","v":"2025-12-15T11:00:59.760"}]
["Type: ","LAPTOP","SN:",{"$f":"VLOOKUP(E2526,INVENTORYDATA,10,FALSE)","v":{"$error":"#N/A"}},null,null,"Type: ","LAPTOP","SN:",{"$f":"VLOOKUP(K2526,INVENTORYDATA,10,FALSE)","v":{"$error":"#N/A"}}]
[{"$f":"\"Make: \"","v":"Make: "},{"$f":"VLOOKUP(E2526,INVENTORYDATA,2,FALSE)","v":{"$error":"#N/A"}},{"$f":"\"Model: \"","v":"Model: "},{"$f":"VLOOKUP(E2526,INVENTORYDATA,3,FALSE)","v":{"$error":"#N/A"}},null,null,{"$f":"\"Make: \"","v":"Make: "},{"$f":"VLOOKUP(K2526,INVENTORYDATA,2,FALSE)","v":{"$error":"#N/A"}},{"$f":"\"Model: \"","v":"Model: "},{"$f":"VLOOKUP(K2526,INVENTORYDATA,3,FALSE)","v":{"$error":"#N/A"}}]
[{"$f":"\"CPU/Speed: \"","v":"CPU/Speed: "},{"$f":"VLOOKUP(E2526,INVENTORYDATA,4,FALSE)&\" / \"&VLOOKUP(E2526,INVENTORYDATA,5,FALSE)&\"GHz\"","v":{"$error":"#N/A"}},null,{"$f":"\"Memory: \"","v":"Memory: "},{"$f":"VLOOKUP(E2526,INVENTORYDATA,6,FALSE)","v":{"$error":"#N/A"}},null,{"$f":"\"CPU/Speed: \"","v":"CPU/Speed: "},{"$f":"VLOOKUP(K2526,INVENTORYDATA,4,FALSE)&\" / \"&VLOOKUP(K2526,INVENTORYDATA,5,FALSE)&\"GHz\"","v":{"$error":"#N/A"}},null,{"$f":"\"Memory: \"","v":"Memory: "},{"$f":"VLOOKUP(K2526,INVENTORYDATA,6,FALSE)","v":{"$error":"#N/A"}}]
[]
["Key Function",null,"Pass","Fail ","Comments",null,"Key Function",null,"Pass","Fail ","Comments"]
["Hard Drive Removed",null,{"$f":"IF(ISBLANK(VLOOKUP(E2526,INVENTORYDATA,13,FALSE)),\"X\",\"\")","v":""},null,{"$f":"IF(ISBLANK(VLOOKUP(E2526,INVENTORYDATA,13,FALSE)),\"\",VLOOKUP(E2526,INVENTORYDATA,13,FALSE))","v":{"$error":"#N/A"}},null,"Hard Drive Removed",null,{"$f":"IF(ISBLANK(VLOOKUP(K2526,INVENTORYDATA,13,FALSE)),\"X\",\"\")","v":""},null,{"$f":"IF(ISBLANK(VLOOKUP(K2526,INVENTORYDATA,13,FALSE)),\"\",VLOOKUP(K2526,INVENTORYDATA,13,FALSE))","v":{"$error":"#N/A"}}]
["Install Memory",null,"X",{"$nulls":3},"Install Memory",null,"X"]
["Power ON",null,"X",{"$nulls":3},"Power ON",null,"X"]
["Record BIOS info",null,"X",{"$nulls":3},"Record BIOS info",null,"X"]
["Check Optical Drive",null,{"$f":"IF((VLOOKUP(E2526,INVENTORYDATA,7,FALSE))=\"YES\",\"X\",\"\")","v":{"$error":"#N/A"}},{"$f":"IF((VLOOKUP(E2526,INVENTORYDATA,7,FALSE))=\"NO\",\"X\",\"\")","v":{"$error":"#N/A"}},null,null,"Check Optical Drive",null,{"$f":"IF((VLOOKUP(K2526,INVENTORYDATA,7,FALSE))=\"YES\",\"X\",\"\")","v":{"$error":"#N/A"}},{"$f":"IF((VLOOKUP(K2526,INVENTORYDATA,7,FALSE))=\"NO\",\"X\",\"\")","v":{"$error":"#N/A"}}]
["Power Off",null,"X",{"$nulls":3},"Power Off",null,"X"]
["HDD Serial No.",null,{"$f":"IF(ISBLANK(VLOOKUP(E2526,INVENTORYDATA,12,FALSE)),\"\",VLOOKUP(E2526,INVENTORYDATA,12,FALSE))","v":{"$error":"#N/A"}},{"$nulls":3},"HDD Serial No.",null,{"$f":"IF(ISBLANK(VLOOKUP(K2526,INVENTORYDATA,12,FALSE)),\"\",VLOOKUP(K2526,INVENTORYDATA,12,FALSE))","v":{"$error":"#N/A"}}]
[]
["Tested for key functions,R2/Ready for Resale",{"$nulls":5},"Tested for key functions,R2/Ready for Resale"]
["BIOS Lock","Caddy","Optical","WebCam","Battery",null,"BIOS Lock","Caddy","Optical","WebCam","Battery"]
[null,null,{"$f":"VLOOKUP(E2526,INVENTORY!$A$2:$N$100,7,FALSE)","v":{"$error":"#N/A"}},{"$f":"VLOOKUP(E2526,INVENTORY!$A$2:$N$100,8,FALSE)","v":{"$error":"#N/A"}},{"$f":"VLOOKUP(E2526,INVENTORY!$A$2:$N$100,9,FALSE)","v":{"$error":"#N/A"}},{"$nulls":3},{"$f":"VLOOKUP(K2526,INVENTORY!$A$2:$N$100,7,FALSE)","v":{"$error":"#N/A"}},{"$f":"VLOOKUP(K2526,INVENTORY!$A$2:$N$100,8,FALSE)","v":{"$error":"#N/A"}},{"$f":"VLOOKUP(K2526,INVENTORY!$A$2:$N$100,9,FALSE)","v":{"$error":"#N/A"}}]
[]
["CPU Cosmetics Defects:",null,{"$f":"\"Function Code: \"&VLOOKUP(E2526,INVENTORY!$A$2:$Q$100,14,FALSE)","v":{"$error":"#N/A"}},{"$nulls":3},"CPU Cosmetics Defects:",null,{"$f":"\"Function Code: \"&VLOOKUP(K2526,INVENTORY!$A$2:$Q$100,14,FALSE)","v":{"$error":"#N/A"}}]
[]
[null,null,{"$f":"\"Cosmetic Code: \"&VLOOKUP(E2526,INVENTORY!$A$2:$Q$100,15,FALSE)","v":{"$error":"#N/A"}},{"$nulls":5},{"$f":"\"Cosmetic Code: \"&VLOOKUP(K2526,INVENTORY!$A$2:$Q$100,15,FALSE)","v":{"$error":"#N/A"}}]
[]
["Casing","Plugs/Ports",{"$nulls":4},"Casing","Plugs/Ports"]
["Pass","Pass",{"$nulls":4},"Pass","Pass"]
["Fail","Fail",null,"TRRC#:L.T.R.",null,null,"Fail","Fail",null,"TRRC#:L.T.R."]
[]
["LAPTOP TESTING RECORD",{"$nulls":5},"LAPTOP TESTING RECORD"]
[]
[{"$nulls":3},"ITEM #",{"$f":"E2526+2","v":177},{"$nulls":4},"ITEM #",{"$f":"K2526+2","v":178}]
["Tester: ","RR","Date:",{"$f":"NOW()","v":"2025-12-15T11:00:59.760"},null,null,"Tester: ","RR","Date:",{"$f":"NOW()","v":"2025-12-15T11:00:59.760"}]
["Type: ","LAPTOP","SN:",{"$f":"VLOOKUP(E2555,INVENTORYDATA,10,FALSE)","v":{"$error":"#N/A"}},null,null,"Type: ","LAPTOP","SN:",{"$f":"VLOOKUP(K2555,INVENTORYDATA,10,FALSE)","v":{"$error":"#N/A"}}]
[{"$f":"\"Make: \"","v":"Make: "},{"$f":"VLOOKUP(E2555,INVENTORYDATA,2,FALSE)","v":{"$error":"#N/A"}},{"$f":"\"Model: \"","v":"Model: "},{"$f":"VLOOKUP(E2555,INVENTORYDATA,3,FALSE)","v":{"$error":"#N/A"}},null,null,{"$f":"\"Make: \"","v":"Make: "},{"$f":"VLOOKUP(K2555,INVENTORYDATA,2,FALSE)","v":{"$error":"#N/A"}},{"$f":"\"Model: \"","v":"Model: "},{"$f":"VLOOKUP(K2555,INVENTORYDATA,3,FALSE)","v":{"$error":"#N/A"}}]
[{"$f":"\"CPU/Speed: \"","v":"CPU/Speed: "},{"$f":"VLOOKUP(E2555,INVENTORYDATA,4,FALSE)&\" / \"&VLOOKUP(E2555,INVENTORYDATA,5,FALSE)&\"GHz\"","v":{"$error":"#N/A"}},null,{"$f":"\"Memory: \"","v":"Memory: "},{"$f":"VLOOKUP(E2555,INVENTORYDATA,6,FALSE)","v":{"$error":"#N/A"}},null,{"$f":"\"CPU/Speed: \"","v":"CPU/Speed: "},{"$f":"VLOOKUP(K2555,INVENTORYDATA,4,FALSE)&\" / \"&VLOOKUP(K2555,INVENTORYDATA,5,FALSE)&\"GHz\"","v":{"$error":"#N/A"}},null,{"$f":"\"Memory: \"","v":"Memory: "},{"$f":"VLOOKUP(K2555,INVENTORYDATA,6,FALSE)","v":{"$error":"#N/A"}}]
[]
["Key Function",null,"Pass","Fail ","Comments",null,"Key Function",null,"Pass","Fail ","Comments"]
["Hard Drive Removed",null,{"$f":"IF(ISBLANK(VLOOKUP(E2555,INVENTORYDATA,13,FALSE)),\"X\",\"\")","v":""},null,{"$f":"IF(ISBLANK(VLOOKUP(E2555,INVENTORYDATA,13,FALSE)),\"\",VLOOKUP(E2555,INVENTORYDATA,13,FALSE))","v":{"$error":"#N/A"}},null,"Hard Drive Removed",null,{"$f":"IF(ISBLANK(VLOOKUP(K2555,INVENTORYDATA,13,FALSE)),\"X\",\"\")","v":""},null,{"$f":"IF(ISBLANK(VLOOKUP(K2555,INVENTORYDATA,13,FALSE)),\"\",VLOOKUP(K2555,INVENTORYDATA,13,FALSE))","v":{"$error":"#N/A"}}]
["Install Memory",null,"X",{"$nulls":3},"Install Memory",null,"X"]
["Power ON",null,"X",{"$nulls":3},"Power ON",null,"X"]
["Record BIOS info",null,"X",{"$nulls":3},"Record BIOS info",null,"X"]
["Check Optical Drive",null,{"$f":"IF((VLOOKUP(E2555,INVENTORYDATA,7,FALSE))=\"YES\",\"X\",\"\")","v":{"$error":"#N/A"}},{"$f":"IF((VLOOKUP(E2555,INVENTORYDATA,7,FALSE))=\"NO\",\"X\",\"\")","v":{"$error":"#N/A"}},null,null,"Check Optical Drive",null,{"$f":"IF((VLOOKUP(K2555,INVENTORYDATA,7,FALSE))=\"YES\",\"X\",\"\")","v":{"$error":"#N/A"}},{"$f":"IF((VLOOKUP(K2555,INVENTORYDATA,7,FALSE))=\"NO\",\"X\",\"\")","v":{"$error":"#N/A"}}]
["Power Off",null,"X",{"$nulls":3},"Power Off",null,"X"]
["HDD Serial No.",null,{"$f":"IF(ISBLANK(VLOOKUP(E2555,INVENTORYDATA,12,FALSE)),\"\",VLOOKUP(E2555,INVENTORYDATA,12,FALSE))","v":{"$error":"#N/A"}},{"$nulls":3},"HDD Serial No.",null,{"$f":"IF(ISBLANK(VLOOKUP(K2555,INVENTORYDATA,12,FALSE)),\"\",VLOOKUP(K2555,INVENTORYDATA,12,FALSE))","v":{"$error":"#N/A"}}]
[]
["Tested for key functions,R2/Ready for Resale",{"$nulls":5},"Tested for key functions,R2/Ready for Resale"]
["BIOS Lock","Caddy","Optical","WebCam","Battery",null,"BIOS Lock","Caddy","Optical","WebCam","Battery"]
[null,null,{"$f":"VLOOKUP(E2555,INVENTORY!$A$2:$N$100,7,FALSE)","v":{"$error":"#N/A"}},{"$f":"VLOOKUP(E2555,INVENTORY!$A$2:$N$100,8,FALSE)","v":{"$error":"#N/A"}},{"$f":"VLOOKUP(E2555,INVENTORY!$A$2:$N$100,9,FALSE)","v":{"$error":"#N/A"}},{"$nulls":3},{"$f":"VLOOKUP(K2555,INVENTORY!$A$2:$N$100,7,FALSE)","v":{"$error":"#N/A"}},{"$f":"VLOOKUP(K2555,INVENTORY!$A$2:$N$100,8,FALSE)","v":{"$error":"#N/A"}},{"$f":"VLOOKUP(K2555,INVENTORY!$A$2:$N$100,9,FALSE)","v":{"$error":"#N/A"}}]
[]
["CPU Cosmetics Defects:",null,{"$f":"\"Function Code: \"&VLOOKUP(E2555,INVENTORY!$A$2:$Q$100,14,FALSE)","v":{"$error":"#N/A"}},{"$nulls":3},"CPU Cosmetics Defects:",null,{"$f":"\"Function Code: \"&VLOOKUP(K2555,INVENTORY!$A$2:$Q$100,14,FALSE)","v":{"$error":"#N/A"}}]
[]
[null,null,{"$f":"\"Cosmetic Code: \"&VLOOKUP(E2555,INVENTORY!$A$2:$Q$100,15,FALSE)","v":{"$error":"#N/A"}},{"$nulls":5},{"$f":"\"Cosmetic Code: \"&VLOOKUP(K2555,INVENTORY!$A$2:$Q$100,15,FALSE)","v":{"$error":"#N/A"}}]
[]
["Casing","Plugs/Ports",{"$nulls":4},"Casing","Plugs/Ports"]
["Pass","Pass",{"$nulls":4},"Pass","Pass"]
["Fail","Fail",null,"TRRC#:L.T.R.",null,null,"Fail","Fail",null,"TRRC#:L.T.R."]
[]
["LAPTOP TESTING RECORD",{"$nulls":5},"LAPTOP TESTING RECORD"]
[]
[{"$nulls":3},"ITEM #",{"$f":"E2555+2","v":179},{"$nulls":4},"ITEM #",{"$f":"K2555+2","v":180}]
["Tester: ","RR","Date:",{"$f":"NOW()","v":"2025-12-15T11:00:59.760"},null,null,"Tester: ","RR","Date:",{"$f":"NOW()","v":"2025-12-15T11:00:59.760"}]
["Type: ","LAPTOP","SN:",{"$f":"VLOOKUP(E2584,INVENTORYDATA,10,FALSE)","v":{"$error":"#N/A"}},null,null,"Type: ","LAPTOP","SN:",{"$f":"VLOOKUP(K2584,INVENTORYDATA,10,FALSE)","v":{"$error":"#N/A"}}]
[{"$f":"\"Make: \"","v":"Make: "},{"$f":"VLOOKUP(E2584,INVENTORYDATA,2,FALSE)","v":{"$error":"#N/A"}},{"$f":"\"Model: \"","v":"Model: "},{"$f":"VLOOKUP(E2584,INVENTORYDATA,3,FALSE)","v":{"$error":"#N/A"}},null,null,{"$f":"\"Make: \"","v":"Make: "},{"$f":"VLOOKUP(K2584,INVENTORYDATA,2,FALSE)","v":{"$error":"#N/A"}},{"$f":"\"Model: \"","v":"Model: "},{"$f":"VLOOKUP(K2584,INVENTORYDATA,3,FALSE)","v":{"$error":"#N/A"}}]
[{"$f":"\"CPU/Speed: \"","v":"CPU/Speed: "},{"$f":"VLOOKUP(E2584,INVENTORYDATA,4,FALSE)&\" / \"&VLOOKUP(E2584,INVENTORYDATA,5,FALSE)&\"GHz\"","v":{"$error":"#N/A"}},null,{"$f":"\"Memory: \"","v":"Memory: "},{"$f":"VLOOKUP(E2584,INVENTORYDATA,6,FALSE)","v":{"$error":"#N/A"}},null,{"$f":"\"CPU/Speed: \"","v":"CPU/Speed: "},{"$f":"VLOOKUP(K2584,INVENTORYDATA,4,FALSE)&\" / \"&VLOOKUP(K2584,INVENTORYDATA,5,FALSE)&\"GHz\"","v":{"$error":"#N/A"}},null,{"$f":"\"Memory: \"","v":"Memory: "},{"$f":"VLOOKUP(K2584,INVENTORYDATA,6,FALSE)","v":{"$error":"#N/A"}}]
[]
["Key Function",null,"Pass","Fail ","Comments",null,"Key Function",null,"Pass","Fail ","Comments"]
["Hard Drive Removed",null,{"$f":"IF(ISBLANK(VLOOKUP(E2584,INVENTORYDATA,13,FALSE)),\"X\",\"\")","v":""},null,{"$f":"IF(ISBLANK(VLOOKUP(E2584,INVENTORYDATA,13,FALSE)),\"\",VLOOKUP(E2584,INVENTORYDATA,13,FALSE))","v":{"$error":"#N/A"}},null,"Hard Drive Removed",null,{"$f":"IF(ISBLANK(VLOOKUP(K2584,INVENTORYDATA,13,FALSE)),\"X\",\"\")","v":""},null,{"$f":"IF(ISBLANK(VLOOKUP(K2584,INVENTORYDATA,13,FALSE)),\"\",VLOOKUP(K2584,INVENTORYDATA,13,FALSE))","v":{"$error":"#N/A"}}]
["Install Memory",null,"X",{"$nulls":3},"Install Memory",null,"X"]
["Power ON",null,"X",{"$nulls":3},"Power ON",null,"X"]
["Record BIOS info",null,"X",{"$nulls":3},"Record BIOS info",null,"X"]
["Check Optical Drive",null,{"$f":"IF((VLOOKUP(E2584,INVENTORYDATA,7,FALSE))=\"YES\",\"X\",\"\")","v":{"$error":"#N/A"}},{"$f":"IF((VLOOKUP(E2584,INVENTORYDATA,7,FALSE))=\"NO\",\"X\",\"\")","v":{"$error":"#N/A"}},null,null,"Check Optical Drive",null,{"$f":"IF((VLOOKUP(K2584,INVENTORYDATA,7,FALSE))=\"YES\",\"X\",\"\")","v":{"$error":"#N/A"}},{"$f":"IF((VLOOKUP(K2584,INVENTORYDATA,7,FALSE))=\"NO\",\"X\",\"\")","v":{"$error":"#N/A"}}]
["Power Off",null,"X",{"$nulls":3},"Power Off",null,"X"]
["HDD Serial No.",null,{"$f":"IF(ISBLANK(VLOOKUP(E2584,INVENTORYDATA,12,FALSE)),\"\",VLOOKUP(E2584,INVENTORYDATA,12,FALSE))","v":{"$error":"#N/A"}},{"$nulls":3},"HDD Serial No.",null,{"$f":"IF(ISBLANK(VLOOKUP(K2584,INVENTORYDATA,12,FALSE)),\"\",VLOOKUP(K2584,INVENTORYDATA,12,FALSE))","v":{"$error":"#N/A"}}]
[]
["Tested for key functions,R2/Ready for Resale",{"$nulls":5},"Tested for key functions,R2/Ready for Resale"]
["BIOS Lock","Caddy","Optical","WebCam","Battery",null,"BIOS Lock","Caddy","Optical","WebCam","Battery"]
[null,null,{"$f":"VLOOKUP(E2584,INVENTORY!$A$2:$N$100,7,FALSE)","v":{"$error":"#N/A"}},{"$f":"VLOOKUP(E2584,INVENTORY!$A$2:$N$100,8,FALSE)","v":{"$error":"#N/A"}},{"$f":"VLOOKUP(E2584,INVENTORY!$A$2:$N$100,9,FALSE)","v":{"$error":"#N/A"}},{"$nulls":3},{"$f":"VLOOKUP(K2584,INVENTORY!$A$2:$N$100,7,FALSE)","v":{"$error":"#N/A"}},{"$f":"VLOOKUP(K2584,INVENTORY!$A$2:$N$100,8,FALSE)","v":{"$error":"#N/A"}},{"$f":"VLOOKUP(K2584,INVENTORY!$A$2:$N$100,9,FALSE)","v":{"$error":"#N/A"}}]
[]
["CPU Cosmetics Defects:",null,{"$f":"\"Function Code: \"&VLOOKUP(E2584,INVENTORY!$A$2:$Q$100,14,FALSE)","v":{"$error":"#N/A"}},{"$nulls":3},"CPU Cosmetics Defects:",null,{"$f":"\"Function Code: \"&VLOOKUP(K2584,INVENTORY!$A$2:$Q$100,14,FALSE)","v":{"$error":"#N/A"}}]
[]
[null,null,{"$f":"\"Cosmetic Code: \"&VLOOKUP(E2584,INVENTORY!$A$2:$Q$100,15,FALSE)","v":{"$error":"#N/A"}},{"$nulls":5},{"$f":"\"Cosmetic Code: \"&VLOOKUP(K2584,INVENTORY!$A$2:$Q$100,15,FALSE)","v":{"$error":"#N/A"}}]
[]
["Casing","Plugs/Ports",{"$nulls":4},"Casing","Plugs/Ports"]
["Pass","Pass",{"$nulls":4},"Pass","Pass"]
["Fail","Fail",null,"TRRC#:L.T.R.",null,null,"Fail","Fail",null,"TRRC#:L.T.R."]
[]
["LAPTOP TESTING RECORD",{"$nulls":5},"LAPTOP TESTING RECORD"]
[]
[{"$nulls":3},"ITEM #",{"$f":"E2584+2","v":181},{"$nulls":4},"ITEM #",{"$f":"K2584+2","v":182}]
["Tester: ","RR","Date:",{"$f":"NOW()","v":"2025-12-15T11:00:59.760"},null,null,"Tester: ","RR","Date:",{"$f":"NOW()","v":"2025-12-15T11:00:59.760"}]
["Type: ","LAPTOP","SN:",{"$f":"VLOOKUP(E2613,INVENTORYDATA,10,FALSE)","v":{"$error":"#N/A"}},null,null,"Type: ","LAPTOP","SN:",{"$f":"VLOOKUP(K2613,INVENTORYDATA,10,FALSE)","v":{"$error":"#N/A"}}]
[{"$f":"\"Make: \"","v":"Make: "},{"$f":"VLOOKUP(E2613,INVENTORYDATA,2,FALSE)","v":{"$error":"#N/A"}},{"$f":"\"Model: \"","v":"Model: "},{"$f":"VLOOKUP(E2613,INVENTORYDATA,3,FALSE)","v":{"$error":"#N/A"}},null,null,{"$f":"\"Make: \"","v":"Make: "},{"$f":"VLOOKUP(K2613,INVENTORYDATA,2,FALSE)","v":{"$error":"#N/A"}},{"$f":"\"Model: \"","v":"Model: "},{"$f":"VLOOKUP(K2613,INVENTORYDATA,3,FALSE)","v":{"$error":"#N/A"}}]
[{"$f":"\"CPU/Speed: \"","v":"CPU/Speed: "},{"$f":"VLOOKUP(E2613,INVENTORYDATA,4,FALSE)&\" / \"&VLOOKUP(E2613,INVENTORYDATA,5,FALSE)&\"GHz\"","v":{"$error":"#N/A"}},null,{"$f":"\"Memory: \"","v":"Memory: "},{"$f":"VLOOKUP(E2613,INVENTORYDATA,6,FALSE)","v":{"$error":"#N/A"}},null,{"$f":"\"CPU/Speed: \"","v":"CPU/Speed: "},{"$f":"VLOOKUP(K2613,INVENTORYDATA,4,FALSE)&\" / \"&VLOOKUP(K2613,INVENTORYDATA,5,FALSE)&\"GHz\"","v":{"$error":"#N/A"}},null,{"$f":"\"Memory: \"","v":"Memory: "},{"$f":"VLOOKUP(K2613,INVENTORYDATA,6,FALSE)","v":{"$error":"#N/A"}}]
[]
["Key Function",null,"Pass","Fail ","Comments",null,"Key Function",null,"Pass","Fail ","Comments"]
["Hard Drive Removed",null,{"$f":"IF(ISBLANK(VLOOKUP(E2613,INVENTORYDATA,13,FALSE)),\"X\",\"\")","v":""},null,{"$f":"IF(ISBLANK(VLOOKUP(E2613,INVENTORYDATA,13,FALSE)),\"\",VLOOKUP(E2613,INVENTORYDATA,13,FALSE))","v":{"$error":"#N/A"}},null,"Hard Drive Removed",null,{"$f":"IF(ISBLANK(VLOOKUP(K2613,INVENTORYDATA,13,FALSE)),\"X\",\"\")","v":""},null,{"$f":"IF(ISBLANK(VLOOKUP(K2613,INVENTORYDATA,13,FALSE)),\"\",VLOOKUP(K2613,INVENTORYDATA,13,FALSE))","v":{"$error":"#N/A"}}]
["Install Memory",null,"X",{"$nulls":3},"Install Memory",null,"X"]
["Power ON",null,"X",{"$nulls":3},"Power ON",null,"X"]
["Record BIOS info",null,"X",{"$nulls":3},"Record BIOS info",null,"X"]
["Check Optical Drive",null,{"$f":"IF((VLOOKUP(E2613,INVENTORYDATA,7,FALSE))=\"YES\",\"X\",\"\")","v":{"$error":"#N/A"}},{"$f":"IF((VLOOKUP(E2613,INVENTORYDATA,7,FALSE))=\"NO\",\"X\",\"\")","v":{"$error":"#N/A"}},null,null,"Check Optical Drive",null,{"$f":"IF((VLOOKUP(K2613,INVENTORYDATA,7,FALSE))=\"YES\",\"X\",\"\")","v":{"$error":"#N/A"}},{"$f":"IF((VLOOKUP(K2613,INVENTORYDATA,7,FALSE))=\"NO\",\"X\",\"\")","v":{"$error":"#N/A"}}]
["Power Off",null,"X",{"$nulls":3},"Power Off",null,"X"]
["HDD Serial No.",null,{"$f":"IF(ISBLANK(VLOOKUP(E2613,INVENTORYDATA,12,FALSE)),\"\",VLOOKUP(E2613,INVENTORYDATA,12,FALSE))","v":{"$error":"#N/A"}},{"$nulls":3},"HDD Serial No.",null,{"$f":"IF(ISBLANK(VLOOKUP(K2613,INVENTORYDATA,12,FALSE)),\"\",VLOOKUP(K2613,INVENTORYDATA,12,FALSE))","v":{"$error":"#N/A"}}]
[]
["Tested for key functions,R2/Ready for Resale",{"$nulls":5},"Tested for key functions,R2/Ready for Resale"]
["BIOS Lock","Caddy","Optical","WebCam","Battery",null,"BIOS Lock","Caddy","Optical","WebCam","Battery"]
[null,null,{"$f":"VLOOKUP(E2613,INVENTORY!$A$2:$N$100,7,FALSE)","v":{"$error":"#N/A"}},{"$f":"VLOOKUP(E2613,INVENTORY!$A$2:$N$100,8,FALSE)","v":{"$error":"#N/A"}},{"$f":"VLOOKUP(E2613,INVENTORY!$A$2:$N$100,9,FALSE)","v":{"$error":"#N/A"}},{"$nulls":3},{"$f":"VLOOKUP(K2613,INVENTORY!$A$2:$N$100,7,FALSE)","v":{"$error":"#N/A"}},{"$f":"VLOOKUP(K2613,INVENTORY!$A$2:$N$100,8,FALSE)","v":{"$error":"#N/A"}},{"$f":"VLOOKUP(K2613,INVENTORY!$A$2:$N$100,9,FALSE)","v":{"$error":"#N/A"}}]
[]
["CPU Cosmetics Defects:",null,{"$f":"\"Function Code: \"&VLOOKUP(E2613,INVENTORY!$A$2:$Q$100,14,FALSE)","v":{"$error":"#N/A"}},{"$nulls":3},"CPU Cosmetics Defects:",null,{"$f":"\"Function Code: \"&VLOOKUP(K2613,INVENTORY!$A$2:$Q$100,14,FALSE)","v":{"$error":"#N/A"}}]
[]
[null,null,{"$f":"\"Cosmetic Code: \"&VLOOKUP(E2613,INVENTORY!$A$2:$Q$100,15,FALSE)","v":{"$error":"#N/A"}},{"$nulls":5},{"$f":"\"Cosmetic Code: \"&VLOOKUP(K2613,INVENTORY!$A$2:$Q$100,15,FALSE)","v":{"$error":"#N/A"}}]
[]
["Casing","Plugs/Ports",{"$nulls":4},"Casing","Plugs/Ports"]
["Pass","Pass",{"$nulls":4},"Pass","Pass"]
["Fail","Fail",null,"TRRC#:L.T.R.",null,null,"Fail","Fail",null,"TRRC#:L.T.R."]
[]
["LAPTOP TESTING RECORD",{"$nulls":5},"LAPTOP TESTING RECORD"]
[]
[{"$nulls":3},"ITEM #",{"$f":"E2613+2","v":183},{"$nulls":4},"ITEM #",{"$f":"K2613+2","v":184}]
["Tester: ","RR","Date:",{"$f":"NOW()","v":"2025-12-15T11:00:59.760"},null,null,"Tester: ","RR","Date:",{"$f":"NOW()","v":"2025-12-15T11:00:59.760"}]
["Type: ","LAPTOP","SN:",{"$f":"VLOOKUP(E2642,INVENTORYDATA,10,FALSE)","v":{"$error":"#N/A"}},null,null,"Type: ","LAPTOP","SN:",{"$f":"VLOOKUP(K2642,INVENTORYDATA,10,FALSE)","v":{"$error":"#N/A"}}]
[{"$f":"\"Make: \"","v":"Make: "},{"$f":"VLOOKUP(E2642,INVENTORYDATA,2,FALSE)","v":{"$error":"#N/A"}},{"$f":"\"Model: \"","v":"Model: "},{"$f":"VLOOKUP(E2642,INVENTORYDATA,3,FALSE)","v":{"$error":"#N/A"}},null,null,{"$f":"\"Make: \"","v":"Make: "},{"$f":"VLOOKUP(K2642,INVENTORYDATA,2,FALSE)","v":{"$error":"#N/A"}},{"$f":"\"Model: \"","v":"Model: "},{"$f":"VLOOKUP(K2642,INVENTORYDATA,3,FALSE)","v":{"$error":"#N/A"}}]
[{"$f":"\"CPU/Speed: \"","v":"CPU/Speed: "},{"$f":"VLOOKUP(E2642,INVENTORYDATA,4,FALSE)&\" / \"&VLOOKUP(E2642,INVENTORYDATA,5,FALSE)&\"GHz\"","v":{"$error":"#N/A"}},null,{"$f":"\"Memory: \"","v":"Memory: "},{"$f":"VLOOKUP(E2642,INVENTORYDATA,6,FALSE)","v":{"$error":"#N/A"}},null,{"$f":"\"CPU/Speed: \"","v":"CPU/Speed: "},{"$f":"VLOOKUP(K2642,INVENTORYDATA,4,FALSE)&\" / \"&VLOOKUP(K2642,INVENTORYDATA,5,FALSE)&\"GHz\"","v":{"$error":"#N/A"}},null,{"$f":"\"Memory: \"","v":"Memory: "},{"$f":"VLOOKUP(K2642,INVENTORYDATA,6,FALSE)","v":{"$error":"#N/A"}}]
[]
["Key Function",null,"Pass","Fail ","Comments",null,"Key Function",null,"Pass","Fail ","Comments"]
["Hard Drive Removed",null,{"$f":"IF(ISBLANK(VLOOKUP(E2642,INVENTORYDATA,13,FALSE)),\"X\",\"\")","v":""},null,{"$f":"IF(ISBLANK(VLOOKUP(E2642,INVENTORYDATA,13,FALSE)),\"\",VLOOKUP(E2642,INVENTORYDATA,13,FALSE))","v":{"$error":"#N/A"}},null,"Hard Drive Removed",null,{"$f":"IF(ISBLANK(VLOOKUP(K2642,INVENTORYDATA,13,FALSE)),\"X\",\"\")","v":""},null,{"$f":"IF(ISBLANK(VLOOKUP(K2642,INVENTORYDATA,13,FALSE)),\"\",VLOOKUP(K2642,INVENTORYDATA,13,FALSE))","v":{"$error":"#N/A"}}]
["Install Memory",null,"X",{"$nulls":3},"Install Memory",null,"X"]
["Power ON",null,"X",{"$nulls":3},"Power ON",null,"X"]
["Record BIOS info",null,"X",{"$nulls":3},"Record BIOS info",null,"X"]
["Check Optical Drive",null,{"$f":"IF((VLOOKUP(E2642,INVENTORYDATA,7,FALSE))=\"YES\",\"X\",\"\")","v":{"$error":"#N/A"}},{"$f":"IF((VLOOKUP(E2642,INVENTORYDATA,7,FALSE))=\"NO\",\"X\",\"\")","v":{"$error":"#N/A"}},null,null,"Check Optical Drive",null,{"$f":"IF((VLOOKUP(K2642,INVENTORYDATA,7,FALSE))=\"YES\",\"X\",\"\")","v":{"$error":"#N/A"}},{"$f":"IF((VLOOKUP(K2642,INVENTORYDATA,7,FALSE))=\"NO\",\"X\",\"\")","v":{"$error":"#N/A"}}]
["Power Off",null,"X",{"$nulls":3},"Power Off",null,"X"]
["HDD Serial No.",null,{"$f":"IF(ISBLANK(VLOOKUP(E2642,INVENTORYDATA,12,FALSE)),\"\",VLOOKUP(E2642,INVENTORYDATA,12,FALSE))","v":{"$error":"#N/A"}},{"$nulls":3},"HDD Serial No.",null,{"$f":"IF(ISBLANK(VLOOKUP(K2642,INVENTORYDATA,12,FALSE)),\"\",VLOOKUP(K2642,INVENTORYDATA,12,FALSE))","v":{"$error":"#N/A"}}]
[]
["Tested for key functions,R2/Ready for Resale",{"$nulls":5},"Tested for key functions,R2/Ready for Resale"]
["BIOS Lock","Caddy","Optical","WebCam","Battery",null,"BIOS Lock","Caddy","Optical","WebCam","Battery"]
[null,null,{"$f":"VLOOKUP(E2642,INVENTORY!$A$2:$N$100,7,FALSE)","v":{"$error":"#N/A"}},{"$f":"VLOOKUP(E2642,INVENTORY!$A$2:$N$100,8,FALSE)","v":{"$error":"#N/A"}},{"$f":"VLOOKUP(E2642,INVENTORY!$A$2:$N$100,9,FALSE)","v":{"$error":"#N/A"}},{"$nulls":3},{"$f":"VLOOKUP(K2642,INVENTORY!$A$2:$N$100,7,FALSE)","v":{"$error":"#N/A"}},{"$f":"VLOOKUP(K2642,INVENTORY!$A$2:$N$100,8,FALSE)","v":{"$error":"#N/A"}},{"$f":"VLOOKUP(K2642,INVENTORY!$A$2:$N$100,9,FALSE)","v":{"$error":"#N/A"}}]
[]
["CPU Cosmetics Defects:",null,{"$f":"\"Function Code: \"&VLOOKUP(E2642,INVENTORY!$A$2:$Q$100,14,FALSE)","v":{"$error":"#N/A"}},{"$nulls":3},"CPU Cosmetics Defects:",null,{"$f":"\"Function Code: \"&VLOOKUP(K2642,INVENTORY!$A$2:$Q$100,14,FALSE)","v":{"$error":"#N/A"}}]
[]
[null,null,{"$f":"\"Cosmetic Code: \"&VLOOKUP(E2642,INVENTORY!$A$2:$Q$100,15,FALSE)","v":{"$error":"#N/A"}},{"$nulls":5},{"$f":"\"Cosmetic Code: \"&VLOOKUP(K2642,INVENTORY!$A$2:$Q$100,15,FALSE)","v":{"$error":"#N/A"}}]
[]
["Casing","Plugs/Ports",{"$nulls":4},"Casing","Plugs/Ports"]
["Pass","Pass",{"$nulls":4},"Pass","Pass"]
["Fail","Fail",null,"TRRC#:L.T.R.",null,null,"Fail","Fail",null,"TRRC#:L.T.R."]
[]
["LAPTOP TESTING RECORD",{"$nulls":5},"LAPTOP TESTING RECORD"]
[]
[{"$nulls":3},"ITEM #",{"$f":"E2642+2","v":185},{"$nulls":4},"ITEM #",{"$f":"K2642+2","v":186}]
["Tester: ","RR","Date:",{"$f":"NOW()","v":"2025-12-15T11:00:59.760"},null,null,"Tester: ","RR","Date:",{"$f":"NOW()","v":"2025-12-15T11:00:59.760"}]
["Type: ","LAPTOP","SN:",{"$f":"VLOOKUP(E2671,INVENTORYDATA,10,FALSE)","v":{"$error":"#N/A"}},null,null,"Type: ","LAPTOP","SN:",{"$f":"VLOOKUP(K2671,INVENTORYDATA,10,FALSE)","v":{"$error":"#N/A"}}]
[{"$f":"\"Make: \"","v":"Make: "},{"$f":"VLOOKUP(E2671,INVENTORYDATA,2,FALSE)","v":{"$error":"#N/A"}},{"$f":"\"Model: \"","v":"Model: "},{"$f":"VLOOKUP(E2671,INVENTORYDATA,3,FALSE)","v":{"$error":"#N/A"}},null,null,{"$f":"\"Make: \"","v":"Make: "},{"$f":"VLOOKUP(K2671,INVENTORYDATA,2,FALSE)","v":{"$error":"#N/A"}},{"$f":"\"Model: \"","v":"Model: "},{"$f":"VLOOKUP(K2671,INVENTORYDATA,3,FALSE)","v":{"$error":"#N/A"}}]
[{"$f":"\"CPU/Speed: \"","v":"CPU/Speed: "},{"$f":"VLOOKUP(E2671,INVENTORYDATA,4,FALSE)&\" / \"&VLOOKUP(E2671,INVENTORYDATA,5,FALSE)&\"GHz\"","v":{"$error":"#N/A"}},null,{"$f":"\"Memory: \"","v":"Memory: "},{"$f":"VLOOKUP(E2671,INVENTORYDATA,6,FALSE)","v":{"$error":"#N/A"}},null,{"$f":"\"CPU/Speed: \"","v":"CPU/Speed: "},{"$f":"VLOOKUP(K2671,INVENTORYDATA,4,FALSE)&\" / \"&VLOOKUP(K2671,INVENTORYDATA,5,FALSE)&\"GHz\"","v":{"$error":"#N/A"}},null,{"$f":"\"Memory: \"","v":"Memory: "},{"$f":"VLOOKUP(K2671,INVENTORYDATA,6,FALSE)","v":{"$error":"#N/A"}}]
[]
["Key Function",null,"Pass","Fail ","Comments",null,"Key Function",null,"Pass","Fail ","Comments"]
["Hard Drive Removed",null,{"$f":"IF(ISBLANK(VLOOKUP(E2671,INVENTORYDATA,13,FALSE)),\"X\",\"\")","v":""},null,{"$f":"IF(ISBLANK(VLOOKUP(E2671,INVENTORYDATA,13,FALSE)),\"\",VLOOKUP(E2671,INVENTORYDATA,13,FALSE))","v":{"$error":"#N/A"}},null,"Hard Drive Removed",null,{"$f":"IF(ISBLANK(VLOOKUP(K2671,INVENTORYDATA,13,FALSE)),\"X\",\"\")","v":""},null,{"$f":"IF(ISBLANK(VLOOKUP(K2671,INVENTORYDATA,13,FALSE)),\"\",VLOOKUP(K2671,INVENTORYDATA,13,FALSE))","v":{"$error":"#N/A"}}]
["Install Memory",null,"X",{"$nulls":3},"Install Memory",null,"X"]
["Power ON",null,"X",{"$nulls":3},"Power ON",null,"X"]
["Record BIOS info",null,"X",{"$nulls":3},"Record BIOS info",null,"X"]
["Check Optical Drive",null,{"$f":"IF((VLOOKUP(E2671,INVENTORYDATA,7,FALSE))=\"YES\",\"X\",\"\")","v":{"$error":"#N/A"}},{"$f":"IF((VLOOKUP(E2671,INVENTORYDATA,7,FALSE))=\"NO\",\"X\",\"\")","v":{"$error":"#N/A"}},null,null,"Check Optical Drive",null,{"$f":"IF((VLOOKUP(K2671,INVENTORYDATA,7,FALSE))=\"YES\",\"X\",\"\")","v":{"$error":"#N/A"}},{"$f":"IF((VLOOKUP(K2671,INVENTORYDATA,7,FALSE))=\"NO\",\"X\",\"\")","v":{"$error":"#N/A"}}]
["Power Off",null,"X",{"$nulls":3},"Power Off",null,"X"]
["HDD Serial No.",null,{"$f":"IF(ISBLANK(VLOOKUP(E2671,INVENTORYDATA,12,FALSE)),\"\",VLOOKUP(E2671,INVENTORYDATA,12,FALSE))","v":{"$error":"#N/A"}},{"$nulls":3},"HDD Serial No.",null,{"$f":"IF(ISBLANK(VLOOKUP(K2671,INVENTORYDATA,12,FALSE)),\"\",VLOOKUP(K2671,INVENTORYDATA,12,FALSE))","v":{"$error":"#N/A"}}]
[]
["Tested for key functions,R2/Ready for Resale",{"$nulls":5},"Tested for key functions,R2/Ready for Resale"]
["BIOS Lock","Caddy","Optical","WebCam","Battery",null,"BIOS Lock","Caddy","Optical","WebCam","Battery"]
[null,null,{"$f":"VLOOKUP(E2671,INVENTORY!$A$2:$N$100,7,FALSE)","v":{"$error":"#N/A"}},{"$f":"VLOOKUP(E2671,INVENTORY!$A$2:$N$100,8,FALSE)","v":{"$error":"#N/A"}},{"$f":"VLOOKUP(E2671,INVENTORY!$A$2:$N$100,9,FALSE)","v":{"$error":"#N/A"}},{"$nulls":3},{"$f":"VLOOKUP(K2671,INVENTORY!$A$2:$N$100,7,FALSE)","v":{"$error":"#N/A"}},{"$f":"VLOOKUP(K2671,INVENTORY!$A$2:$N$100,8,FALSE)","v":{"$error":"#N/A"}},{"$f":"VLOOKUP(K2671,INVENTORY!$A$2:$N$100,9,FALSE)","v":{"$error":"#N/A"}}]
[]
["CPU Cosmetics Defects:",null,{"$f":"\"Function Code: \"&VLOOKUP(E2671,INVENTORY!$A$2:$Q$100,14,FALSE)","v":{"$error":"#N/A"}},{"$nulls":3},"CPU Cosmetics Defects:",null,{"$f":"\"Function Code: \"&VLOOKUP(K2671,INVENTORY!$A$2:$Q$100,14,FALSE)","v":{"$error":"#N/A"}}]
[]
[null,null,{"$f":"\"Cosmetic Code: \"&VLOOKUP(E2671,INVENTORY!$A$2:$Q$100,15,FALSE)","v":{"$error":"#N/A"}},{"$nulls":5},{"$f":"\"Cosmetic Code: \"&VLOOKUP(K2671,INVENTORY!$A$2:$Q$100,15,FALSE)","v":{"$error":"#N/A"}}]
[]
["Casing","Plugs/Ports",{"$nulls":4},"Casing","Plugs/Ports"]
["Pass","Pass",{"$nulls":4},"Pass","Pass"]
["Fail","Fail",null,"TRRC#:L.T.R.",null,null,"Fail","Fail",null,"TRRC#:L.T.R."]
[]
["LAPTOP TESTING RECORD",{"$nulls":5},"LAPTOP TESTING RECORD"]
[]
[{"$nulls":3},"ITEM #",{"$f":"E2671+2","v":187},{"$nulls":4},"ITEM #",{"$f":"K2671+2","v":188}]
["Tester: ","RR","Date:",{"$f":"NOW()","v":"2025-12-15T11:00:59.760"},null,null,"Tester: ","RR","Date:",{"$f":"NOW()","v":"2025-12-15T11:00:59.760"}]
["Type: ","LAPTOP","SN:",{"$f":"VLOOKUP(E2700,INVENTORYDATA,10,FALSE)","v":{"$error":"#N/A"}},null,null,"Type: ","LAPTOP","SN:",{"$f":"VLOOKUP(K2700,INVENTORYDATA,10,FALSE)","v":{"$error":"#N/A"}}]
[{"$f":"\"Make: \"","v":"Make: "},{"$f":"VLOOKUP(E2700,INVENTORYDATA,2,FALSE)","v":{"$error":"#N/A"}},{"$f":"\"Model: \"","v":"Model: "},{"$f":"VLOOKUP(E2700,INVENTORYDATA,3,FALSE)","v":{"$error":"#N/A"}},null,null,{"$f":"\"Make: \"","v":"Make: "},{"$f":"VLOOKUP(K2700,INVENTORYDATA,2,FALSE)","v":{"$error":"#N/A"}},{"$f":"\"Model: \"","v":"Model: "},{"$f":"VLOOKUP(K2700,INVENTORYDATA,3,FALSE)","v":{"$error":"#N/A"}}]
[{"$f":"\"CPU/Speed: \"","v":"CPU/Speed: "},{"$f":"VLOOKUP(E2700,INVENTORYDATA,4,FALSE)&\" / \"&VLOOKUP(E2700,INVENTORYDATA,5,FALSE)&\"GHz\"","v":{"$error":"#N/A"}},null,{"$f":"\"Memory: \"","v":"Memory: "},{"$f":"VLOOKUP(E2700,INVENTORYDATA,6,FALSE)","v":{"$error":"#N/A"}},null,{"$f":"\"CPU/Speed: \"","v":"CPU/Speed: "},{"$f":"VLOOKUP(K2700,INVENTORYDATA,4,FALSE)&\" / \"&VLOOKUP(K2700,INVENTORYDATA,5,FALSE)&\"GHz\"","v":{"$error":"#N/A"}},null,{"$f":"\"Memory: \"","v":"Memory: "},{"$f":"VLOOKUP(K2700,INVENTORYDATA,6,FALSE)","v":{"$error":"#N/A"}}]
[]
["Key Function",null,"Pass","Fail ","Comments",null,"Key Function",null,"Pass","Fail ","Comments"]
["Hard Drive Removed",null,{"$f":"IF(ISBLANK(VLOOKUP(E2700,INVENTORYDATA,13,FALSE)),\"X\",\"\")","v":""},null,{"$f":"IF(ISBLANK(VLOOKUP(E2700,INVENTORYDATA,13,FALSE)),\"\",VLOOKUP(E2700,INVENTORYDATA,13,FALSE))","v":{"$error":"#N/A"}},null,"Hard Drive Removed",null,{"$f":"IF(ISBLANK(VLOOKUP(K2700,INVENTORYDATA,13,FALSE)),\"X\",\"\")","v":""},null,{"$f":"IF(ISBLANK(VLOOKUP(K2700,INVENTORYDATA,13,FALSE)),\"\",VLOOKUP(K2700,INVENTORYDATA,13,FALSE))","v":{"$error":"#N/A"}}]
["Install Memory",null,"X",{"$nulls":3},"Install Memory",null,"X"]
["Power ON",null,"X",{"$nulls":3},"Power ON",null,"X"]
["Record BIOS info",null,"X",{"$nulls":3},"Record BIOS info",null,"X"]
["Check Optical Drive",null,{"$f":"IF((VLOOKUP(E2700,INVENTORYDATA,7,FALSE))=\"YES\",\"X\",\"\")","v":{"$error":"#N/A"}},{"$f":"IF((VLOOKUP(E2700,INVENTORYDATA,7,FALSE))=\"NO\",\"X\",\"\")","v":{"$error":"#N/A"}},null,null,"Check Optical Drive",null,{"$f":"IF((VLOOKUP(K2700,INVENTORYDATA,7,FALSE))=\"YES\",\"X\",\"\")","v":{"$error":"#N/A"}},{"$f":"IF((VLOOKUP(K2700,INVENTORYDATA,7,FALSE))=\"NO\",\"X\",\"\")","v":{"$error":"#N/A"}}]
["Power Off",null,"X",{"$nulls":3},"Power Off",null,"X"]
["HDD Serial No.",null,{"$f":"IF(ISBLANK(VLOOKUP(E2700,INVENTORYDATA,12,FALSE)),\"\",VLOOKUP(E2700,INVENTORYDATA,12,FALSE))","v":{"$error":"#N/A"}},{"$nulls":3},"HDD Serial No.",null,{"$f":"IF(ISBLANK(VLOOKUP(K2700,INVENTORYDATA,12,FALSE)),\"\",VLOOKUP(K2700,INVENTORYDATA,12,FALSE))","v":{"$error":"#N/A"}}]
[]
["Tested for key functions,R2/Ready for Resale",{"$nulls":5},"Tested for key functions,R2/Ready for Resale"]
["BIOS Lock","Caddy","Optical","WebCam","Battery",null,"BIOS Lock","Caddy","Optical","WebCam","Battery"]
[null,null,{"$f":"VLOOKUP(E2700,INVENTORY!$A$2:$N$100,7,FALSE)","v":{"$error":"#N/A"}},{"$f":"VLOOKUP(E2700,INVENTORY!$A$2:$N$100,8,FALSE)","v":{"$error":"#N/A"}},{"$f":"VLOOKUP(E2700,INVENTORY!$A$2:$N$100,9,FALSE)","v":{"$error":"#N/A"}},{"$nulls":3},{"$f":"VLOOKUP(K2700,INVENTORY!$A$2:$N$100,7,FALSE)","v":{"$error":"#N/A"}},{"$f":"VLOOKUP(K2700,INVENTORY!$A$2:$N$100,8,FALSE)","v":{"$error":"#N/A"}},{"$f":"VLOOKUP(K2700,INVENTORY!$A$2:$N$100,9,FALSE)","v":{"$error":"#N/A"}}]
[]
["CPU Cosmetics Defects:",null,{"$f":"\"Function Code: \"&VLOOKUP(E2700,INVENTORY!$A$2:$Q$100,14,FALSE)","v":{"$error":"#N/A"}},{"$nulls":3},"CPU Cosmetics Defects:",null,{"$f":"\"Function Code: \"&VLOOKUP(K2700,INVENTORY!$A$2:$Q$100,14,FALSE)","v":{"$error":"#N/A"}}]
[]
[null,null,{"$f":"\"Cosmetic Code: \"&VLOOKUP(E2700,INVENTORY!$A$2:$Q$100,15,FALSE)","v":{"$error":"#N/A"}},{"$nulls":5},{"$f":"\"Cosmetic Code: \"&VLOOKUP(K2700,INVENTORY!$A$2:$Q$100,15,FALSE)","v":{"$error":"#N/A"}}]
[]
["Casing","Plugs/Ports",{"$nulls":4},"Casing","Plugs/Ports"]
["Pass","Pass",{"$nulls":4},"Pass","Pass"]
["Fail","Fail",null,"TRRC#:L.T.R.",null,null,"Fail","Fail",null,"TRRC#:L.T.R."]
[]
["LAPTOP TESTING RECORD",{"$nulls":5},"LAPTOP TESTING RECORD"]
[]
[{"$nulls":3},"ITEM #",{"$f":"E2700+2","v":189},{"$nulls":4},"ITEM #",{"$f":"K2700+2","v":190}]
["Tester: ","RR","Date:",{"$f":"NOW()","v":"2025-12-15T11:00:59.760"},null,null,"Tester: ","RR","Date:",{"$f":"NOW()","v":"2025-12-15T11:00:59.760"}]
["Type: ","LAPTOP","SN:",{"$f":"VLOOKUP(E2729,INVENTORYDATA,10,FALSE)","v":{"$error":"#N/A"}},null,null,"Type: ","LAPTOP","SN:",{"$f":"VLOOKUP(K2729,INVENTORYDATA,10,FALSE)","v":{"$error":"#N/A"}}]
[{"$f":"\"Make: \"","v":"Make: "},{"$f":"VLOOKUP(E2729,INVENTORYDATA,2,FALSE)","v":{"$error":"#N/A"}},{"$f":"\"Model: \"","v":"Model: "},{"$f":"VLOOKUP(E2729,INVENTORYDATA,3,FALSE)","v":{"$error":"#N/A"}},null,null,{"$f":"\"Make: \"","v":"Make: "},{"$f":"VLOOKUP(K2729,INVENTORYDATA,2,FALSE)","v":{"$error":"#N/A"}},{"$f":"\"Model: \"","v":"Model: "},{"$f":"VLOOKUP(K2729,INVENTORYDATA,3,FALSE)","v":{"$error":"#N/A"}}]
[{"$f":"\"CPU/Speed: \"","v":"CPU/Speed: "},{"$f":"VLOOKUP(E2729,INVENTORYDATA,4,FALSE)&\" / \"&VLOOKUP(E2729,INVENTORYDATA,5,FALSE)&\"GHz\"","v":{"$error":"#N/A"}},null,{"$f":"\"Memory: \"","v":"Memory: "},{"$f":"VLOOKUP(E2729,INVENTORYDATA,6,FALSE)","v":{"$error":"#N/A"}},null,{"$f":"\"CPU/Speed: \"","v":"CPU/Speed: "},{"$f":"VLOOKUP(K2729,INVENTORYDATA,4,FALSE)&\" / \"&VLOOKUP(K2729,INVENTORYDATA,5,FALSE)&\"GHz\"","v":{"$error":"#N/A"}},null,{"$f":"\"Memory: \"","v":"Memory: "},{"$f":"VLOOKUP(K2729,INVENTORYDATA,6,FALSE)","v":{"$error":"#N/A"}}]
[]
["Key Function",null,"Pass","Fail ","Comments",null,"Key Function",null,"Pass","Fail ","Comments"]
["Hard Drive Removed",null,{"$f":"IF(ISBLANK(VLOOKUP(E2729,INVENTORYDATA,13,FALSE)),\"X\",\"\")","v":""},null,{"$f":"IF(ISBLANK(VLOOKUP(E2729,INVENTORYDATA,13,FALSE)),\"\",VLOOKUP(E2729,INVENTORYDATA,13,FALSE))","v":{"$error":"#N/A"}},null,"Hard Drive Removed",null,{"$f":"IF(ISBLANK(VLOOKUP(K2729,INVENTORYDATA,13,FALSE)),\"X\",\"\")","v":""},null,{"$f":"IF(ISBLANK(VLOOKUP(K2729,INVENTORYDATA,13,FALSE)),\"\",VLOOKUP(K2729,INVENTORYDATA,13,FALSE))","v":{"$error":"#N/A"}}]
["Install Memory",null,"X",{"$nulls":3},"Install Memory",null,"X"]
["Power ON",null,"X",{"$nulls":3},"Power ON",null,"X"]
["Record BIOS info",null,"X",{"$nulls":3},"Record BIOS info",null,"X"]
["Check Optical Drive",null,{"$f":"IF((VLOOKUP(E2729,INVENTORYDATA,7,FALSE))=\"YES\",\"X\",\"\")","v":{"$error":"#N/A"}},{"$f":"IF((VLOOKUP(E2729,INVENTORYDATA,7,FALSE))=\"NO\",\"X\",\"\")","v":{"$error":"#N/A"}},null,null,"Check Optical Drive",null,{"$f":"IF((VLOOKUP(K2729,INVENTORYDATA,7,FALSE))=\"YES\",\"X\",\"\")","v":{"$error":"#N/A"}},{"$f":"IF((VLOOKUP(K2729,INVENTORYDATA,7,FALSE))=\"NO\",\"X\",\"\")","v":{"$error":"#N/A"}}]
["Power Off",null,"X",{"$nulls":3},"Power Off",null,"X"]
["HDD Serial No.",null,{"$f":"IF(ISBLANK(VLOOKUP(E2729,INVENTORYDATA,12,FALSE)),\"\",VLOOKUP(E2729,INVENTORYDATA,12,FALSE))","v":{"$error":"#N/A"}},{"$nulls":3},"HDD Serial No.",null,{"$f":"IF(ISBLANK(VLOOKUP(K2729,INVENTORYDATA,12,FALSE)),\"\",VLOOKUP(K2729,INVENTORYDATA,12,FALSE))","v":{"$error":"#N/A"}}]
[]
["Tested for key functions,R2/Ready for Resale",{"$nulls":5},"Tested for key functions,R2/Ready for Resale"]
["BIOS Lock","Caddy","Optical","WebCam","Battery",null,"BIOS Lock","Caddy","Optical","WebCam","Battery"]
[null,null,{"$f":"VLOOKUP(E2729,INVENTORY!$A$2:$N$100,7,FALSE)","v":{"$error":"#N/A"}},{"$f":"VLOOKUP(E2729,INVENTORY!$A$2:$N$100,8,FALSE)","v":{"$error":"#N/A"}},{"$f":"VLOOKUP(E2729,INVENTORY!$A$2:$N$100,9,FALSE)","v":{"$error":"#N/A"}},{"$nulls":3},{"$f":"VLOOKUP(K2729,INVENTORY!$A$2:$N$100,7,FALSE)","v":{"$error":"#N/A"}},{"$f":"VLOOKUP(K2729,INVENTORY!$A$2:$N$100,8,FALSE)","v":{"$error":"#N/A"}},{"$f":"VLOOKUP(K2729,INVENTORY!$A$2:$N$100,9,FALSE)","v":{"$error":"#N/A"}}]
[]
["CPU Cosmetics Defects:",null,{"$f":"\"Function Code: \"&VLOOKUP(E2729,INVENTORY!$A$2:$Q$100,14,FALSE)","v":{"$error":"#N/A"}},{"$nulls":3},"CPU Cosmetics Defects:",null,{"$f":"\"Function Code: \"&VLOOKUP(K2729,INVENTORY!$A$2:$Q$100,14,FALSE)","v":{"$error":"#N/A"}}]
[]
[null,null,{"$f":"\"Cosmetic Code: \"&VLOOKUP(E2729,INVENTORY!$A$2:$Q$100,15,FALSE)","v":{"$error":"#N/A"}},{"$nulls":5},{"$f":"\"Cosmetic Code: \"&VLOOKUP(K2729,INVENTORY!$A$2:$Q$100,15,FALSE)","v":{"$error":"#N/A"}}]
[]
["Casing","Plugs/Ports",{"$nulls":4},"Casing","Plugs/Ports"]
["Pass","Pass",{"$nulls":4},"Pass","Pass"]
["Fail","Fail",null,"TRRC#:L.T.R.",null,null,"Fail","Fail",null,"TRRC#:L.T.R."]
[]
["LAPTOP TESTING RECORD",{"$nulls":5},"LAPTOP TESTING RECORD"]
[]
[{"$nulls":3},"ITEM #",{"$f":"E2729+2","v":191},{"$nulls":4},"ITEM #",{"$f":"K2729+2","v":192}]
["Tester: ","RR","Date:",{"$f":"NOW()","v":"2025-12-15T11:00:59.760"},null,null,"Tester: ","RR","Date:",{"$f":"NOW()","v":"2025-12-15T11:00:59.760"}]
["Type: ","LAPTOP","SN:",{"$f":"VLOOKUP(E2758,INVENTORYDATA,10,FALSE)","v":{"$error":"#N/A"}},null,null,"Type: ","LAPTOP","SN:",{"$f":"VLOOKUP(K2758,INVENTORYDATA,10,FALSE)","v":{"$error":"#N/A"}}]
[{"$f":"\"Make: \"","v":"Make: "},{"$f":"VLOOKUP(E2758,INVENTORYDATA,2,FALSE)","v":{"$error":"#N/A"}},{"$f":"\"Model: \"","v":"Model: "},{"$f":"VLOOKUP(E2758,INVENTORYDATA,3,FALSE)","v":{"$error":"#N/A"}},null,null,{"$f":"\"Make: \"","v":"Make: "},{"$f":"VLOOKUP(K2758,INVENTORYDATA,2,FALSE)","v":{"$error":"#N/A"}},{"$f":"\"Model: \"","v":"Model: "},{"$f":"VLOOKUP(K2758,INVENTORYDATA,3,FALSE)","v":{"$error":"#N/A"}}]
[{"$f":"\"CPU/Speed: \"","v":"CPU/Speed: "},{"$f":"VLOOKUP(E2758,INVENTORYDATA,4,FALSE)&\" / \"&VLOOKUP(E2758,INVENTORYDATA,5,FALSE)&\"GHz\"","v":{"$error":"#N/A"}},null,{"$f":"\"Memory: \"","v":"Memory: "},{"$f":"VLOOKUP(E2758,INVENTORYDATA,6,FALSE)","v":{"$error":"#N/A"}},null,{"$f":"\"CPU/Speed: \"","v":"CPU/Speed: "},{"$f":"VLOOKUP(K2758,INVENTORYDATA,4,FALSE)&\" / \"&VLOOKUP(K2758,INVENTORYDATA,5,FALSE)&\"GHz\"","v":{"$error":"#N/A"}},null,{"$f":"\"Memory: \"","v":"Memory: "},{"$f":"VLOOKUP(K2758,INVENTORYDATA,6,FALSE)","v":{"$error":"#N/A"}}]
[]
["Key Function",null,"Pass","Fail ","Comments",null,"Key Function",null,"Pass","Fail ","Comments"]
["Hard Drive Removed",null,{"$f":"IF(ISBLANK(VLOOKUP(E2758,INVENTORYDATA,13,FALSE)),\"X\",\"\")","v":""},null,{"$f":"IF(ISBLANK(VLOOKUP(E2758,INVENTORYDATA,13,FALSE)),\"\",VLOOKUP(E2758,INVENTORYDATA,13,FALSE))","v":{"$error":"#N/A"}},null,"Hard Drive Removed",null,{"$f":"IF(ISBLANK(VLOOKUP(K2758,INVENTORYDATA,13,FALSE)),\"X\",\"\")","v":""},null,{"$f":"IF(ISBLANK(VLOOKUP(K2758,INVENTORYDATA,13,FALSE)),\"\",VLOOKUP(K2758,INVENTORYDATA,13,FALSE))","v":{"$error":"#N/A"}}]
["Install Memory",null,"X",{"$nulls":3},"Install Memory",null,"X"]
["Power ON",null,"X",{"$nulls":3},"Power ON",null,"X"]
["Record BIOS info",null,"X",{"$nulls":3},"Record BIOS info",null,"X"]
["Check Optical Drive",null,{"$f":"IF((VLOOKUP(E2758,INVENTORYDATA,7,FALSE))=\"YES\",\"X\",\"\")","v":{"$error":"#N/A"}},{"$f":"IF((VLOOKUP(E2758,INVENTORYDATA,7,FALSE))=\"NO\",\"X\",\"\")","v":{"$error":"#N/A"}},null,null,"Check Optical Drive",null,{"$f":"IF((VLOOKUP(K2758,INVENTORYDATA,7,FALSE))=\"YES\",\"X\",\"\")","v":{"$error":"#N/A"}},{"$f":"IF((VLOOKUP(K2758,INVENTORYDATA,7,FALSE))=\"NO\",\"X\",\"\")","v":{"$error":"#N/A"}}]
["Power Off",null,"X",{"$nulls":3},"Power Off",null,"X"]
["HDD Serial No.",null,{"$f":"IF(ISBLANK(VLOOKUP(E2758,INVENTORYDATA,12,FALSE)),\"\",VLOOKUP(E2758,INVENTORYDATA,12,FALSE))","v":{"$error":"#N/A"}},{"$nulls":3},"HDD Serial No.",null,{"$f":"IF(ISBLANK(VLOOKUP(K2758,INVENTORYDATA,12,FALSE)),\"\",VLOOKUP(K2758,INVENTORYDATA,12,FALSE))","v":{"$error":"#N/A"}}]
[]
["Tested for key functions,R2/Ready for Resale",{"$nulls":5},"Tested for key functions,R2/Ready for Resale"]
["BIOS Lock","Caddy","Optical","WebCam","Battery",null,"BIOS Lock","Caddy","Optical","WebCam","Battery"]
[null,null,{"$f":"VLOOKUP(E2758,INVENTORY!$A$2:$N$100,7,FALSE)","v":{"$error":"#N/A"}},{"$f":"VLOOKUP(E2758,INVENTORY!$A$2:$N$100,8,FALSE)","v":{"$error":"#N/A"}},{"$f":"VLOOKUP(E2758,INVENTORY!$A$2:$N$100,9,FALSE)","v":{"$error":"#N/A"}},{"$nulls":3},{"$f":"VLOOKUP(K2758,INVENTORY!$A$2:$N$100,7,FALSE)","v":{"$error":"#N/A"}},{"$f":"VLOOKUP(K2758,INVENTORY!$A$2:$N$100,8,FALSE)","v":{"$error":"#N/A"}},{"$f":"VLOOKUP(K2758,INVENTORY!$A$2:$N$100,9,FALSE)","v":{"$error":"#N/A"}}]
[]
["CPU Cosmetics Defects:",null,{"$f":"\"Function Code: \"&VLOOKUP(E2758,INVENTORY!$A$2:$Q$100,14,FALSE)","v":{"$error":"#N/A"}},{"$nulls":3},"CPU Cosmetics Defects:",null,{"$f":"\"Function Code: \"&VLOOKUP(K2758,INVENTORY!$A$2:$Q$100,14,FALSE)","v":{"$error":"#N/A"}}]
[]
[null,null,{"$f":"\"Cosmetic Code: \"&VLOOKUP(E2758,INVENTORY!$A$2:$Q$100,15,FALSE)","v":{"$error":"#N/A"}},{"$nulls":5},{"$f":"\"Cosmetic Code: \"&VLOOKUP(K2758,INVENTORY!$A$2:$Q$100,15,FALSE)","v":{"$error":"#N/A"}}]
[]
["Casing","Plugs/Ports",{"$nulls":4},"Casing","Plugs/Ports"]
["Pass","Pass",{"$nulls":4},"Pass","Pass"]
["Fail","Fail",null,"TRRC#:L.T.R.",null,null,"Fail","Fail",null,"TRRC#:L.T.R."]
[]
["LAPTOP TESTING RECORD",{"$nulls":5},"LAPTOP TESTING RECORD"]
[]
[{"$nulls":3},"ITEM #",{"$f":"E2758+2","v":193},{"$nulls":4},"ITEM #",{"$f":"K2758+2","v":194}]
["Tester: ","RR","Date:",{"$f":"NOW()","v":"2025-12-15T11:00:59.760"},null,null,"Tester: ","RR","Date:",{"$f":"NOW()","v":"2025-12-15T11:00:59.760"}]
["Type: ","LAPTOP","SN:",{"$f":"VLOOKUP(E2787,INVENTORYDATA,10,FALSE)","v":{"$error":"#N/A"}},null,null,"Type: ","LAPTOP","SN:",{"$f":"VLOOKUP(K2787,INVENTORYDATA,10,FALSE)","v":{"$error":"#N/A"}}]
[{"$f":"\"Make: \"","v":"Make: "},{"$f":"VLOOKUP(E2787,INVENTORYDATA,2,FALSE)","v":{"$error":"#N/A"}},{"$f":"\"Model: \"","v":"Model: "},{"$f":"VLOOKUP(E2787,INVENTORYDATA,3,FALSE)","v":{"$error":"#N/A"}},null,null,{"$f":"\"Make: \"","v":"Make: "},{"$f":"VLOOKUP(K2787,INVENTORYDATA,2,FALSE)","v":{"$error":"#N/A"}},{"$f":"\"Model: \"","v":"Model: "},{"$f":"VLOOKUP(K2787,INVENTORYDATA,3,FALSE)","v":{"$error":"#N/A"}}]
[{"$f":"\"CPU/Speed: \"","v":"CPU/Speed: "},{"$f":"VLOOKUP(E2787,INVENTORYDATA,4,FALSE)&\" / \"&VLOOKUP(E2787,INVENTORYDATA,5,FALSE)&\"GHz\"","v":{"$error":"#N/A"}},null,{"$f":"\"Memory: \"","v":"Memory: "},{"$f":"VLOOKUP(E2787,INVENTORYDATA,6,FALSE)","v":{"$error":"#N/A"}},null,{"$f":"\"CPU/Speed: \"","v":"CPU/Speed: "},{"$f":"VLOOKUP(K2787,INVENTORYDATA,4,FALSE)&\" / \"&VLOOKUP(K2787,INVENTORYDATA,5,FALSE)&\"GHz\"","v":{"$error":"#N/A"}},null,{"$f":"\"Memory: \"","v":"Memory: "},{"$f":"VLOOKUP(K2787,INVENTORYDATA,6,FALSE)","v":{"$error":"#N/A"}}]
[]
["Key Function",null,"Pass","Fail ","Comments",null,"Key Function",null,"Pass","Fail ","Comments"]
["Hard Drive Removed",null,{"$f":"IF(ISBLANK(VLOOKUP(E2787,INVENTORYDATA,13,FALSE)),\"X\",\"\")","v":""},null,{"$f":"IF(ISBLANK(VLOOKUP(E2787,INVENTORYDATA,13,FALSE)),\"\",VLOOKUP(E2787,INVENTORYDATA,13,FALSE))","v":{"$error":"#N/A"}},null,"Hard Drive Removed",null,{"$f":"IF(ISBLANK(VLOOKUP(K2787,INVENTORYDATA,13,FALSE)),\"X\",\"\")","v":""},null,{"$f":"IF(ISBLANK(VLOOKUP(K2787,INVENTORYDATA,13,FALSE)),\"\",VLOOKUP(K2787,INVENTORYDATA,13,FALSE))","v":{"$error":"#N/A"}}]
["Install Memory",null,"X",{"$nulls":3},"Install Memory",null,"X"]
["Power ON",null,"X",{"$nulls":3},"Power ON",null,"X"]
["Record BIOS info",null,"X",{"$nulls":3},"Record BIOS info",null,"X"]
["Check Optical Drive",null,{"$f":"IF((VLOOKUP(E2787,INVENTORYDATA,7,FALSE))=\"YES\",\"X\",\"\")","v":{"$error":"#N/A"}},{"$f":"IF((VLOOKUP(E2787,INVENTORYDATA,7,FALSE))=\"NO\",\"X\",\"\")","v":{"$error":"#N/A"}},null,null,"Check Optical Drive",null,{"$f":"IF((VLOOKUP(K2787,INVENTORYDATA,7,FALSE))=\"YES\",\"X\",\"\")","v":{"$error":"#N/A"}},{"$f":"IF((VLOOKUP(K2787,INVENTORYDATA,7,FALSE))=\"NO\",\"X\",\"\")","v":{"$error":"#N/A"}}]
["Power Off",null,"X",{"$nulls":3},"Power Off",null,"X"]
["HDD Serial No.",null,{"$f":"IF(ISBLANK(VLOOKUP(E2787,INVENTORYDATA,12,FALSE)),\"\",VLOOKUP(E2787,INVENTORYDATA,12,FALSE))","v":{"$error":"#N/A"}},{"$nulls":3},"HDD Serial No.",null,{"$f":"IF(ISBLANK(VLOOKUP(K2787,INVENTORYDATA,12,FALSE)),\"\",VLOOKUP(K2787,INVENTORYDATA,12,FALSE))","v":{"$error":"#N/A"}}]
[]
["Tested for key functions,R2/Ready for Resale",{"$nulls":5},"Tested for key functions,R2/Ready for Resale"]
["BIOS Lock","Caddy","Optical","WebCam","Battery",null,"BIOS Lock","Caddy","Optical","WebCam","Battery"]
[null,null,{"$f":"VLOOKUP(E2787,INVENTORY!$A$2:$N$100,7,FALSE)","v":{"$error":"#N/A"}},{"$f":"VLOOKUP(E2787,INVENTORY!$A$2:$N$100,8,FALSE)","v":{"$error":"#N/A"}},{"$f":"VLOOKUP(E2787,INVENTORY!$A$2:$N$100,9,FALSE)","v":{"$error":"#N/A"}},{"$nulls":3},{"$f":"VLOOKUP(K2787,INVENTORY!$A$2:$N$100,7,FALSE)","v":{"$error":"#N/A"}},{"$f":"VLOOKUP(K2787,INVENTORY!$A$2:$N$100,8,FALSE)","v":{"$error":"#N/A"}},{"$f":"VLOOKUP(K2787,INVENTORY!$A$2:$N$100,9,FALSE)","v":{"$error":"#N/A"}}]
[]
["CPU Cosmetics Defects:",null,{"$f":"\"Function Code: \"&VLOOKUP(E2787,INVENTORY!$A$2:$Q$100,14,FALSE)","v":{"$error":"#N/A"}},{"$nulls":3},"CPU Cosmetics Defects:",null,{"$f":"\"Function Code: \"&VLOOKUP(K2787,INVENTORY!$A$2:$Q$100,14,FALSE)","v":{"$error":"#N/A"}}]
[]
[null,null,{"$f":"\"Cosmetic Code: \"&VLOOKUP(E2787,INVENTORY!$A$2:$Q$100,15,FALSE)","v":{"$error":"#N/A"}},{"$nulls":5},{"$f":"\"Cosmetic Code: \"&VLOOKUP(K2787,INVENTORY!$A$2:$Q$100,15,FALSE)","v":{"$error":"#N/A"}}]
[]
["Casing","Plugs/Ports",{"$nulls":4},"Casing","Plugs/Ports"]
["Pass","Pass",{"$nulls":4},"Pass","Pass"]
["Fail","Fail",null,"TRRC#:L.T.R.",null,null,"Fail","Fail",null,"TRRC#:L.T.R."]
[]
["LAPTOP TESTING RECORD",{"$nulls":5},"LAPTOP TESTING RECORD"]
[]
[{"$nulls":3},"ITEM #",{"$f":"E2787+2","v":195},{"$nulls":4},"ITEM #",{"$f":"K2787+2","v":196}]
["Tester: ","RR","Date:",{"$f":"NOW()","v":"2025-12-15T11:00:59.760"},null,null,"Tester: ","RR","Date:",{"$f":"NOW()","v":"2025-12-15T11:00:59.760"}]
["Type: ","LAPTOP","SN:",{"$f":"VLOOKUP(E2816,INVENTORYDATA,10,FALSE)","v":{"$error":"#N/A"}},null,null,"Type: ","LAPTOP","SN:",{"$f":"VLOOKUP(K2816,INVENTORYDATA,10,FALSE)","v":{"$error":"#N/A"}}]
[{"$f":"\"Make: \"","v":"Make: "},{"$f":"VLOOKUP(E2816,INVENTORYDATA,2,FALSE)","v":{"$error":"#N/A"}},{"$f":"\"Model: \"","v":"Model: "},{"$f":"VLOOKUP(E2816,INVENTORYDATA,3,FALSE)","v":{"$error":"#N/A"}},null,null,{"$f":"\"Make: \"","v":"Make: "},{"$f":"VLOOKUP(K2816,INVENTORYDATA,2,FALSE)","v":{"$error":"#N/A"}},{"$f":"\"Model: \"","v":"Model: "},{"$f":"VLOOKUP(K2816,INVENTORYDATA,3,FALSE)","v":{"$error":"#N/A"}}]
[{"$f":"\"CPU/Speed: \"","v":"CPU/Speed: "},{"$f":"VLOOKUP(E2816,INVENTORYDATA,4,FALSE)&\" / \"&VLOOKUP(E2816,INVENTORYDATA,5,FALSE)&\"GHz\"","v":{"$error":"#N/A"}},null,{"$f":"\"Memory: \"","v":"Memory: "},{"$f":"VLOOKUP(E2816,INVENTORYDATA,6,FALSE)","v":{"$error":"#N/A"}},null,{"$f":"\"CPU/Speed: \"","v":"CPU/Speed: "},{"$f":"VLOOKUP(K2816,INVENTORYDATA,4,FALSE)&\" / \"&VLOOKUP(K2816,INVENTORYDATA,5,FALSE)&\"GHz\"","v":{"$error":"#N/A"}},null,{"$f":"\"Memory: \"","v":"Memory: "},{"$f":"VLOOKUP(K2816,INVENTORYDATA,6,FALSE)","v":{"$error":"#N/A"}}]
[]
["Key Function",null,"Pass","Fail ","Comments",null,"Key Function",null,"Pass","Fail ","Comments"]
["Hard Drive Removed",null,{"$f":"IF(ISBLANK(VLOOKUP(E2816,INVENTORYDATA,13,FALSE)),\"X\",\"\")","v":""},null,{"$f":"IF(ISBLANK(VLOOKUP(E2816,INVENTORYDATA,13,FALSE)),\"\",VLOOKUP(E2816,INVENTORYDATA,13,FALSE))","v":{"$error":"#N/A"}},null,"Hard Drive Removed",null,{"$f":"IF(ISBLANK(VLOOKUP(K2816,INVENTORYDATA,13,FALSE)),\"X\",\"\")","v":""},null,{"$f":"IF(ISBLANK(VLOOKUP(K2816,INVENTORYDATA,13,FALSE)),\"\",VLOOKUP(K2816,INVENTORYDATA,13,FALSE))","v":{"$error":"#N/A"}}]
["Install Memory",null,"X",{"$nulls":3},"Install Memory",null,"X"]
["Power ON",null,"X",{"$nulls":3},"Power ON",null,"X"]
["Record BIOS info",null,"X",{"$nulls":3},"Record BIOS info",null,"X"]
["Check Optical Drive",null,{"$f":"IF((VLOOKUP(E2816,INVENTORYDATA,7,FALSE))=\"YES\",\"X\",\"\")","v":{"$error":"#N/A"}},{"$f":"IF((VLOOKUP(E2816,INVENTORYDATA,7,FALSE))=\"NO\",\"X\",\"\")","v":{"$error":"#N/A"}},null,null,"Check Optical Drive",null,{"$f":"IF((VLOOKUP(K2816,INVENTORYDATA,7,FALSE))=\"YES\",\"X\",\"\")","v":{"$error":"#N/A"}},{"$f":"IF((VLOOKUP(K2816,INVENTORYDATA,7,FALSE))=\"NO\",\"X\",\"\")","v":{"$error":"#N/A"}}]
["Power Off",null,"X",{"$nulls":3},"Power Off",null,"X"]
["HDD Serial No.",null,{"$f":"IF(ISBLANK(VLOOKUP(E2816,INVENTORYDATA,12,FALSE)),\"\",VLOOKUP(E2816,INVENTORYDATA,12,FALSE))","v":{"$error":"#N/A"}},{"$nulls":3},"HDD Serial No.",null,{"$f":"IF(ISBLANK(VLOOKUP(K2816,INVENTORYDATA,12,FALSE)),\"\",VLOOKUP(K2816,INVENTORYDATA,12,FALSE))","v":{"$error":"#N/A"}}]
[]
["Tested for key functions,R2/Ready for Resale",{"$nulls":5},"Tested for key functions,R2/Ready for Resale"]
["BIOS Lock","Caddy","Optical","WebCam","Battery",null,"BIOS Lock","Caddy","Optical","WebCam","Battery"]
[null,null,{"$f":"VLOOKUP(E2816,INVENTORY!$A$2:$N$100,7,FALSE)","v":{"$error":"#N/A"}},{"$f":"VLOOKUP(E2816,INVENTORY!$A$2:$N$100,8,FALSE)","v":{"$error":"#N/A"}},{"$f":"VLOOKUP(E2816,INVENTORY!$A$2:$N$100,9,FALSE)","v":{"$error":"#N/A"}},{"$nulls":3},{"$f":"VLOOKUP(K2816,INVENTORY!$A$2:$N$100,7,FALSE)","v":{"$error":"#N/A"}},{"$f":"VLOOKUP(K2816,INVENTORY!$A$2:$N$100,8,FALSE)","v":{"$error":"#N/A"}},{"$f":"VLOOKUP(K2816,INVENTORY!$A$2:$N$100,9,FALSE)","v":{"$error":"#N/A"}}]
[]
["CPU Cosmetics Defects:",null,{"$f":"\"Function Code: \"&VLOOKUP(E2816,INVENTORY!$A$2:$Q$100,14,FALSE)","v":{"$error":"#N/A"}},{"$nulls":3},"CPU Cosmetics Defects:",null,{"$f":"\"Function Code: \"&VLOOKUP(K2816,INVENTORY!$A$2:$Q$100,14,FALSE)","v":{"$error":"#N/A"}}]
[]
[null,null,{"$f":"\"Cosmetic Code: \"&VLOOKUP(E2816,INVENTORY!$A$2:$Q$100,15,FALSE)","v":{"$error":"#N/A"}},{"$nulls":5},{"$f":"\"Cosmetic Code: \"&VLOOKUP(K2816,INVENTORY!$A$2:$Q$100,15,FALSE)","v":{"$error":"#N/A"}}]
[]
["Casing","Plugs/Ports",{"$nulls":4},"Casing","Plugs/Ports"]
["Pass","Pass",{"$nulls":4},"Pass","Pass"]
["Fail","Fail",null,"TRRC#:L.T.R.",null,null,"Fail","Fail",null,"TRRC#:L.T.R."]
[]
["LAPTOP TESTING RECORD",{"$nulls":5},"LAPTOP TESTING RECORD"]
[]
[{"$nulls":3},"ITEM #",{"$f":"E2816+2","v":197},{"$nulls":4},"ITEM #",{"$f":"K2816+2","v":198}]
["Tester: ","RR","Date:",{"$f":"NOW()","v":"2025-12-15T11:00:59.760"},null,null,"Tester: ","RR","Date:",{"$f":"NOW()","v":"2025-12-15T11:00:59.760"}]
["Type: ","LAPTOP","SN:",{"$f":"VLOOKUP(E2845,INVENTORYDATA,10,FALSE)","v":{"$error":"#N/A"}},null,null,"Type: ","LAPTOP","SN:",{"$f":"VLOOKUP(K2845,INVENTORYDATA,10,FALSE)","v":{"$error":"#N/A"}}]
[{"$f":"\"Make: \"","v":"Make: "},{"$f":"VLOOKUP(E2845,INVENTORYDATA,2,FALSE)","v":{"$error":"#N/A"}},{"$f":"\"Model: \"","v":"Model: "},{"$f":"VLOOKUP(E2845,INVENTORYDATA,3,FALSE)","v":{"$error":"#N/A"}},null,null,{"$f":"\"Make: \"","v":"Make: "},{"$f":"VLOOKUP(K2845,INVENTORYDATA,2,FALSE)","v":{"$error":"#N/A"}},{"$f":"\"Model: \"","v":"Model: "},{"$f":"VLOOKUP(K2845,INVENTORYDATA,3,FALSE)","v":{"$error":"#N/A"}}]
[{"$f":"\"CPU/Speed: \"","v":"CPU/Speed: "},{"$f":"VLOOKUP(E2845,INVENTORYDATA,4,FALSE)&\" / \"&VLOOKUP(E2845,INVENTORYDATA,5,FALSE)&\"GHz\"","v":{"$error":"#N/A"}},null,{"$f":"\"Memory: \"","v":"Memory: "},{"$f":"VLOOKUP(E2845,INVENTORYDATA,6,FALSE)","v":{"$error":"#N/A"}},null,{"$f":"\"CPU/Speed: \"","v":"CPU/Speed: "},{"$f":"VLOOKUP(K2845,INVENTORYDATA,4,FALSE)&\" / \"&VLOOKUP(K2845,INVENTORYDATA,5,FALSE)&\"GHz\"","v":{"$error":"#N/A"}},null,{"$f":"\"Memory: \"","v":"Memory: "},{"$f":"VLOOKUP(K2845,INVENTORYDATA,6,FALSE)","v":{"$error":"#N/A"}}]
[]
["Key Function",null,"Pass","Fail ","Comments",null,"Key Function",null,"Pass","Fail ","Comments"]
["Hard Drive Removed",null,{"$f":"IF(ISBLANK(VLOOKUP(E2845,INVENTORYDATA,13,FALSE)),\"X\",\"\")","v":""},null,{"$f":"IF(ISBLANK(VLOOKUP(E2845,INVENTORYDATA,13,FALSE)),\"\",VLOOKUP(E2845,INVENTORYDATA,13,FALSE))","v":{"$error":"#N/A"}},null,"Hard Drive Removed",null,{"$f":"IF(ISBLANK(VLOOKUP(K2845,INVENTORYDATA,13,FALSE)),\"X\",\"\")","v":""},null,{"$f":"IF(ISBLANK(VLOOKUP(K2845,INVENTORYDATA,13,FALSE)),\"\",VLOOKUP(K2845,INVENTORYDATA,13,FALSE))","v":{"$error":"#N/A"}}]
["Install Memory",null,"X",{"$nulls":3},"Install Memory",null,"X"]
["Power ON",null,"X",{"$nulls":3},"Power ON",null,"X"]
["Record BIOS info",null,"X",{"$nulls":3},"Record BIOS info",null,"X"]
["Check Optical Drive",null,{"$f":"IF((VLOOKUP(E2845,INVENTORYDATA,7,FALSE))=\"YES\",\"X\",\"\")","v":{"$error":"#N/A"}},{"$f":"IF((VLOOKUP(E2845,INVENTORYDATA,7,FALSE))=\"NO\",\"X\",\"\")","v":{"$error":"#N/A"}},null,null,"Check Optical Drive",null,{"$f":"IF((VLOOKUP(K2845,INVENTORYDATA,7,FALSE))=\"YES\",\"X\",\"\")","v":{"$error":"#N/A"}},{"$f":"IF((VLOOKUP(K2845,INVENTORYDATA,7,FALSE))=\"NO\",\"X\",\"\")","v":{"$error":"#N/A"}}]
["Power Off",null,"X",{"$nulls":3},"Power Off",null,"X"]
["HDD Serial No.",null,{"$f":"IF(ISBLANK(VLOOKUP(E2845,INVENTORYDATA,12,FALSE)),\"\",VLOOKUP(E2845,INVENTORYDATA,12,FALSE))","v":{"$error":"#N/A"}},{"$nulls":3},"HDD Serial No.",null,{"$f":"IF(ISBLANK(VLOOKUP(K2845,INVENTORYDATA,12,FALSE)),\"\",VLOOKUP(K2845,INVENTORYDATA,12,FALSE))","v":{"$error":"#N/A"}}]
[]
["Tested for key functions,R2/Ready for Resale",{"$nulls":5},"Tested for key functions,R2/Ready for Resale"]
["BIOS Lock","Caddy","Optical","WebCam","Battery",null,"BIOS Lock","Caddy","Optical","WebCam","Battery"]
[null,null,{"$f":"VLOOKUP(E2845,INVENTORY!$A$2:$N$100,7,FALSE)","v":{"$error":"#N/A"}},{"$f":"VLOOKUP(E2845,INVENTORY!$A$2:$N$100,8,FALSE)","v":{"$error":"#N/A"}},{"$f":"VLOOKUP(E2845,INVENTORY!$A$2:$N$100,9,FALSE)","v":{"$error":"#N/A"}},{"$nulls":3},{"$f":"VLOOKUP(K2845,INVENTORY!$A$2:$N$100,7,FALSE)","v":{"$error":"#N/A"}},{"$f":"VLOOKUP(K2845,INVENTORY!$A$2:$N$100,8,FALSE)","v":{"$error":"#N/A"}},{"$f":"VLOOKUP(K2845,INVENTORY!$A$2:$N$100,9,FALSE)","v":{"$error":"#N/A"}}]
[]
["CPU Cosmetics Defects:",null,{"$f":"\"Function Code: \"&VLOOKUP(E2845,INVENTORY!$A$2:$Q$100,14,FALSE)","v":{"$error":"#N/A"}},{"$nulls":3},"CPU Cosmetics Defects:",null,{"$f":"\"Function Code: \"&VLOOKUP(K2845,INVENTORY!$A$2:$Q$100,14,FALSE)","v":{"$error":"#N/A"}}]
[]
[null,null,{"$f":"\"Cosmetic Code: \"&VLOOKUP(E2845,INVENTORY!$A$2:$Q$100,15,FALSE)","v":{"$error":"#N/A"}},{"$nulls":5},{"$f":"\"Cosmetic Code: \"&VLOOKUP(K2845,INVENTORY!$A$2:$Q$100,15,FALSE)","v":{"$error":"#N/A"}}]
[]
["Casing","Plugs/Ports",{"$nulls":4},"Casing","Plugs/Ports"]
["Pass","Pass",{"$nulls":4},"Pass","Pass"]
["Fail","Fail",null,"TRRC#:L.T.R.",null,null,"Fail","Fail",null,"TRRC#:L.T.R."]
[]
["LAPTOP TESTING RECORD",{"$nulls":5},"LAPTOP TESTING RECORD"]
[]
[{"$nulls":3},"ITEM #",{"$f":"E2845+2","v":199},{"$nulls":4},"ITEM #",{"$f":"K2845+2","v":200}]
["Tester: ","RR","Date:",{"$f":"NOW()","v":"2025-12-15T11:00:59.760"},null,null,"Tester: ","RR","Date:",{"$f":"NOW()","v":"2025-12-15T11:00:59.760"}]
["Type: ","LAPTOP","SN:",{"$f":"VLOOKUP(E2874,INVENTORYDATA,10,FALSE)","v":{"$error":"#N/A"}},null,null,"Type: ","LAPTOP","SN:",{"$f":"VLOOKUP(K2874,INVENTORYDATA,10,FALSE)","v":{"$error":"#N/A"}}]
[{"$f":"\"Make: \"","v":"Make: "},{"$f":"VLOOKUP(E2874,INVENTORYDATA,2,FALSE)","v":{"$error":"#N/A"}},{"$f":"\"Model: \"","v":"Model: "},{"$f":"VLOOKUP(E2874,INVENTORYDATA,3,FALSE)","v":{"$error":"#N/A"}},null,null,{"$f":"\"Make: \"","v":"Make: "},{"$f":"VLOOKUP(K2874,INVENTORYDATA,2,FALSE)","v":{"$error":"#N/A"}},{"$f":"\"Model: \"","v":"Model: "},{"$f":"VLOOKUP(K2874,INVENTORYDATA,3,FALSE)","v":{"$error":"#N/A"}}]
[{"$f":"\"CPU/Speed: \"","v":"CPU/Speed: "},{"$f":"VLOOKUP(E2874,INVENTORYDATA,4,FALSE)&\" / \"&VLOOKUP(E2874,INVENTORYDATA,5,FALSE)&\"GHz\"","v":{"$error":"#N/A"}},null,{"$f":"\"Memory: \"","v":"Memory: "},{"$f":"VLOOKUP(E2874,INVENTORYDATA,6,FALSE)","v":{"$error":"#N/A"}},null,{"$f":"\"CPU/Speed: \"","v":"CPU/Speed: "},{"$f":"VLOOKUP(K2874,INVENTORYDATA,4,FALSE)&\" / \"&VLOOKUP(K2874,INVENTORYDATA,5,FALSE)&\"GHz\"","v":{"$error":"#N/A"}},null,{"$f":"\"Memory: \"","v":"Memory: "},{"$f":"VLOOKUP(K2874,INVENTORYDATA,6,FALSE)","v":{"$error":"#N/A"}}]
[]
["Key Function",null,"Pass","Fail ","Comments",null,"Key Function",null,"Pass","Fail ","Comments"]
["Hard Drive Removed",null,{"$f":"IF(ISBLANK(VLOOKUP(E2874,INVENTORYDATA,13,FALSE)),\"X\",\"\")","v":""},null,{"$f":"IF(ISBLANK(VLOOKUP(E2874,INVENTORYDATA,13,FALSE)),\"\",VLOOKUP(E2874,INVENTORYDATA,13,FALSE))","v":{"$error":"#N/A"}},null,"Hard Drive Removed",null,{"$f":"IF(ISBLANK(VLOOKUP(K2874,INVENTORYDATA,13,FALSE)),\"X\",\"\")","v":""},null,{"$f":"IF(ISBLANK(VLOOKUP(K2874,INVENTORYDATA,13,FALSE)),\"\",VLOOKUP(K2874,INVENTORYDATA,13,FALSE))","v":{"$error":"#N/A"}}]
["Install Memory",null,"X",{"$nulls":3},"Install Memory",null,"X"]
["Power ON",null,"X",{"$nulls":3},"Power ON",null,"X"]
["Record BIOS info",null,"X",{"$nulls":3},"Record BIOS info",null,"X"]
["Check Optical Drive",null,{"$f":"IF((VLOOKUP(E2874,INVENTORYDATA,7,FALSE))=\"YES\",\"X\",\"\")","v":{"$error":"#N/A"}},{"$f":"IF((VLOOKUP(E2874,INVENTORYDATA,7,FALSE))=\"NO\",\"X\",\"\")","v":{"$error":"#N/A"}},null,null,"Check Optical Drive",null,{"$f":"IF((VLOOKUP(K2874,INVENTORYDATA,7,FALSE))=\"YES\",\"X\",\"\")","v":{"$error":"#N/A"}},{"$f":"IF((VLOOKUP(K2874,INVENTORYDATA,7,FALSE))=\"NO\",\"X\",\"\")","v":{"$error":"#N/A"}}]
["Power Off",null,"X",{"$nulls":3},"Power Off",null,"X"]
["HDD Serial No.",null,{"$f":"IF(ISBLANK(VLOOKUP(E2874,INVENTORYDATA,12,FALSE)),\"\",VLOOKUP(E2874,INVENTORYDATA,12,FALSE))","v":{"$error":"#N/A"}},{"$nulls":3},"HDD Serial No.",null,{"$f":"IF(ISBLANK(VLOOKUP(K2874,INVENTORYDATA,12,FALSE)),\"\",VLOOKUP(K2874,INVENTORYDATA,12,FALSE))","v":{"$error":"#N/A"}}]
[]
["Tested for key functions,R2/Ready for Resale",{"$nulls":5},"Tested for key functions,R2/Ready for Resale"]
["BIOS Lock","Caddy","Optical","WebCam","Battery",null,"BIOS Lock","Caddy","Optical","WebCam","Battery"]
[null,null,{"$f":"VLOOKUP(E2874,INVENTORY!$A$2:$N$100,7,FALSE)","v":{"$error":"#N/A"}},{"$f":"VLOOKUP(E2874,INVENTORY!$A$2:$N$100,8,FALSE)","v":{"$error":"#N/A"}},{"$f":"VLOOKUP(E2874,INVENTORY!$A$2:$N$100,9,FALSE)","v":{"$error":"#N/A"}},{"$nulls":3},{"$f":"VLOOKUP(K2874,INVENTORY!$A$2:$N$100,7,FALSE)","v":{"$error":"#N/A"}},{"$f":"VLOOKUP(K2874,INVENTORY!$A$2:$N$100,8,FALSE)","v":{"$error":"#N/A"}},{"$f":"VLOOKUP(K2874,INVENTORY!$A$2:$N$100,9,FALSE)","v":{"$error":"#N/A"}}]
[]
["CPU Cosmetics Defects:",null,{"$f":"\"Function Code: \"&VLOOKUP(E2874,INVENTORY!$A$2:$Q$100,14,FALSE)","v":{"$error":"#N/A"}},{"$nulls":3},"CPU Cosmetics Defects:",null,{"$f":"\"Function Code: \"&VLOOKUP(K2874,INVENTORY!$A$2:$Q$100,14,FALSE)","v":{"$error":"#N/A"}}]
[]
[null,null,{"$f":"\"Cosmetic Code: \"&VLOOKUP(E2874,INVENTORY!$A$2:$Q$100,15,FALSE)","v":{"$error":"#N/A"}},{"$nulls":5},{"$f":"\"Cosmetic Code: \"&VLOOKUP(K2874,INVENTORY!$A$2:$Q$100,15,FALSE)","v":{"$error":"#N/A"}}]
[]
["Casing","Plugs/Ports",{"$nulls":4},"Casing","Plugs/Ports"]
["Pass","Pass",{"$nulls":4},"Pass","Pass"]
["Fail","Fail",null,"TRRC#:L.T.R.",null,null,"Fail","Fail",null,"TRRC#:L.T.R."]

{"sheet":"TAGS-BLANK","index":4,"n_rows":57,"n_cols":11,"rows_kept":57,"merged":[[0,0,1,4],[0,6,1,10],[8,0,8,1],[8,6,8,7],[9,0,9,1],[9,6,9,7],[10,0,10,1],[10,6,10,7],[11,0,11,1],[11,6,11,7],[12,0,12,1],[12,6,12,7],[13,0,13,1],[13,6,13,7],[14,0,14,1],[14,6,14,7],[15,0,15,1],[15,6,15,7],[16,0,16,1],[16,6,16,7],[17,0,17,4],[17,6,17,10],[21,2,21,4],[21,8,21,10],[22,2,22,4],[22,8,22,10],[23,2,23,4],[23,8,23,10],[27,3,27,4],[27,9,27,10],[29,0,30,4],[29,6,30,10],[37,0,37,1],[37,6,37,7],[38,0,38,1],[38,6,38,7],[39,0,39,1],[39,6,39,7],[40,0,40,1],[40,6,40,7],[41,0,41,1],[41,6,41,7],[42,0,42,1],[42,6,42,7],[43,0,43,1],[43,6,43,7],[44,0,44,1],[44,6,44,7],[45,0,45,1],[45,6,45,7],[46,0,46,4],[46,6,46,10],[50,2,50,4],[50,8,50,10],[51,2,51,4],[51,8,51,10],[52,2,52,4],[52,8,52,10],[56,3,56,4],[56,9,56,10]]}
["LAPTOP TESTING RECORD",{"$nulls":5},"LAPTOP TESTING RECORD"]
[]
[{"$nulls":3},"ITEM #",{"$nulls":5},"ITEM #"]
["Tester: ","RR","Date:",{"$nulls":3},"Tester: ","RR","Date:"]
["Type: ",null,"SN:",{"$nulls":3},"Type: ",null,"SN:"]
[{"$f":"\"Make: \"","v":"Make: "},null,{"$f":"\"Model: \"","v":"Model: "},{"$nulls":3},{"$f":"\"Make: \"","v":"Make: "},null,{"$f":"\"Model: \"","v":"Model: "}]
[{"$f":"\"CPU/Speed: \"","v":"CPU/Speed: "},null,null,{"$f":"\"Memory: \"","v":"Memory: "},null,null,{"$f":"\"CPU/Speed: \"","v":"CPU/Speed: "},null,null,{"$f":"\"Memory: \"","v":"Memory: "}]
[]
["Key Function",null,"Pass","Fail ","Comments",null,"Key Function",null,"Pass","Fail ","Comments"]
["Hard Drive Removed",null,"X",{"$nulls":3},"Hard Drive Removed",null,"X"]
["Install Memory",null,"X",{"$nulls":3},"Install Memory",null,"X"]
["Power ON",null,"X",{"$nulls":3},"Power ON",null,"X"]
["Record BIOS info",null,"X",{"$nulls":3},"Record BIOS info",null,"X"]
["Check Optical Drive",null,"X",{"$nulls":3},"Check Optical Drive",null,"X"]
["Power Off",null,"X",{"$nulls":3},"Power Off",null,"X"]
[]
[]
["Tested for key functions,R2/Ready for Resale",{"$nulls":5},"Tested for key functions,R2/Ready for Resale"]
["BIOS Lock","Caddy","Optical","WedCam","Battery",null,"BIOS Lock","Caddy","Optical","WedCam","Battery"]
[]
[]
["CPU Cosmetics Defects:",null,"Function Code: ",{"$nulls":3},"CPU Cosmetics Defects:",null,"Function Code: "]
[]
[null,null,"Cosmetic Code:",{"$nulls":5},"Cosmetic Code:"]
[]
["Casing","Plugs/Ports",{"$nulls":4},"Casing","Plugs/Ports"]
["Pass","Pass",{"$nulls":4},"Pass","Pass"]
["Fail","Fail",null,"QP-TRRC-0019-01",null,null,"Fail","Fail",null,"QP-TRRC-0019-01"]
[]
["LAPTOP TESTING RECORD",{"$nulls":5},"LAPTOP TESTING RECORD"]
[]
[{"$nulls":3},"ITEM #",{"$nulls":5},"ITEM #"]
["Tester: ","RR","Date:",{"$nulls":3},"Tester: ","RR","Date:"]
["Type: ",null,"SN:",{"$nulls":3},"Type: ",null,"SN:"]
[{"$f":"\"Make: \"","v":"Make: "},null,{"$f":"\"Model: \"","v":"Model: "},{"$nulls":3},{"$f":"\"Make: \"","v":"Make: "},null,{"$f":"\"Model: \"","v":"Model: "}]
[{"$f":"\"CPU/Speed: \"","v":"CPU/Speed: "},null,null,{"$f":"\"Memory: \"","v":"Memory: "},null,null,{"$f":"\"CPU/Speed: \"","v":"CPU/Speed: "},null,null,{"$f":"\"Memory: \"","v":"Memory: "}]
[]
["Key Function",null,"Pass","Fail ","Comments",null,"Key Function",null,"Pass","Fail ","Comments"]
["Hard Drive Removed",null,"X",{"$nulls":3},"Hard Drive Removed",null,"X"]
["Install Memory",null,"X",{"$nulls":3},"Install Memory",null,"X"]
["Power ON",null,"X",{"$nulls":3},"Power ON",null,"X"]
["Record BIOS info",null,"X",{"$nulls":3},"Record BIOS info",null,"X"]
["Check Optical Drive",null,"X",{"$nulls":3},"Check Optical Drive",null,"X"]
["Power Off",null,"X",{"$nulls":3},"Power Off",null,"X"]
[]
[]
["Tested for key functions,R2/Ready for Resale",{"$nulls":5},"Tested for key functions,R2/Ready for Resale"]
["BIOS Lock","Caddy","Optical","WedCam","Battery",null,"BIOS Lock","Caddy","Optical","WedCam","Battery"]
[]
[]
["CPU Cosmetics Defects:",null,"Function Code: ",{"$nulls":3},"CPU Cosmetics Defects:",null,"Function Code: "]
[]
[null,null,"Cosmetic Code:",{"$nulls":5},"Cosmetic Code:"]
[]
["Casing","Plugs/Ports",{"$nulls":4},"Casing","Plugs/Ports"]
["Pass","Pass",{"$nulls":4},"Pass","Pass"]
["Fail","Fail",null,"QP-TRRC-0019-01",null,null,"Fail","Fail",null,"QP-TRRC-0019-01"]

{"sheet":"Data-PULLDOWNS","index":5,"n_rows":22,"n_cols":13,"rows_kept":22}
["First Tag #",1]
["Number of PCs",{"$f":"MAX(INVENTORY!A2:A329)","v":15}]
["Number of Pages",{"$f":"ROUNDUP(B2/4,0)","v":4}]
[]
["To print a specific range of tags, enter the first tag number in \"First Tag #\" and the number of"]
["pages required  (# of tags /4) in \"Number of Pages\""]
["CAUTION: This will overwrite the automatic calculation!"]
[]
[]
[]
["MAKE","MODEL","TYPE PROC.","MEMORY","OPTICAL","WEBCAM","BATTERY","FUNC. CODE","COSMETIC CODE","PRE-SANITIZATION","NON-DATA","HDD SIZE","TYPE"]
["DELL","LATITUDE ","I3-","0G","YES","YES","YES","F1","C2","ENCD","ND","256G","NVMe M.2 - 22MM - 30MM"]
["HP","ELITEBOOK ","I5-","2G","NO","NO","NO","F2","C3",null,null,"512G","NVMe M.2 - 22MM - 42MM"]
["LENOVO","PROBOOK ","I7-","4G","N/A","N/A","N/A","F3","C4",null,null,"1TB","NVMe M.2 - 22MM - 80MM"]
["MSI","PRECISION ","X-","8G",{"$nulls":3},"F4","C5",null,null,"2TB","NVMe M.2 - 22MM - 110MM"]
[null,"XPS","AMD-","16G",{"$nulls":7},"3TB","SATA M.2 - 22MM - 30MM"]
[null,"ZBOOK","I9-","32G",{"$nulls":7},"4TB","SATA M.2 - 22MM - 42MM"]
[null,"NOTEBOOK"]
[null,"IDEAPAD"]
[null,"THINKPAD"]
[null,"TOUGHBOOK"]
[null,"CF-"]